Skip to content
Started by timer
Checking out git https://github.com/adamantine-sim/adamantine into /var/jenkins_home/workspace/adamantine-nightly@script/769419fd3c5a9c81c4beafaeab26398461553595cef1aaea2775372c607f95c5 to read ci/nightly.groovy
Selected Git installation does not exist. Using Default
The recommended git tool is: NONE
using credential e7df5eb2-574e-4ec2-98aa-f2e31f069fb4
 > git rev-parse --resolve-git-dir /var/jenkins_home/workspace/adamantine-nightly@script/769419fd3c5a9c81c4beafaeab26398461553595cef1aaea2775372c607f95c5/.git # timeout=10
Fetching changes from the remote Git repository
 > git config remote.origin.url https://github.com/adamantine-sim/adamantine # timeout=10
Fetching upstream changes from https://github.com/adamantine-sim/adamantine
 > git --version # timeout=10
 > git --version # 'git version 2.47.3'
using GIT_ASKPASS to set credentials Jenkins Bruno
 > git fetch --tags --force --progress -- https://github.com/adamantine-sim/adamantine +refs/heads/*:refs/remotes/origin/* # timeout=10
 > git rev-parse refs/remotes/origin/master^{commit} # timeout=10
Checking out Revision af83a18e9acfbd7e14c7f08e143bf9c9cf75b27a (refs/remotes/origin/master)
 > git config core.sparsecheckout # timeout=10
 > git checkout -f af83a18e9acfbd7e14c7f08e143bf9c9cf75b27a # timeout=10
Commit message: "Merge pull request #414 from colemanjs/gaussian-heat-source"
 > git rev-list --no-walk af83a18e9acfbd7e14c7f08e143bf9c9cf75b27a # timeout=10
[Pipeline] Start of Pipeline
[Pipeline] withEnv
[Pipeline] {
[Pipeline] timeout
Timeout set to expire in 6 hr 0 min
[Pipeline] {
[Pipeline] stage
[Pipeline] { (Test)
[Pipeline] parallel
[Pipeline] { (Branch: CPU)
[Pipeline] { (Branch: CUDA)
[Pipeline] stage
[Pipeline] { (CPU)
[Pipeline] stage
[Pipeline] { (CUDA)
[Pipeline] node
Running on villars06 in /var/jenkins/workspace/adamantine-nightly
[Pipeline] node
Running on waffle_03 in /var/jenkins/workspace/adamantine-nightly
[Pipeline] {
[Pipeline] {
[Pipeline] checkout
Selected Git installation does not exist. Using Default
The recommended git tool is: NONE
[Pipeline] checkout
Selected Git installation does not exist. Using Default
The recommended git tool is: NONE
using credential e7df5eb2-574e-4ec2-98aa-f2e31f069fb4
using credential e7df5eb2-574e-4ec2-98aa-f2e31f069fb4
Fetching changes from the remote Git repository
Fetching changes from the remote Git repository
Checking out Revision af83a18e9acfbd7e14c7f08e143bf9c9cf75b27a (refs/remotes/origin/master)
Commit message: "Merge pull request #414 from colemanjs/gaussian-heat-source"
[Pipeline] withEnv
[Pipeline] {
Checking out Revision af83a18e9acfbd7e14c7f08e143bf9c9cf75b27a (refs/remotes/origin/master)
Commit message: "Merge pull request #414 from colemanjs/gaussian-heat-source"
 > git rev-parse --resolve-git-dir /var/jenkins/workspace/adamantine-nightly/.git # timeout=10
 > git config remote.origin.url https://github.com/adamantine-sim/adamantine # timeout=10
Fetching upstream changes from https://github.com/adamantine-sim/adamantine
 > git --version # timeout=10
 > git --version # 'git version 2.43.0'
using GIT_ASKPASS to set credentials Jenkins Bruno
 > git fetch --tags --force --progress -- https://github.com/adamantine-sim/adamantine +refs/heads/*:refs/remotes/origin/* # timeout=10
 > git rev-parse refs/remotes/origin/master^{commit} # timeout=10
 > git config core.sparsecheckout # timeout=10
 > git checkout -f af83a18e9acfbd7e14c7f08e143bf9c9cf75b27a # timeout=10
[Pipeline] withEnv
[Pipeline] {
[Pipeline] isUnix
[Pipeline] withEnv
[Pipeline] {
[Pipeline] sh
[Pipeline] isUnix
[Pipeline] withEnv
[Pipeline] {
[Pipeline] sh
 > git rev-parse --resolve-git-dir /var/jenkins/workspace/adamantine-nightly/.git # timeout=10
 > git config remote.origin.url https://github.com/adamantine-sim/adamantine # timeout=10
Fetching upstream changes from https://github.com/adamantine-sim/adamantine
 > git --version # timeout=10
 > git --version # 'git version 2.43.0'
using GIT_ASKPASS to set credentials Jenkins Bruno
 > git fetch --tags --force --progress -- https://github.com/adamantine-sim/adamantine +refs/heads/*:refs/remotes/origin/* # timeout=10
 > git rev-parse refs/remotes/origin/master^{commit} # timeout=10
 > git config core.sparsecheckout # timeout=10
 > git checkout -f af83a18e9acfbd7e14c7f08e143bf9c9cf75b27a # timeout=10
+ docker inspect -f . rombur/adamantine-stack:no_gpu-latest

Error: No such object: rombur/adamantine-stack:no_gpu-latest
[Pipeline] isUnix
[Pipeline] withEnv
[Pipeline] {
+ docker inspect -f . rombur/adamantine-stack:latest
.
[Pipeline] }
[Pipeline] // withEnv
[Pipeline] withDockerContainer
waffle_03 seems to be running inside container daa99e55da37fa2c354e94f8172f806e870e5120fcd541af9c372a488de6c8b6
$ docker run -t -d -u 0:0 -w /var/jenkins/workspace/adamantine-nightly --volumes-from daa99e55da37fa2c354e94f8172f806e870e5120fcd541af9c372a488de6c8b6 -e ******** -e ******** -e ******** -e ******** -e ******** -e ******** -e ******** -e ******** -e ******** -e ******** -e ******** -e ******** -e ******** -e ******** -e ******** -e ******** -e ******** -e ******** -e ******** -e ******** -e ******** -e ******** -e ******** -e ******** -e ******** -e ******** -e ******** -e ******** -e ******** -e ******** -e ******** -e ******** -e ******** -e ******** -e ******** rombur/adamantine-stack:latest cat
$ docker top 2a2bb63f798223109ab975c9f066e871b69b5dac43f80f3a0f311b1ca47fc807 -eo pid,comm
ERROR: The container started but didn't run the expected command. Please double check your ENTRYPOINT does execute the command passed as docker run argument, as required by official docker images (see https://github.com/docker-library/official-images#consistency for entrypoint consistency requirements).
Alternatively you can force image entrypoint to be disabled by adding option `--entrypoint=''`.
[Pipeline] {
[Pipeline] sh
[Pipeline] withEnv
[Pipeline] {
[Pipeline] sh
+ docker pull rombur/adamantine-stack:no_gpu-latest
+ rm -rf build
no_gpu-latest: Pulling from rombur/adamantine-stack
446ca34efb63: Pulling fs layer
825dd425294d: Pulling fs layer
e60233229ed7: Pulling fs layer
a68c034c7713: Pulling fs layer
aea17b16bd8b: Pulling fs layer
55ec83d4f55f: Pulling fs layer
9c6e7aeedfcb: Pulling fs layer
92cf3b14fc15: Pulling fs layer
3ee1be183cf2: Pulling fs layer
39af785332aa: Pulling fs layer
1961297b7efe: Pulling fs layer
933d5c4bb047: Pulling fs layer
099ba452fa3d: Pulling fs layer
b4e688b794f2: Pulling fs layer
68186a80352e: Pulling fs layer
f124fcc6db97: Pulling fs layer
18ceb10bf31b: Pulling fs layer
d1fbec07a2e5: Pulling fs layer
825dd425294d: Download complete
55ec83d4f55f: Download complete
aea17b16bd8b: Download complete
e60233229ed7: Download complete
3ee1be183cf2: Download complete
446ca34efb63: Download complete
92cf3b14fc15: Download complete
+ mkdir -p build
[Pipeline] dir
Running in /var/jenkins/workspace/adamantine-nightly/build
[Pipeline] {
[Pipeline] sh
1961297b7efe: Download complete
933d5c4bb047: Download complete
a68c034c7713: Download complete
-- Using the deal.II-9.6.2 installation found at /opt/dealii
-- Include macro /opt/dealii/share/deal.II/macros/macro_deal_ii_add_test.cmake
-- Include macro /opt/dealii/share/deal.II/macros/macro_deal_ii_initialize_cached_variables.cmake
-- Include macro /opt/dealii/share/deal.II/macros/macro_deal_ii_invoke_autopilot.cmake
-- Include macro /opt/dealii/share/deal.II/macros/macro_deal_ii_pickup_tests.cmake
-- Include macro /opt/dealii/share/deal.II/macros/macro_deal_ii_query_git_information.cmake
-- Include macro /opt/dealii/share/deal.II/macros/macro_deal_ii_setup_target.cmake
-- Include macro /opt/dealii/share/deal.II/macros/macro_shell_escape_option_groups.cmake
-- Include macro /opt/dealii/share/deal.II/macros/macro_target_compile_flags.cmake
-- Include macro /opt/dealii/share/deal.II/macros/macro_target_link_flags.cmake
-- The CXX compiler identification is GNU 13.3.0
-- Detecting CXX compiler ABI info
-- Detecting CXX compiler ABI info - done
-- Check for working CXX compiler: /opt/trilinos/bin/nvcc_wrapper - skipped
-- Detecting CXX compile features
-- Detecting CXX compile features - done
099ba452fa3d: Download complete
f124fcc6db97: Download complete
d1fbec07a2e5: Download complete
68186a80352e: Download complete
b4e688b794f2: Download complete
18ceb10bf31b: Download complete
39af785332aa: Download complete
d1fbec07a2e5: Pull complete
55ec83d4f55f: Pull complete
3ee1be183cf2: Pull complete
446ca34efb63: Pull complete
92cf3b14fc15: Pull complete
-- Found MPI_CXX: /usr/lib/x86_64-linux-gnu/openmpi/lib/libmpi_cxx.so (found version "3.1") 
-- Found MPI: TRUE (found version "3.1")  
-- Found Boost: /usr/lib/x86_64-linux-gnu/cmake/Boost-1.83.0/BoostConfig.cmake (found suitable version "1.83.0", minimum required is "1.70.0") found components: chrono program_options timer unit_test_framework 
-- Build type: Debug
-- Configuring done (9.3s)
-- Generating done (2.1s)
-- Build files have been written to: /var/jenkins/workspace/adamantine-nightly/build
[Pipeline] sh
9c6e7aeedfcb: Download complete
+ make -j8
[  0%] Copying amr_test.info
[  1%] Copying analytical_1D_transient.py
[  2%] Building CXX object source/CMakeFiles/Adamantine.dir/BodyForce.cc.o
[  3%] Copying bare_plate_L_da_aug_ref_log.txt
[  3%] Copying bare_plate_L_da_augmented.info
[  4%] Copying bare_plate_L_da_aug_ref_data_0_0.csv
[  4%] Copying bare_plate_L_da.info
[  4%] Copying bare_plate_L_da_aug_ref_data_0_1.csv
[  4%] Built target _var_jenkins_workspace_adamantine-nightly_build_bin_amr_test.info
[  4%] Built target _var_jenkins_workspace_adamantine-nightly_build_bin_bare_plate_L_da_aug_ref_log.txt
[  4%] Built target _var_jenkins_workspace_adamantine-nightly_build_bin_analytical_1D_transient.py
[  4%] Built target _var_jenkins_workspace_adamantine-nightly_build_bin_bare_plate_L_da.info
[  4%] Built target _var_jenkins_workspace_adamantine-nightly_build_bin_bare_plate_L_da_augmented.info
[  4%] Built target _var_jenkins_workspace_adamantine-nightly_build_bin_bare_plate_L_da_aug_ref_data_0_1.csv
[  4%] Built target _var_jenkins_workspace_adamantine-nightly_build_bin_bare_plate_L_da_aug_ref_data_0_0.csv
[  4%] Copying bare_plate_L_ensemble.info
[  5%] Building CXX object source/CMakeFiles/Adamantine.dir/CubeHeatSource.cc.o
[  5%] Building CXX object source/CMakeFiles/Adamantine.dir/Boundary.cc.o
[  6%] Copying bare_plate_L_expt_data_0_0.csv
[  6%] Copying bare_plate_L_expt_data_0_1.csv
[  7%] Copying bare_plate_L_expt_log.txt
[  8%] Copying bare_plate_L_scan_path.txt
[  8%] Built target _var_jenkins_workspace_adamantine-nightly_build_bin_bare_plate_L_ensemble.info
[  8%] Built target _var_jenkins_workspace_adamantine-nightly_build_bin_bare_plate_L_expt_data_0_0.csv
[  8%] Built target _var_jenkins_workspace_adamantine-nightly_build_bin_bare_plate_L_expt_data_0_1.csv
[  8%] Built target _var_jenkins_workspace_adamantine-nightly_build_bin_bare_plate_L_expt_log.txt
[  8%] Copying bare_plate_L_scan_path_fast.txt
[  8%] Built target _var_jenkins_workspace_adamantine-nightly_build_bin_bare_plate_L_scan_path.txt
[  9%] Building CXX object source/CMakeFiles/Adamantine.dir/ElectronBeamHeatSource.cc.o
[  9%] Building CXX object source/CMakeFiles/Adamantine.dir/DataAssimilator.cc.o
[ 10%] Copying convective_bc_gold.txt
[ 10%] Copying demo_316_short.info
[ 10%] Built target _var_jenkins_workspace_adamantine-nightly_build_bin_bare_plate_L_scan_path_fast.txt
[ 10%] Built target _var_jenkins_workspace_adamantine-nightly_build_bin_convective_bc_gold.txt
[ 11%] Built target _var_jenkins_workspace_adamantine-nightly_build_bin_demo_316_short.info
[ 11%] Copying demo_316_short_amr.info
[ 12%] Copying demo_316_short_anisotropic.info
[ 12%] Copying demo_316_short_scan_path.txt
[ 12%] Built target _var_jenkins_workspace_adamantine-nightly_build_bin_demo_316_short_amr.info
[ 12%] Built target _var_jenkins_workspace_adamantine-nightly_build_bin_demo_316_short_anisotropic.info
[ 12%] Built target _var_jenkins_workspace_adamantine-nightly_build_bin_demo_316_short_scan_path.txt
[ 14%] Building CXX object source/CMakeFiles/Adamantine.dir/GaussianHeatSource.cc.o
[ 14%] Copying demo_316_short_scan_path_amr.txt
[ 14%] Copying experiment_log_test.txt
[ 14%] Built target _var_jenkins_workspace_adamantine-nightly_build_bin_demo_316_short_scan_path_amr.txt
[ 14%] Built target _var_jenkins_workspace_adamantine-nightly_build_bin_experiment_log_test.txt
[ 15%] Copying experimental_data_0_0.csv
[ 16%] Copying extruded_cube.msh
[ 16%] Built target _var_jenkins_workspace_adamantine-nightly_build_bin_experimental_data_0_0.csv
[ 16%] Built target _var_jenkins_workspace_adamantine-nightly_build_bin_extruded_cube.msh
[ 16%] Copying hexahedra.msh
[ 16%] Copying five_axis.info
[ 16%] Built target _var_jenkins_workspace_adamantine-nightly_build_bin_hexahedra.msh
[ 16%] Built target _var_jenkins_workspace_adamantine-nightly_build_bin_five_axis.info
[ 17%] Copying five_axis_scan_path.txt
[ 18%] Copying HourGlass_AOP.info
[ 18%] Built target _var_jenkins_workspace_adamantine-nightly_build_bin_five_axis_scan_path.txt
[ 18%] Built target _var_jenkins_workspace_adamantine-nightly_build_bin_HourGlass_AOP.info
[ 18%] Copying HourGlass_AOP.vtk
[ 19%] Copying HourGlass_AOP_scan_path.txt
[ 19%] Built target _var_jenkins_workspace_adamantine-nightly_build_bin_HourGlass_AOP.vtk
[ 19%] Built target _var_jenkins_workspace_adamantine-nightly_build_bin_HourGlass_AOP_scan_path.txt
[ 20%] Copying integration_2d.info
[ 21%] Copying integration_2d_ensemble.info
[ 21%] Built target _var_jenkins_workspace_adamantine-nightly_build_bin_integration_2d.info
[ 21%] Built target _var_jenkins_workspace_adamantine-nightly_build_bin_integration_2d_ensemble.info
[ 21%] Copying integration_2d_gold.txt
[ 22%] Copying integration_2d_units.info
[ 22%] Built target _var_jenkins_workspace_adamantine-nightly_build_bin_integration_2d_gold.txt
[ 22%] Built target _var_jenkins_workspace_adamantine-nightly_build_bin_integration_2d_units.info
[ 22%] Copying integration_3d_gold.txt
[ 23%] Copying integration_3d_gold_0.txt
[ 23%] Built target _var_jenkins_workspace_adamantine-nightly_build_bin_integration_3d_gold.txt
[ 23%] Built target _var_jenkins_workspace_adamantine-nightly_build_bin_integration_3d_gold_0.txt
[ 24%] Copying integration_3d_gold_1.txt
[ 24%] Copying integration_3d_gold_five_axis.txt
[ 24%] Built target _var_jenkins_workspace_adamantine-nightly_build_bin_integration_3d_gold_1.txt
[ 24%] Built target _var_jenkins_workspace_adamantine-nightly_build_bin_integration_3d_gold_five_axis.txt
[ 25%] Copying integration_3d_gold_five_axis_0.txt
[ 25%] Copying integration_3d_gold_five_axis_1.txt
[ 25%] Built target _var_jenkins_workspace_adamantine-nightly_build_bin_integration_3d_gold_five_axis_1.txt
[ 25%] Built target _var_jenkins_workspace_adamantine-nightly_build_bin_integration_3d_gold_five_axis_0.txt
[ 26%] Building CXX object source/CMakeFiles/Adamantine.dir/Geometry.cc.o
[ 26%] Building CXX object source/CMakeFiles/Adamantine.dir/GoldakHeatSource.cc.o
aea17b16bd8b: Pull complete
1961297b7efe: Pull complete
933d5c4bb047: Pull complete
39af785332aa: Pull complete
[ 27%] Building CXX object source/CMakeFiles/Adamantine.dir/MaterialPropertyInstDev.cc.o
[ 27%] Building CXX object source/CMakeFiles/Adamantine.dir/MaterialPropertyInstHost.cc.o
[ 28%] Building CXX object source/CMakeFiles/Adamantine.dir/MechanicalOperator.cc.o
[ 29%] Building CXX object source/CMakeFiles/Adamantine.dir/MechanicalPhysics.cc.o
[ 29%] Building CXX object source/CMakeFiles/Adamantine.dir/Microstructure.cc.o
f124fcc6db97: Pull complete
9c6e7aeedfcb: Pull complete
[ 30%] Building CXX object source/CMakeFiles/Adamantine.dir/PointCloud.cc.o
825dd425294d: Pull complete
68186a80352e: Pull complete
b4e688b794f2: Pull complete
18ceb10bf31b: Pull complete
e60233229ed7: Pull complete
099ba452fa3d: Pull complete
[ 30%] Building CXX object source/CMakeFiles/Adamantine.dir/PostProcessor.cc.o
a68c034c7713: Pull complete
Digest: sha256:caaad5b827b7dcec3faa87abaca261e0311d74b2d1a8d6ec065a5116705d5aa5
Status: Downloaded newer image for rombur/adamantine-stack:no_gpu-latest
docker.io/rombur/adamantine-stack:no_gpu-latest
[Pipeline] }
[Pipeline] // withEnv
[Pipeline] }
[Pipeline] // withEnv
[Pipeline] withDockerContainer
villars06 seems to be running inside container a05ebda3162f2ae1438610fbc16de2baa1ca05e0931dc02fefe66acdba6d2519
$ docker run -t -d -u 0:0 -w /var/jenkins/workspace/adamantine-nightly --volumes-from a05ebda3162f2ae1438610fbc16de2baa1ca05e0931dc02fefe66acdba6d2519 -e ******** -e ******** -e ******** -e ******** -e ******** -e ******** -e ******** -e ******** -e ******** -e ******** -e ******** -e ******** -e ******** -e ******** -e ******** -e ******** -e ******** -e ******** -e ******** -e ******** -e ******** -e ******** -e ******** -e ******** -e ******** -e ******** -e ******** -e ******** -e ******** -e ******** -e ******** -e ******** -e ******** -e ******** -e ******** rombur/adamantine-stack:no_gpu-latest cat
$ docker top c214911500d34fe91bd884febfc8e59639dc1bec5a3303655df5b7987c874aa1 -eo pid,comm
[Pipeline] {
[Pipeline] withEnv
[Pipeline] {
[Pipeline] sh
+ rm -rf build
+ mkdir -p build
[Pipeline] dir
Running in /var/jenkins/workspace/adamantine-nightly/build
[Pipeline] {
[Pipeline] sh
[ 31%] Building CXX object source/CMakeFiles/Adamantine.dir/Quaternion.cc.o
-- Using the deal.II-9.6.2 installation found at /opt/dealii
-- Include macro /opt/dealii/share/deal.II/macros/macro_deal_ii_add_test.cmake
-- Include macro /opt/dealii/share/deal.II/macros/macro_deal_ii_initialize_cached_variables.cmake
-- Include macro /opt/dealii/share/deal.II/macros/macro_deal_ii_invoke_autopilot.cmake
-- Include macro /opt/dealii/share/deal.II/macros/macro_deal_ii_pickup_tests.cmake
-- Include macro /opt/dealii/share/deal.II/macros/macro_deal_ii_query_git_information.cmake
-- Include macro /opt/dealii/share/deal.II/macros/macro_deal_ii_setup_target.cmake
-- Include macro /opt/dealii/share/deal.II/macros/macro_shell_escape_option_groups.cmake
-- Include macro /opt/dealii/share/deal.II/macros/macro_target_compile_flags.cmake
-- Include macro /opt/dealii/share/deal.II/macros/macro_target_link_flags.cmake
-- The CXX compiler identification is GNU 13.3.0
-- Detecting CXX compiler ABI info
-- Detecting CXX compiler ABI info - done
-- Check for working CXX compiler: /usr/bin/c++ - skipped
-- Detecting CXX compile features
-- Detecting CXX compile features - done
-- Found MPI_CXX: /usr/lib/x86_64-linux-gnu/openmpi/lib/libmpi_cxx.so (found version "3.1") 
-- Found MPI: TRUE (found version "3.1")  
-- Found Boost: /usr/lib/x86_64-linux-gnu/cmake/Boost-1.83.0/BoostConfig.cmake (found suitable version "1.83.0", minimum required is "1.70.0") found components: chrono program_options timer unit_test_framework 
-- Found Adiak: /opt/adiak/lib/cmake/adiak
-- Found Caliper: /opt/caliper/share/cmake/caliper
-- Build type: Debug
-- Configuring done (1.3s)
-- Generating done (1.1s)
-- Build files have been written to: /var/jenkins/workspace/adamantine-nightly/build
[Pipeline] sh
+ make -j8
[  1%] Copying amr_test.info
[  1%] Copying bare_plate_L_da.info
[  1%] Copying analytical_1D_transient.py
[  2%] Copying bare_plate_L_da_aug_ref_data_0_1.csv
[  2%] Building CXX object source/CMakeFiles/Adamantine.dir/BodyForce.cc.o
[  4%] Copying bare_plate_L_da_aug_ref_data_0_0.csv
[  4%] Copying bare_plate_L_da_augmented.info
[  4%] Copying bare_plate_L_da_aug_ref_log.txt
[  4%] Built target _var_jenkins_workspace_adamantine-nightly_build_bin_bare_plate_L_da.info
[  4%] Built target _var_jenkins_workspace_adamantine-nightly_build_bin_analytical_1D_transient.py
[  4%] Built target _var_jenkins_workspace_adamantine-nightly_build_bin_amr_test.info
[  4%] Built target _var_jenkins_workspace_adamantine-nightly_build_bin_bare_plate_L_da_aug_ref_log.txt
[  4%] Built target _var_jenkins_workspace_adamantine-nightly_build_bin_bare_plate_L_da_aug_ref_data_0_1.csv
[  4%] Built target _var_jenkins_workspace_adamantine-nightly_build_bin_bare_plate_L_da_aug_ref_data_0_0.csv
[  4%] Built target _var_jenkins_workspace_adamantine-nightly_build_bin_bare_plate_L_da_augmented.info
[  5%] Building CXX object source/CMakeFiles/Adamantine.dir/Boundary.cc.o
[  6%] Building CXX object source/CMakeFiles/Adamantine.dir/CubeHeatSource.cc.o
[  6%] Building CXX object source/CMakeFiles/Adamantine.dir/DataAssimilator.cc.o
[  6%] Copying bare_plate_L_ensemble.info
[  7%] Copying bare_plate_L_expt_data_0_0.csv
[  7%] Copying bare_plate_L_expt_data_0_1.csv
[  8%] Copying bare_plate_L_expt_log.txt
[  8%] Built target _var_jenkins_workspace_adamantine-nightly_build_bin_bare_plate_L_ensemble.info
[  8%] Built target _var_jenkins_workspace_adamantine-nightly_build_bin_bare_plate_L_expt_data_0_0.csv
[  8%] Built target _var_jenkins_workspace_adamantine-nightly_build_bin_bare_plate_L_expt_data_0_1.csv
[  8%] Built target _var_jenkins_workspace_adamantine-nightly_build_bin_bare_plate_L_expt_log.txt
[  9%] Copying bare_plate_L_scan_path.txt
[  9%] Copying bare_plate_L_scan_path_fast.txt
[ 10%] Copying convective_bc_gold.txt
[ 10%] Copying demo_316_short.info
[ 10%] Built target _var_jenkins_workspace_adamantine-nightly_build_bin_bare_plate_L_scan_path_fast.txt
[ 10%] Built target _var_jenkins_workspace_adamantine-nightly_build_bin_bare_plate_L_scan_path.txt
[ 10%] Building CXX object source/CMakeFiles/Adamantine.dir/ElectronBeamHeatSource.cc.o
[ 10%] Built target _var_jenkins_workspace_adamantine-nightly_build_bin_convective_bc_gold.txt
[ 10%] Built target _var_jenkins_workspace_adamantine-nightly_build_bin_demo_316_short.info
[ 11%] Copying demo_316_short_amr.info
[ 12%] Copying demo_316_short_anisotropic.info
[ 12%] Copying demo_316_short_scan_path.txt
[ 12%] Built target _var_jenkins_workspace_adamantine-nightly_build_bin_demo_316_short_amr.info
[ 12%] Built target _var_jenkins_workspace_adamantine-nightly_build_bin_demo_316_short_anisotropic.info
[ 12%] Built target _var_jenkins_workspace_adamantine-nightly_build_bin_demo_316_short_scan_path.txt
[ 13%] Copying demo_316_short_scan_path_amr.txt
[ 14%] Building CXX object source/CMakeFiles/Adamantine.dir/GaussianHeatSource.cc.o
[ 14%] Copying experiment_log_test.txt
[ 14%] Built target _var_jenkins_workspace_adamantine-nightly_build_bin_demo_316_short_scan_path_amr.txt
[ 14%] Built target _var_jenkins_workspace_adamantine-nightly_build_bin_experiment_log_test.txt
[ 15%] Building CXX object source/CMakeFiles/Adamantine.dir/GoldakHeatSource.cc.o
[ 15%] Building CXX object source/CMakeFiles/Adamantine.dir/Geometry.cc.o
[ 16%] Building CXX object source/CMakeFiles/Adamantine.dir/MaterialPropertyInstDev.cc.o
[ 16%] Building CXX object source/CMakeFiles/Adamantine.dir/MaterialPropertyInstHost.cc.o
[ 17%] Building CXX object source/CMakeFiles/Adamantine.dir/MechanicalOperator.cc.o
[ 18%] Building CXX object source/CMakeFiles/Adamantine.dir/MechanicalPhysics.cc.o
[ 18%] Building CXX object source/CMakeFiles/Adamantine.dir/Microstructure.cc.o
[ 19%] Building CXX object source/CMakeFiles/Adamantine.dir/PointCloud.cc.o
[ 32%] Building CXX object source/CMakeFiles/Adamantine.dir/RayTracing.cc.o
[ 19%] Building CXX object source/CMakeFiles/Adamantine.dir/PostProcessor.cc.o
[ 20%] Building CXX object source/CMakeFiles/Adamantine.dir/Quaternion.cc.o
[ 21%] Building CXX object source/CMakeFiles/Adamantine.dir/RayTracing.cc.o
[ 21%] Building CXX object source/CMakeFiles/Adamantine.dir/ScanPath.cc.o
[ 32%] Building CXX object source/CMakeFiles/Adamantine.dir/ScanPath.cc.o
[ 22%] Building CXX object source/CMakeFiles/Adamantine.dir/ThermalOperatorInstSHost.cc.o
[ 22%] Building CXX object source/CMakeFiles/Adamantine.dir/ThermalOperatorInstSLHost.cc.o
[ 33%] Building CXX object source/CMakeFiles/Adamantine.dir/ThermalOperatorInstSHost.cc.o
[ 23%] Building CXX object source/CMakeFiles/Adamantine.dir/ThermalOperatorInstSLPHost.cc.o
In file included from /var/jenkins/workspace/adamantine-nightly/source/MechanicalOperator.cc:6:
/var/jenkins/workspace/adamantine-nightly/source/instantiation.hh:54:44: fatal error: error writing to /tmp/ccGTodQ7.s: No space left on device
   54 |               dealii::MemorySpace::Default>;
      |                                            ^
/usr/include/boost/preprocessor/seq/for_each_product.hpp:62:71: note: in expansion of macro 'ADAMANTINE_D_N_P_M_DEV'
   62 | # define BOOST_PP_SEQ_FOR_EACH_PRODUCT_I_I(r, cset, rset, res, macro) macro(r, BOOST_PP_SEQ_TAIL(res (BOOST_PP_SEQ_HEAD(cset))))
      |                                                                       ^~~~~
/var/jenkins/workspace/adamantine-nightly/source/MechanicalOperator.cc:488:1: note: in expansion of macro 'INSTANTIATE_DIM_NMAT_PORDER_MATERIALSTATES_DEVICE'
  488 | INSTANTIATE_DIM_NMAT_PORDER_MATERIALSTATES_DEVICE(MechanicalOperator)
      | ^~~~~~~~~~~~~~~~~~~~~~~~~~~~~~~~~~~~~~~~~~~~~~~~~
compilation terminated.
make[2]: *** [source/CMakeFiles/Adamantine.dir/build.make:216: source/CMakeFiles/Adamantine.dir/MechanicalOperator.cc.o] Error 1
make[2]: *** Waiting for unfinished jobs....
[ 24%] Copying experimental_data_0_0.csv
[ 24%] Built target _var_jenkins_workspace_adamantine-nightly_build_bin_experimental_data_0_0.csv
[ 25%] Copying extruded_cube.msh
[ 25%] Built target _var_jenkins_workspace_adamantine-nightly_build_bin_extruded_cube.msh
[ 25%] Copying hexahedra.msh
[ 25%] Built target _var_jenkins_workspace_adamantine-nightly_build_bin_hexahedra.msh
[ 25%] Copying five_axis.info
[ 25%] Built target _var_jenkins_workspace_adamantine-nightly_build_bin_five_axis.info
[ 26%] Copying five_axis_scan_path.txt
[ 26%] Built target _var_jenkins_workspace_adamantine-nightly_build_bin_five_axis_scan_path.txt
[ 27%] Copying HourGlass_AOP.info
[ 27%] Built target _var_jenkins_workspace_adamantine-nightly_build_bin_HourGlass_AOP.info
[ 27%] Copying HourGlass_AOP.vtk
[ 27%] Built target _var_jenkins_workspace_adamantine-nightly_build_bin_HourGlass_AOP.vtk
[ 28%] Copying HourGlass_AOP_scan_path.txt
[ 28%] Built target _var_jenkins_workspace_adamantine-nightly_build_bin_HourGlass_AOP_scan_path.txt
[ 29%] Copying integration_2d.info
[ 29%] Built target _var_jenkins_workspace_adamantine-nightly_build_bin_integration_2d.info
[ 30%] Copying integration_2d_ensemble.info
[ 30%] Built target _var_jenkins_workspace_adamantine-nightly_build_bin_integration_2d_ensemble.info
[ 30%] Copying integration_2d_gold.txt
[ 30%] Built target _var_jenkins_workspace_adamantine-nightly_build_bin_integration_2d_gold.txt
[ 31%] Copying integration_2d_units.info
[ 31%] Built target _var_jenkins_workspace_adamantine-nightly_build_bin_integration_2d_units.info
[ 31%] Copying integration_3d_gold.txt
[ 31%] Built target _var_jenkins_workspace_adamantine-nightly_build_bin_integration_3d_gold.txt
[ 32%] Copying integration_3d_gold_0.txt
[ 32%] Built target _var_jenkins_workspace_adamantine-nightly_build_bin_integration_3d_gold_0.txt
[ 33%] Copying integration_3d_gold_1.txt
[ 33%] Built target _var_jenkins_workspace_adamantine-nightly_build_bin_integration_3d_gold_1.txt
[ 33%] Copying integration_3d_gold_five_axis.txt
[ 33%] Built target _var_jenkins_workspace_adamantine-nightly_build_bin_integration_3d_gold_five_axis.txt
[ 34%] Copying integration_3d_gold_five_axis_0.txt
[ 34%] Built target _var_jenkins_workspace_adamantine-nightly_build_bin_integration_3d_gold_five_axis_0.txt
[ 34%] Copying integration_3d_gold_five_axis_1.txt
[ 34%] Built target _var_jenkins_workspace_adamantine-nightly_build_bin_integration_3d_gold_five_axis_1.txt
[ 35%] Copying integration_3d_gold_short.txt
[ 35%] Built target _var_jenkins_workspace_adamantine-nightly_build_bin_integration_3d_gold_short.txt
[ 35%] Copying integration_3d_gold_short_0.txt
[ 35%] Built target _var_jenkins_workspace_adamantine-nightly_build_bin_integration_3d_gold_short_0.txt
[ 36%] Copying integration_3d_gold_short_1.txt
[ 36%] Built target _var_jenkins_workspace_adamantine-nightly_build_bin_integration_3d_gold_short_1.txt
[ 37%] Copying integration_da_add_material.info
[ 37%] Built target _var_jenkins_workspace_adamantine-nightly_build_bin_integration_da_add_material.info
[ 37%] Copying integration_da_add_material_expt_log.txt
[ 37%] Built target _var_jenkins_workspace_adamantine-nightly_build_bin_integration_da_add_material_expt_log.txt
[ 38%] Copying integration_da_add_material_expt_pc_0_0.csv
[ 38%] Built target _var_jenkins_workspace_adamantine-nightly_build_bin_integration_da_add_material_expt_pc_0_0.csv
[ 38%] Copying integration_da_add_material_expt_ray_0_0.csv
[ 38%] Built target _var_jenkins_workspace_adamantine-nightly_build_bin_integration_da_add_material_expt_ray_0_0.csv
[ 39%] Copying integration_da_add_material_sp.txt
[ 39%] Built target _var_jenkins_workspace_adamantine-nightly_build_bin_integration_da_add_material_sp.txt
[ 40%] Copying material_deposition_2d.txt
[ 40%] Built target _var_jenkins_workspace_adamantine-nightly_build_bin_material_deposition_2d.txt
[ 40%] Copying material_deposition_3d.txt
[ 40%] Built target _var_jenkins_workspace_adamantine-nightly_build_bin_material_deposition_3d.txt
[ 41%] Copying material_path_test_material_deposition.txt
[ 41%] Built target _var_jenkins_workspace_adamantine-nightly_build_bin_material_path_test_material_deposition.txt
[ 41%] Copying material_property_polynomial.info
[ 41%] Built target _var_jenkins_workspace_adamantine-nightly_build_bin_material_property_polynomial.info
[ 42%] Copying material_property_table.info
[ 42%] Built target _var_jenkins_workspace_adamantine-nightly_build_bin_material_property_table.info
[ 43%] Copying microstructure_G_R_gold_1.txt
[ 43%] Built target _var_jenkins_workspace_adamantine-nightly_build_bin_microstructure_G_R_gold_1.txt
[ 43%] Copying microstructure_G_R_gold_2.txt
[ 43%] Built target _var_jenkins_workspace_adamantine-nightly_build_bin_microstructure_G_R_gold_2.txt
[ 44%] Copying rays_cam-0-0_test_full.csv
[ 44%] Built target _var_jenkins_workspace_adamantine-nightly_build_bin_rays_cam-0-0_test_full.csv
[ 44%] Copying raytracing_experimental_data_0_0.csv
[ 44%] Built target _var_jenkins_workspace_adamantine-nightly_build_bin_raytracing_experimental_data_0_0.csv
[ 45%] Copying raytracing_non_AA_cells-0-0.csv
[ 45%] Built target _var_jenkins_workspace_adamantine-nightly_build_bin_raytracing_non_AA_cells-0-0.csv
[ 46%] Copying scan_path.txt
[ 46%] Built target _var_jenkins_workspace_adamantine-nightly_build_bin_scan_path.txt
[ 46%] Copying scan_path_5_axis.txt
[ 46%] Built target _var_jenkins_workspace_adamantine-nightly_build_bin_scan_path_5_axis.txt
[ 46%] Copying scan_path_arcs.txt
[ 46%] Built target _var_jenkins_workspace_adamantine-nightly_build_bin_scan_path_arcs.txt
[ 47%] Copying scan_path_diagonal.txt
[ 47%] Built target _var_jenkins_workspace_adamantine-nightly_build_bin_scan_path_diagonal.txt
[ 47%] Copying scan_path_event_series.inp
[ 47%] Built target _var_jenkins_workspace_adamantine-nightly_build_bin_scan_path_event_series.inp
[ 48%] Copying scan_path_L.txt
[ 48%] Built target _var_jenkins_workspace_adamantine-nightly_build_bin_scan_path_L.txt
[ 49%] Copying scan_path_layers.txt
[ 49%] Built target _var_jenkins_workspace_adamantine-nightly_build_bin_scan_path_layers.txt
[ 50%] Copying scan_path_test_thermal_physics.txt
[ 50%] Built target _var_jenkins_workspace_adamantine-nightly_build_bin_scan_path_test_thermal_physics.txt
[ 50%] Copying scan_path_units.txt
[ 50%] Built target _var_jenkins_workspace_adamantine-nightly_build_bin_scan_path_units.txt
[ 51%] Copying Simple_3D_ring.stl
[ 51%] Built target _var_jenkins_workspace_adamantine-nightly_build_bin_Simple_3D_ring.stl
[ 52%] Copying thermoelastic_bare_plate.info
[ 52%] Built target _var_jenkins_workspace_adamantine-nightly_build_bin_thermoelastic_bare_plate.info
[ 52%] Copying thermoelastic_bare_plate_add_material_scan_path.txt
[ 52%] Built target _var_jenkins_workspace_adamantine-nightly_build_bin_thermoelastic_bare_plate_add_material_scan_path.txt
[ 53%] Copying thermoelastic_bare_plate_scan_path.txt
[ 53%] Built target _var_jenkins_workspace_adamantine-nightly_build_bin_thermoelastic_bare_plate_scan_path.txt
[ 54%] Copying within_stl_gold.txt
[ 54%] Built target _var_jenkins_workspace_adamantine-nightly_build_bin_within_stl_gold.txt
[ 33%] Building CXX object source/CMakeFiles/Adamantine.dir/ThermalOperatorInstSLHost.cc.o
In file included from /var/jenkins/workspace/adamantine-nightly/source/MaterialPropertyInstHost.cc:6:
/var/jenkins/workspace/adamantine-nightly/source/instantiation.hh:37:41: fatal error: error writing to /tmp/ccaV2XoT.s: No space left on device
   37 |               dealii::MemorySpace::Host>;
      |                                         ^
/usr/include/boost/preprocessor/seq/for_each_product.hpp:62:71: note: in expansion of macro 'ADAMANTINE_D_N_P_M_HOST'
   62 | # define BOOST_PP_SEQ_FOR_EACH_PRODUCT_I_I(r, cset, rset, res, macro) macro(r, BOOST_PP_SEQ_TAIL(res (BOOST_PP_SEQ_HEAD(cset))))
      |                                                                       ^~~~~
/var/jenkins/workspace/adamantine-nightly/source/MaterialPropertyInstHost.cc:8:1: note: in expansion of macro 'INSTANTIATE_DIM_NMAT_PORDER_MATERIALSTATES_HOST'
    8 | INSTANTIATE_DIM_NMAT_PORDER_MATERIALSTATES_HOST(MaterialProperty)
      | ^~~~~~~~~~~~~~~~~~~~~~~~~~~~~~~~~~~~~~~~~~~~~~~
compilation terminated.
make[2]: *** [source/CMakeFiles/Adamantine.dir/build.make:202: source/CMakeFiles/Adamantine.dir/MaterialPropertyInstHost.cc.o] Error 1
/var/jenkins/workspace/adamantine-nightly/source/RayTracing.cc:418:1: fatal error: error writing to /tmp/ccv7mic7.s: No space left on device
  418 | } // namespace adamantine
      | ^
compilation terminated.
make[2]: *** [source/CMakeFiles/Adamantine.dir/build.make:300: source/CMakeFiles/Adamantine.dir/RayTracing.cc.o] Error 1
In file included from /var/jenkins/workspace/adamantine-nightly/source/MaterialPropertyInstDev.cc:6:
/var/jenkins/workspace/adamantine-nightly/source/instantiation.hh:54:44: fatal error: error writing to /tmp/ccbnz9wJ.s: No space left on device
   54 |               dealii::MemorySpace::Default>;
      |                                            ^
/usr/include/boost/preprocessor/seq/for_each_product.hpp:62:71: note: in expansion of macro 'ADAMANTINE_D_N_P_M_DEV'
   62 | # define BOOST_PP_SEQ_FOR_EACH_PRODUCT_I_I(r, cset, rset, res, macro) macro(r, BOOST_PP_SEQ_TAIL(res (BOOST_PP_SEQ_HEAD(cset))))
      |                                                                       ^~~~~
/var/jenkins/workspace/adamantine-nightly/source/MaterialPropertyInstDev.cc:8:1: note: in expansion of macro 'INSTANTIATE_DIM_NMAT_PORDER_MATERIALSTATES_DEVICE'
    8 | INSTANTIATE_DIM_NMAT_PORDER_MATERIALSTATES_DEVICE(MaterialProperty)
      | ^~~~~~~~~~~~~~~~~~~~~~~~~~~~~~~~~~~~~~~~~~~~~~~~~
compilation terminated.
make[2]: *** [source/CMakeFiles/Adamantine.dir/build.make:188: source/CMakeFiles/Adamantine.dir/MaterialPropertyInstDev.cc.o] Error 1
[ 34%] Building CXX object source/CMakeFiles/Adamantine.dir/ThermalOperatorInstSLPHost.cc.o
[ 35%] Building CXX object source/CMakeFiles/Adamantine.dir/ThermalOperatorDeviceInstSDev.cc.o
In file included from /var/jenkins/workspace/adamantine-nightly/source/MechanicalPhysics.cc:6:
/var/jenkins/workspace/adamantine-nightly/source/instantiation.hh:54:44: fatal error: error writing to /tmp/ccHBDx5t.s: No space left on device
   54 |               dealii::MemorySpace::Default>;
      |                                            ^
/usr/include/boost/preprocessor/seq/for_each_product.hpp:62:71: note: in expansion of macro 'ADAMANTINE_D_N_P_M_DEV'
   62 | # define BOOST_PP_SEQ_FOR_EACH_PRODUCT_I_I(r, cset, rset, res, macro) macro(r, BOOST_PP_SEQ_TAIL(res (BOOST_PP_SEQ_HEAD(cset))))
      |                                                                       ^~~~~
/var/jenkins/workspace/adamantine-nightly/source/MechanicalPhysics.cc:729:1: note: in expansion of macro 'INSTANTIATE_DIM_NMAT_PORDER_MATERIALSTATES_DEVICE'
  729 | INSTANTIATE_DIM_NMAT_PORDER_MATERIALSTATES_DEVICE(MechanicalPhysics)
      | ^~~~~~~~~~~~~~~~~~~~~~~~~~~~~~~~~~~~~~~~~~~~~~~~~
compilation terminated.
make[2]: *** [source/CMakeFiles/Adamantine.dir/build.make:230: source/CMakeFiles/Adamantine.dir/MechanicalPhysics.cc.o] Error 1
[ 35%] Building CXX object source/CMakeFiles/Adamantine.dir/ThermalOperatorDeviceInstSLDev.cc.o
[ 36%] Building CXX object source/CMakeFiles/Adamantine.dir/ThermalOperatorDeviceInstSLPDev.cc.o
In file included from /var/jenkins/workspace/adamantine-nightly/source/ThermalOperatorInstSHost.cc:6:
/var/jenkins/workspace/adamantine-nightly/source/instantiation.hh:74:41: fatal error: error writing to /tmp/ccNrDeV5.s: No space left on device
   74 |               dealii::MemorySpace::Host>;
      |                                         ^
/usr/include/boost/preprocessor/seq/for_each_product.hpp:62:71: note: in expansion of macro 'ADAMANTINE_D_N_U_P_F_S_HOST'
   62 | # define BOOST_PP_SEQ_FOR_EACH_PRODUCT_I_I(r, cset, rset, res, macro) macro(r, BOOST_PP_SEQ_TAIL(res (BOOST_PP_SEQ_HEAD(cset))))
      |                                                                       ^~~~~
/var/jenkins/workspace/adamantine-nightly/source/ThermalOperatorInstSHost.cc:8:1: note: in expansion of macro 'INSTANTIATE_DIM_NMAT_USETABLE_PORDER_FEDEGREE_S_HOST'
    8 | INSTANTIATE_DIM_NMAT_USETABLE_PORDER_FEDEGREE_S_HOST(ThermalOperator)
      | ^~~~~~~~~~~~~~~~~~~~~~~~~~~~~~~~~~~~~~~~~~~~~~~~~~~~
compilation terminated.
make[2]: *** [source/CMakeFiles/Adamantine.dir/build.make:328: source/CMakeFiles/Adamantine.dir/ThermalOperatorInstSHost.cc.o] Error 1
In file included from /var/jenkins/workspace/adamantine-nightly/source/ThermalOperatorInstSLHost.cc:6:
/var/jenkins/workspace/adamantine-nightly/source/instantiation.hh:94:41: fatal error: error writing to /tmp/ccc7Aig3.s: No space left on device
   94 |               dealii::MemorySpace::Host>;
      |                                         ^
/usr/include/boost/preprocessor/seq/for_each_product.hpp:62:71: note: in expansion of macro 'ADAMANTINE_D_N_U_P_F_SL_HOST'
   62 | # define BOOST_PP_SEQ_FOR_EACH_PRODUCT_I_I(r, cset, rset, res, macro) macro(r, BOOST_PP_SEQ_TAIL(res (BOOST_PP_SEQ_HEAD(cset))))
      |                                                                       ^~~~~
/var/jenkins/workspace/adamantine-nightly/source/ThermalOperatorInstSLHost.cc:8:1: note: in expansion of macro 'INSTANTIATE_DIM_NMAT_USETABLE_PORDER_FEDEGREE_SL_HOST'
    8 | INSTANTIATE_DIM_NMAT_USETABLE_PORDER_FEDEGREE_SL_HOST(ThermalOperator)
      | ^~~~~~~~~~~~~~~~~~~~~~~~~~~~~~~~~~~~~~~~~~~~~~~~~~~~~
compilation terminated.
make[2]: *** [source/CMakeFiles/Adamantine.dir/build.make:342: source/CMakeFiles/Adamantine.dir/ThermalOperatorInstSLHost.cc.o] Error 1
In file included from /var/jenkins/workspace/adamantine-nightly/source/ThermalOperatorInstSLPHost.cc:6:
/var/jenkins/workspace/adamantine-nightly/source/instantiation.hh:114:41: fatal error: error writing to /tmp/ccnlGDEG.s: No space left on device
  114 |               dealii::MemorySpace::Host>;
      |                                         ^
/usr/include/boost/preprocessor/seq/for_each_product.hpp:62:71: note: in expansion of macro 'ADAMANTINE_D_N_U_P_F_SLP_HOST'
   62 | # define BOOST_PP_SEQ_FOR_EACH_PRODUCT_I_I(r, cset, rset, res, macro) macro(r, BOOST_PP_SEQ_TAIL(res (BOOST_PP_SEQ_HEAD(cset))))
      |                                                                       ^~~~~
/var/jenkins/workspace/adamantine-nightly/source/ThermalOperatorInstSLPHost.cc:8:1: note: in expansion of macro 'INSTANTIATE_DIM_NMAT_USETABLE_PORDER_FEDEGREE_SLP_HOST'
    8 | INSTANTIATE_DIM_NMAT_USETABLE_PORDER_FEDEGREE_SLP_HOST(ThermalOperator)
      | ^~~~~~~~~~~~~~~~~~~~~~~~~~~~~~~~~~~~~~~~~~~~~~~~~~~~~~
compilation terminated.
make[2]: *** [source/CMakeFiles/Adamantine.dir/build.make:356: source/CMakeFiles/Adamantine.dir/ThermalOperatorInstSLPHost.cc.o] Error 1
make[1]: *** [CMakeFiles/Makefile2:1143: source/CMakeFiles/Adamantine.dir/all] Error 2
make: *** [Makefile:146: all] Error 2
[Pipeline] }
[Pipeline] // dir
Post stage
[Pipeline] xunit
INFO: Processing CTest-Version 3.x (default)
Error when executing always post condition:
Also:   hudson.remoting.Channel$CallSiteStackTrace: Remote call to JNLP4-connect connection from 10.64.200.57/10.64.200.57:57954
		at hudson.remoting.Channel.attachCallSiteStackTrace(Channel.java:1916)
		at hudson.remoting.UserRequest$ExceptionResponse.retrieve(UserRequest.java:384)
		at hudson.remoting.Channel.call(Channel.java:1108)
		at hudson.FilePath.act(FilePath.java:1220)
		at hudson.FilePath.act(FilePath.java:1209)
		at PluginClassLoader for xunit//org.jenkinsci.plugins.xunit.XUnitProcessor.processTestsReport(XUnitProcessor.java:214)
		at PluginClassLoader for xunit//org.jenkinsci.plugins.xunit.XUnitProcessor.process(XUnitProcessor.java:163)
		at PluginClassLoader for xunit//org.jenkinsci.plugins.xunit.pipeline.XUnitResultsStepExecution.run(XUnitResultsStepExecution.java:94)
		at PluginClassLoader for xunit//org.jenkinsci.plugins.xunit.pipeline.XUnitResultsStepExecution.run(XUnitResultsStepExecution.java:53)
		at PluginClassLoader for workflow-step-api//org.jenkinsci.plugins.workflow.steps.SynchronousNonBlockingStepExecution.lambda$start$0(SynchronousNonBlockingStepExecution.java:49)
		at java.base/java.util.concurrent.Executors$RunnableAdapter.call(Unknown Source)
		at java.base/java.util.concurrent.FutureTask.run(Unknown Source)
		at java.base/java.util.concurrent.ThreadPoolExecutor.runWorker(Unknown Source)
		at java.base/java.util.concurrent.ThreadPoolExecutor$Worker.run(Unknown Source)
		at java.base/java.lang.Thread.run(Unknown Source)
Also:   org.jenkinsci.plugins.workflow.actions.ErrorAction$ErrorId: 8e51f81b-573c-4ce3-8e83-f66d9b561d72
org.jenkinsci.plugins.xunit.service.NoTestFoundException: [CTest-Version 3.x (default)] - No test report file(s) were found with the pattern 'build/Testing/**/Test.xml' relative to '/var/jenkins/workspace/adamantine-nightly' for the testing framework 'CTest-Version 3.x (default)'.
Did you enter a pattern relative to (and within) the workspace directory?
Did you generate the result report(s) for 'CTest-Version 3.x (default)'?"
	at PluginClassLoader for xunit//org.jenkinsci.plugins.xunit.service.XUnitReportProcessorService.findReports(XUnitReportProcessorService.java:79)
	at PluginClassLoader for xunit//org.jenkinsci.plugins.xunit.service.XUnitTransformerCallable.invoke(XUnitTransformerCallable.java:87)
	at PluginClassLoader for xunit//org.jenkinsci.plugins.xunit.service.XUnitTransformerCallable.invoke(XUnitTransformerCallable.java:39)
	at Jenkins v2.568.3//hudson.FilePath$FileCallableWrapper.call(FilePath.java:3655)
	at hudson.remoting.UserRequest.perform(UserRequest.java:225)
	at hudson.remoting.UserRequest.perform(UserRequest.java:50)
	at hudson.remoting.Request$2.run(Request.java:391)
	at hudson.remoting.InterceptingExecutorService.lambda$wrap$0(InterceptingExecutorService.java:81)
	at java.base/java.util.concurrent.FutureTask.run(FutureTask.java:317)
	at java.base/java.util.concurrent.ThreadPoolExecutor.runWorker(ThreadPoolExecutor.java:1144)
	at java.base/java.util.concurrent.ThreadPoolExecutor$Worker.run(ThreadPoolExecutor.java:642)
	at hudson.remoting.Engine$1.lambda$newThread$0(Engine.java:312)
	at java.base/java.lang.Thread.run(Thread.java:1583)

[Pipeline] }
[Pipeline] // withEnv
[Pipeline] }
$ docker stop --time=1 c214911500d34fe91bd884febfc8e59639dc1bec5a3303655df5b7987c874aa1
$ docker rm -f --volumes c214911500d34fe91bd884febfc8e59639dc1bec5a3303655df5b7987c874aa1
[Pipeline] // withDockerContainer
[Pipeline] }
[Pipeline] // withEnv
[Pipeline] }
[Pipeline] // node
[Pipeline] }
[Pipeline] // stage
[Pipeline] }
Failed in branch CPU
[ 36%] Building CXX object source/CMakeFiles/Adamantine.dir/ThermalPhysicsInstSDev.cc.o
[ 37%] Building CXX object source/CMakeFiles/Adamantine.dir/ThermalPhysicsInstSLDev.cc.o
[ 37%] Building CXX object source/CMakeFiles/Adamantine.dir/ThermalPhysicsInstSLPDev.cc.o
[ 38%] Building CXX object source/CMakeFiles/Adamantine.dir/ThermalPhysicsInstSHost.cc.o
[ 39%] Building CXX object source/CMakeFiles/Adamantine.dir/ThermalPhysicsInstSLHost.cc.o
[ 39%] Building CXX object source/CMakeFiles/Adamantine.dir/ThermalPhysicsInstSLPHost.cc.o
[ 40%] Building CXX object source/CMakeFiles/Adamantine.dir/Timer.cc.o
[ 40%] Building CXX object source/CMakeFiles/Adamantine.dir/ensemble_management.cc.o
[ 41%] Building CXX object source/CMakeFiles/Adamantine.dir/experimental_data_utils.cc.o
[ 42%] Building CXX object source/CMakeFiles/Adamantine.dir/material_deposition.cc.o
[ 42%] Building CXX object source/CMakeFiles/Adamantine.dir/validate_input_database.cc.o
[ 43%] Copying integration_3d_gold_short.txt
[ 43%] Built target _var_jenkins_workspace_adamantine-nightly_build_bin_integration_3d_gold_short.txt
[ 43%] Copying integration_3d_gold_short_0.txt
[ 43%] Built target _var_jenkins_workspace_adamantine-nightly_build_bin_integration_3d_gold_short_0.txt
[ 44%] Copying integration_3d_gold_short_1.txt
[ 44%] Built target _var_jenkins_workspace_adamantine-nightly_build_bin_integration_3d_gold_short_1.txt
[ 45%] Copying integration_da_add_material.info
[ 45%] Built target _var_jenkins_workspace_adamantine-nightly_build_bin_integration_da_add_material.info
[ 45%] Copying integration_da_add_material_expt_log.txt
[ 45%] Built target _var_jenkins_workspace_adamantine-nightly_build_bin_integration_da_add_material_expt_log.txt
[ 46%] Copying integration_da_add_material_expt_pc_0_0.csv
[ 46%] Built target _var_jenkins_workspace_adamantine-nightly_build_bin_integration_da_add_material_expt_pc_0_0.csv
[ 46%] Copying integration_da_add_material_expt_ray_0_0.csv
[ 46%] Built target _var_jenkins_workspace_adamantine-nightly_build_bin_integration_da_add_material_expt_ray_0_0.csv
[ 47%] Copying integration_da_add_material_sp.txt
[ 47%] Built target _var_jenkins_workspace_adamantine-nightly_build_bin_integration_da_add_material_sp.txt
[ 48%] Copying material_deposition_2d.txt
[ 48%] Built target _var_jenkins_workspace_adamantine-nightly_build_bin_material_deposition_2d.txt
[ 48%] Copying material_deposition_3d.txt
[ 48%] Built target _var_jenkins_workspace_adamantine-nightly_build_bin_material_deposition_3d.txt
[ 49%] Copying material_path_test_material_deposition.txt
[ 49%] Built target _var_jenkins_workspace_adamantine-nightly_build_bin_material_path_test_material_deposition.txt
[ 49%] Copying material_property_polynomial.info
[ 49%] Built target _var_jenkins_workspace_adamantine-nightly_build_bin_material_property_polynomial.info
[ 50%] Copying material_property_table.info
[ 50%] Built target _var_jenkins_workspace_adamantine-nightly_build_bin_material_property_table.info
[ 51%] Copying microstructure_G_R_gold_1.txt
[ 51%] Built target _var_jenkins_workspace_adamantine-nightly_build_bin_microstructure_G_R_gold_1.txt
[ 51%] Copying microstructure_G_R_gold_2.txt
[ 51%] Built target _var_jenkins_workspace_adamantine-nightly_build_bin_microstructure_G_R_gold_2.txt
[ 52%] Copying rays_cam-0-0_test_full.csv
[ 52%] Built target _var_jenkins_workspace_adamantine-nightly_build_bin_rays_cam-0-0_test_full.csv
[ 52%] Copying raytracing_experimental_data_0_0.csv
[ 52%] Built target _var_jenkins_workspace_adamantine-nightly_build_bin_raytracing_experimental_data_0_0.csv
[ 53%] Copying raytracing_non_AA_cells-0-0.csv
[ 53%] Built target _var_jenkins_workspace_adamantine-nightly_build_bin_raytracing_non_AA_cells-0-0.csv
[ 54%] Copying scan_path.txt
[ 54%] Built target _var_jenkins_workspace_adamantine-nightly_build_bin_scan_path.txt
[ 54%] Copying scan_path_5_axis.txt
[ 54%] Built target _var_jenkins_workspace_adamantine-nightly_build_bin_scan_path_5_axis.txt
[ 54%] Copying scan_path_arcs.txt
[ 54%] Built target _var_jenkins_workspace_adamantine-nightly_build_bin_scan_path_arcs.txt
[ 55%] Copying scan_path_diagonal.txt
[ 55%] Built target _var_jenkins_workspace_adamantine-nightly_build_bin_scan_path_diagonal.txt
[ 55%] Copying scan_path_event_series.inp
[ 55%] Built target _var_jenkins_workspace_adamantine-nightly_build_bin_scan_path_event_series.inp
[ 56%] Copying scan_path_L.txt
[ 56%] Built target _var_jenkins_workspace_adamantine-nightly_build_bin_scan_path_L.txt
[ 57%] Copying scan_path_layers.txt
[ 57%] Built target _var_jenkins_workspace_adamantine-nightly_build_bin_scan_path_layers.txt
[ 58%] Copying scan_path_test_thermal_physics.txt
[ 58%] Built target _var_jenkins_workspace_adamantine-nightly_build_bin_scan_path_test_thermal_physics.txt
[ 58%] Copying scan_path_units.txt
[ 58%] Built target _var_jenkins_workspace_adamantine-nightly_build_bin_scan_path_units.txt
[ 59%] Copying Simple_3D_ring.stl
[ 59%] Built target _var_jenkins_workspace_adamantine-nightly_build_bin_Simple_3D_ring.stl
[ 60%] Copying thermoelastic_bare_plate.info
[ 60%] Built target _var_jenkins_workspace_adamantine-nightly_build_bin_thermoelastic_bare_plate.info
[ 60%] Copying thermoelastic_bare_plate_add_material_scan_path.txt
[ 60%] Built target _var_jenkins_workspace_adamantine-nightly_build_bin_thermoelastic_bare_plate_add_material_scan_path.txt
[ 61%] Copying thermoelastic_bare_plate_scan_path.txt
[ 61%] Built target _var_jenkins_workspace_adamantine-nightly_build_bin_thermoelastic_bare_plate_scan_path.txt
[ 62%] Copying within_stl_gold.txt
[ 62%] Built target _var_jenkins_workspace_adamantine-nightly_build_bin_within_stl_gold.txt
[ 62%] Built target Adamantine
[ 62%] Building CXX object application/CMakeFiles/adamantine.dir/adamantine.cc.o
[ 62%] Building CXX object tests/CMakeFiles/test_closest_source_point_adaptation.dir/test_closest_source_point_adaptation.cc.o
[ 63%] Building CXX object tests/CMakeFiles/test_data_assimilator.dir/test_data_assimilator.cc.o
[ 64%] Building CXX object tests/CMakeFiles/test_integration_da.dir/test_integration_da.cc.o
[ 65%] Building CXX object tests/CMakeFiles/test_experimental_data.dir/test_experimental_data.cc.o
[ 65%] Building CXX object tests/CMakeFiles/test_heat_source.dir/test_heat_source.cc.o
[ 65%] Building CXX object tests/CMakeFiles/test_geometry.dir/test_geometry.cc.o
[ 65%] Building CXX object tests/CMakeFiles/test_integration_3d_device.dir/test_integration_3d_device.cc.o
[ 66%] Linking CXX executable ../bin/test_heat_source
[ 67%] Linking CXX executable ../bin/test_closest_source_point_adaptation
[ 67%] Built target test_heat_source
[ 67%] Building CXX object tests/CMakeFiles/test_material_property.dir/test_material_property.cc.o
[ 68%] Linking CXX executable ../bin/test_experimental_data
[ 68%] Linking CXX executable ../bin/test_data_assimilator
[ 68%] Built target test_closest_source_point_adaptation
[ 69%] Building CXX object tests/CMakeFiles/test_material_property_device.dir/test_material_property_device.cc.o
[ 69%] Built target test_experimental_data
[ 70%] Building CXX object tests/CMakeFiles/test_mechanical_operator.dir/test_mechanical_operator.cc.o
[ 70%] Built target test_data_assimilator
[ 71%] Building CXX object tests/CMakeFiles/test_mechanical_physics.dir/test_mechanical_physics.cc.o
[ 72%] Linking CXX executable ../bin/test_geometry
[ 73%] Linking CXX executable ../bin/test_integration_3d_device
[ 73%] Linking CXX executable ../bin/test_integration_da
[ 73%] Built target test_geometry
[ 73%] Building CXX object tests/CMakeFiles/test_post_processor.dir/test_post_processor.cc.o
[ 73%] Built target test_integration_3d_device
[ 73%] Building CXX object tests/CMakeFiles/test_quaternion.dir/test_quaternion.cc.o
[ 74%] Linking CXX executable ../bin/test_material_property
[ 74%] Built target test_integration_da
[ 75%] Building CXX object tests/CMakeFiles/test_scan_path.dir/test_scan_path.cc.o
[ 75%] Linking CXX executable ../bin/test_material_property_device
[ 75%] Built target test_material_property
[ 76%] Building CXX object tests/CMakeFiles/test_thermal_operator.dir/test_thermal_operator.cc.o
[ 77%] Linking CXX executable ../bin/test_quaternion
[ 77%] Linking CXX executable ../bin/test_mechanical_operator
[ 77%] Built target test_material_property_device
[ 78%] Building CXX object tests/CMakeFiles/test_thermal_operator_device.dir/test_thermal_operator_device.cc.o
[ 78%] Linking CXX executable ../bin/test_scan_path
[ 78%] Linking CXX executable ../bin/test_mechanical_physics
[ 78%] Built target test_quaternion
[ 78%] Building CXX object tests/CMakeFiles/test_thermal_physics_device.dir/test_thermal_physics_device.cc.o
[ 78%] Built target test_mechanical_operator
[ 79%] Building CXX object tests/CMakeFiles/test_timer.dir/test_timer.cc.o
[ 79%] Built target test_scan_path
[ 80%] Building CXX object tests/CMakeFiles/test_utils.dir/test_utils.cc.o
[ 80%] Built target test_mechanical_physics
[ 81%] Building CXX object tests/CMakeFiles/test_validate_input_database.dir/test_validate_input_database.cc.o
[ 82%] Linking CXX executable ../bin/test_post_processor
[ 82%] Linking CXX executable ../bin/test_timer
[ 82%] Linking CXX executable ../bin/test_utils
[ 82%] Built target test_post_processor
[ 83%] Building CXX object tests/CMakeFiles/test_integration_2d.dir/test_integration_2d.cc.o
[ 84%] Linking CXX executable ../bin/test_validate_input_database
[ 84%] Linking CXX executable ../bin/test_thermal_operator
[ 85%] Linking CXX executable ../bin/test_thermal_operator_device
[ 85%] Built target test_timer
[ 86%] Building CXX object tests/CMakeFiles/test_integration_2d_device.dir/test_integration_2d_device.cc.o
[ 86%] Built target test_utils
[ 87%] Building CXX object tests/CMakeFiles/test_integration_3d.dir/test_integration_3d.cc.o
[ 87%] Built target test_thermal_operator
[ 88%] Building CXX object tests/CMakeFiles/test_integration_3d_amr.dir/test_integration_3d_amr.cc.o
[ 89%] Linking CXX executable ../bin/test_thermal_physics_device
[ 89%] Built target test_validate_input_database
[ 89%] Building CXX object tests/CMakeFiles/test_integration_3d_amr_device.dir/test_integration_3d_amr_device.cc.o
[ 89%] Built target test_thermal_operator_device
[ 90%] Building CXX object tests/CMakeFiles/test_integration_da_augmented.dir/test_integration_da_augmented.cc.o
[ 90%] Built target test_thermal_physics_device
[ 91%] Building CXX object tests/CMakeFiles/test_integration_thermoelastic.dir/test_integration_thermoelastic.cc.o
[ 91%] Linking CXX executable ../bin/test_integration_2d
[ 91%] Linking CXX executable ../bin/test_integration_3d
[ 91%] Linking CXX executable ../bin/test_integration_2d_device
[ 91%] Built target test_integration_2d
[ 91%] Building CXX object tests/CMakeFiles/test_material_deposition.dir/test_material_deposition.cc.o
[ 92%] Linking CXX executable ../bin/adamantine
[ 93%] Linking CXX executable ../bin/test_integration_3d_amr_device
[ 93%] Linking CXX executable ../bin/test_integration_da_augmented
[ 93%] Built target test_integration_3d
[ 94%] Building CXX object tests/CMakeFiles/test_microstructure.dir/test_microstructure.cc.o
[ 94%] Built target test_integration_2d_device
[ 94%] Building CXX object tests/CMakeFiles/test_thermal_physics.dir/test_thermal_physics.cc.o
[ 95%] Linking CXX executable ../bin/test_integration_3d_amr
[ 96%] Linking CXX executable ../bin/test_integration_thermoelastic
[ 96%] Built target test_integration_3d_amr_device
[ 97%] Building CXX object tests/CMakeFiles/test_ensemble_management.dir/test_ensemble_management.cc.o
[ 97%] Built target test_integration_da_augmented
[ 97%] Built target adamantine
[ 97%] Built target test_integration_3d_amr
[ 97%] Built target test_integration_thermoelastic
[ 97%] Linking CXX executable ../bin/test_ensemble_management
[ 98%] Linking CXX executable ../bin/test_material_deposition
[ 99%] Linking CXX executable ../bin/test_microstructure
[100%] Linking CXX executable ../bin/test_thermal_physics
[100%] Built target test_ensemble_management
[100%] Built target test_material_deposition
[100%] Built target test_microstructure
[100%] Built target test_thermal_physics
[Pipeline] sh
+ ctest -V --timeout 7200 --no-compress-output -R test_ -T Test
UpdateCTestConfiguration  from :/var/jenkins/workspace/adamantine-nightly/build/DartConfiguration.tcl
Parse Config file:/var/jenkins/workspace/adamantine-nightly/build/DartConfiguration.tcl
   Site: 2a2bb63f7982
   Build name: Linux-nvcc_wrapper
Create new tag: 20260927-0510 - Experimental
UpdateCTestConfiguration  from :/var/jenkins/workspace/adamantine-nightly/build/DartConfiguration.tcl
Parse Config file:/var/jenkins/workspace/adamantine-nightly/build/DartConfiguration.tcl
Test project /var/jenkins/workspace/adamantine-nightly/build
Constructing a list of tests
Done constructing a list of tests
Updating test list for fixtures
Added 0 tests to meet fixture requirements
Checking test dependency graph...
Checking test dependency graph end
test 2
      Start  2: test_integration_da_1

2: Test command: /usr/bin/mpiexec "-n" "1" "/var/jenkins/workspace/adamantine-nightly/build/bin/test_integration_da"
2: Working Directory: /var/jenkins/workspace/adamantine-nightly/build/tests
2: Test timeout computed to be: 7200
2: Running 3 test cases...
2: Entering test module "Integration_Data_Assimilation"
2: /var/jenkins/workspace/adamantine-nightly/tests/test_integration_da.cc(78): Entering test case "integration_data_assimilation"
2: Reading the experimental log file...
2: Done. Log entries found for 1 camera(s), with 2 frame(s).
2: Starting the main time stepping loop...
2: 10% completed
2: 20% completed
2: 30% completed
2: 40% completed
2: Performing data assimilation at time 0.0211...
2: Rank: 0 | Old parameters for member 0: 
2: Rank: 0 | Old parameters for member 1: 
2: Rank: 0 | Old parameters for member 2: 
2: Rank: 0 | Number expt sites mapped to DOFs: 1
2: Getting the perturbed innovation...
2: Applying the Kalman gain...
2: Updating the ensemble members...
2: Done.
2: 50% completed
2: 60% completed
2: Performing data assimilation at time 0.0316...
2: Rank: 0 | Old parameters for member 0: 
2: Rank: 0 | Old parameters for member 1: 
2: Rank: 0 | Old parameters for member 2: 
2: Rank: 0 | Number expt sites mapped to DOFs: 1
2: Getting the perturbed innovation...
2: Applying the Kalman gain...
2: Updating the ensemble members...
2: Done.
2: 70% completed
2: 80% completed
2: 90% completed
2: 100% completed
2: Reading the experimental log file...
2: Done. Log entries found for 1 camera(s), with 2 frame(s).
2: Starting the main time stepping loop...
2: 10% completed
2: 20% completed
2: 30% completed
2: 40% completed
2: Performing data assimilation at time 0.0211...
2: Rank: 0 | Old parameters for member 0: 
2: Rank: 0 | Old parameters for member 1: 
2: Rank: 0 | Old parameters for member 2: 
2: Rank: 0 | Number expt sites mapped to DOFs: 1
2: Getting the perturbed innovation...
2: Applying the Kalman gain...
2: Updating the ensemble members...
2: Done.
2: 50% completed
2: 60% completed
2: Performing data assimilation at time 0.0316...
2: Rank: 0 | Old parameters for member 0: 
2: Rank: 0 | Old parameters for member 1: 
2: Rank: 0 | Old parameters for member 2: 
2: Rank: 0 | Number expt sites mapped to DOFs: 1
2: Getting the perturbed innovation...
2: Applying the Kalman gain...
2: Updating the ensemble members...
2: Done.
2: 70% completed
2: 80% completed
2: 90% completed
2: 100% completed
2: /var/jenkins/workspace/adamantine-nightly/tests/test_integration_da.cc(78): Leaving test case "integration_data_assimilation"; testing time: 86712373us
2: /var/jenkins/workspace/adamantine-nightly/tests/test_integration_da.cc(148): Entering test case "integration_3D_da_point_cloud_add_material"
2: Reading the experimental log file...
2: Done. Log entries found for 1 camera(s), with 1 frame(s).
2: Starting the main time stepping loop...
2: 10% completed
2: 20% completed
2: 30% completed
2: 40% completed
2: 50% completed
2: Performing data assimilation at time 0.12...
2: Rank: 0 | Old parameters for member 0: 
2: Rank: 0 | Old parameters for member 1: 
2: Rank: 0 | Old parameters for member 2: 
2: Rank: 0 | Number expt sites mapped to DOFs: 1
2: Getting the perturbed innovation...
2: Applying the Kalman gain...
2: Updating the ensemble members...
2: Done.
2: 60% completed
2: 70% completed
2: 80% completed
2: 90% completed
2: 100% completed
2: Reading the experimental log file...
2: Done. Log entries found for 1 camera(s), with 1 frame(s).
2: Starting the main time stepping loop...
2: 10% completed
2: 20% completed
2: 30% completed
2: 40% completed
2: 50% completed
2: Performing data assimilation at time 0.12...
2: Rank: 0 | Old parameters for member 0: 
2: Rank: 0 | Old parameters for member 1: 
2: Rank: 0 | Old parameters for member 2: 
2: Rank: 0 | Number expt sites mapped to DOFs: 1
2: Getting the perturbed innovation...
2: Applying the Kalman gain...
2: Updating the ensemble members...
2: Done.
2: 60% completed
2: 70% completed
2: 80% completed
2: 90% completed
2: 100% completed
2: /var/jenkins/workspace/adamantine-nightly/tests/test_integration_da.cc(148): Leaving test case "integration_3D_da_point_cloud_add_material"; testing time: 3692449us
2: /var/jenkins/workspace/adamantine-nightly/tests/test_integration_da.cc(231): Entering test case "integration_3D_da_ray_add_material"
2: Reading the experimental log file...
2: Done. Log entries found for 1 camera(s), with 1 frame(s).
2: Starting the main time stepping loop...
2: 10% completed
2: 20% completed
2: 30% completed
2: 40% completed
2: 50% completed
2: Performing data assimilation at time 0.12...
2: Rank: 0 | Old parameters for member 0: 
2: Rank: 0 | Old parameters for member 1: 
2: Rank: 0 | Old parameters for member 2: 
2: Rank: 0 | Number expt sites mapped to DOFs: 1
2: Getting the perturbed innovation...
2: Applying the Kalman gain...
2: Updating the ensemble members...
2: Done.
2: 60% completed
2: 70% completed
2: 80% completed
2: 90% completed
2: 100% completed
2: Reading the experimental log file...
2: Done. Log entries found for 1 camera(s), with 1 frame(s).
2: Starting the main time stepping loop...
2: 10% completed
2: 20% completed
2: 30% completed
2: 40% completed
2: 50% completed
2: Performing data assimilation at time 0.12...
2: Rank: 0 | Old parameters for member 0: 
2: Rank: 0 | Old parameters for member 1: 
2: Rank: 0 | Old parameters for member 2: 
2: Rank: 0 | Number expt sites mapped to DOFs: 1
2: Getting the perturbed innovation...
2: Applying the Kalman gain...
2: Updating the ensemble members...
2: Done.
2: 60% completed
2: 70% completed
2: 80% completed
2: 90% completed
2: 100% completed
2: 
2: *** No errors detected
2: /var/jenkins/workspace/adamantine-nightly/tests/test_integration_da.cc(231): Leaving test case "integration_3D_da_ray_add_material"; testing time: 3774400us
2: Leaving test module "Integration_Data_Assimilation"; testing time: 94179369us
2: 
 1/48 Test  #2: test_integration_da_1 ....................   Passed   97.44 sec
test 3
      Start  3: test_integration_da_2

3: Test command: /usr/bin/mpiexec "-n" "2" "/var/jenkins/workspace/adamantine-nightly/build/bin/test_integration_da"
3: Working Directory: /var/jenkins/workspace/adamantine-nightly/build/tests
3: Test timeout computed to be: 7200
3: Running 3 test cases...
3: Entering test module "Integration_Data_Assimilation"
3: /var/jenkins/workspace/adamantine-nightly/tests/test_integration_da.cc(78): Entering test case "integration_data_assimilation"
3: Running 3 test cases...
3: Entering test module "Integration_Data_Assimilation"
3: /var/jenkins/workspace/adamantine-nightly/tests/test_integration_da.cc(78): Entering test case "integration_data_assimilation"
3: Reading the experimental log file...
3: Done. Log entries found for 1 camera(s), with 2 frame(s).
3: Starting the main time stepping loop...
3: 10% completed
3: Rank: 1 | Old parameters for member 2: 
3: Rank: 1 | Number expt sites mapped to DOFs: 1
3: 20% completed
3: 30% completed
3: 40% completed
3: Performing data assimilation at time 0.0211...
3: Rank: 0 | Old parameters for member 0: 
3: Rank: 0 | Old parameters for member 1: 
3: Rank: 0 | Number expt sites mapped to DOFs: 1
3: Getting the perturbed innovation...
3: Applying the Kalman gain...
3: Updating the ensemble members...
3: Done.
3: 50% completed
3: Rank: 1 | Old parameters for member 2: 
3: Rank: 1 | Number expt sites mapped to DOFs: 1
3: 60% completed
3: Performing data assimilation at time 0.0316...
3: Rank: 0 | Old parameters for member 0: 
3: Rank: 0 | Old parameters for member 1: 
3: Rank: 0 | Number expt sites mapped to DOFs: 1
3: Getting the perturbed innovation...
3: Applying the Kalman gain...
3: Updating the ensemble members...
3: Done.
3: 70% completed
3: 80% completed
3: 90% completed
3: 100% completed
3: Reading the experimental log file...
3: Done. Log entries found for 1 camera(s), with 2 frame(s).
3: Reading the experimental log file...
3: Done. Log entries found for 1 camera(s), with 2 frame(s).
3: Starting the main time stepping loop...
3: Starting the main time stepping loop...
3: 10% completed
3: 10% completed
3: 20% completed
3: 20% completed
3: 30% completed
3: 30% completed
3: 40% completed
3: 40% completed
3: Performing data assimilation at time 0.0211...
3: Rank: 0 | Old parameters for member 0: 
3: Rank: 0 | Old parameters for member 1: 
3: Rank: 0 | Old parameters for member 2: 
3: Rank: 0 | Number expt sites mapped to DOFs: 1
3: Performing data assimilation at time 0.0211...
3: Rank: 0 | Old parameters for member 0: 
3: Rank: 0 | Old parameters for member 1: 
3: Rank: 0 | Old parameters for member 2: 
3: Rank: 0 | Number expt sites mapped to DOFs: 1
3: Getting the perturbed innovation...
3: Applying the Kalman gain...
3: Getting the perturbed innovation...
3: Applying the Kalman gain...
3: Updating the ensemble members...
3: Done.
3: Updating the ensemble members...
3: Done.
3: 50% completed
3: 50% completed
3: 60% completed
3: 60% completed
3: Performing data assimilation at time 0.0316...
3: Rank: 0 | Old parameters for member 0: 
3: Rank: 0 | Old parameters for member 1: 
3: Rank: 0 | Old parameters for member 2: 
3: Rank: 0 | Number expt sites mapped to DOFs: 1
3: Performing data assimilation at time 0.0316...
3: Rank: 0 | Old parameters for member 0: 
3: Rank: 0 | Old parameters for member 1: 
3: Rank: 0 | Old parameters for member 2: 
3: Rank: 0 | Number expt sites mapped to DOFs: 1
3: Getting the perturbed innovation...
3: Applying the Kalman gain...
3: Getting the perturbed innovation...
3: Applying the Kalman gain...
3: Updating the ensemble members...
3: Done.
3: Updating the ensemble members...
3: Done.
3: 70% completed
3: 70% completed
3: 80% completed
3: 80% completed
3: 90% completed
3: 90% completed
3: 100% completed
3: /var/jenkins/workspace/adamantine-nightly/tests/test_integration_da.cc(78): Leaving test case "integration_data_assimilation"; testing time: 76028096us
3: /var/jenkins/workspace/adamantine-nightly/tests/test_integration_da.cc(148): Entering test case "integration_3D_da_point_cloud_add_material"
3: 100% completed
3: /var/jenkins/workspace/adamantine-nightly/tests/test_integration_da.cc(78): Leaving test case "integration_data_assimilation"; testing time: 76487333us
3: /var/jenkins/workspace/adamantine-nightly/tests/test_integration_da.cc(148): Entering test case "integration_3D_da_point_cloud_add_material"
3: Reading the experimental log file...
3: Done. Log entries found for 1 camera(s), with 1 frame(s).
3: Starting the main time stepping loop...
3: Rank: 1 | Old parameters for member 2: 
3: Rank: 1 | Number expt sites mapped to DOFs: 1
3: 10% completed
3: 20% completed
3: 30% completed
3: 40% completed
3: 50% completed
3: Performing data assimilation at time 0.12...
3: Rank: 0 | Old parameters for member 0: 
3: Rank: 0 | Old parameters for member 1: 
3: Rank: 0 | Number expt sites mapped to DOFs: 1
3: Getting the perturbed innovation...
3: Applying the Kalman gain...
3: Updating the ensemble members...
3: Done.
3: 60% completed
3: 70% completed
3: 80% completed
3: 90% completed
3: 100% completed
3: Reading the experimental log file...
3: Done. Log entries found for 1 camera(s), with 1 frame(s).
3: Reading the experimental log file...
3: Done. Log entries found for 1 camera(s), with 1 frame(s).
3: Starting the main time stepping loop...
3: Starting the main time stepping loop...
3: 10% completed
3: 10% completed
3: 20% completed
3: 20% completed
3: 30% completed
3: 30% completed
3: 40% completed
3: 40% completed
3: 50% completed
3: 50% completed
3: Performing data assimilation at time 0.12...
3: Rank: 0 | Old parameters for member 0: 
3: Rank: 0 | Old parameters for member 1: 
3: Rank: 0 | Old parameters for member 2: 
3: Performing data assimilation at time 0.12...
3: Rank: 0 | Old parameters for member 0: 
3: Rank: 0 | Old parameters for member 1: 
3: Rank: 0 | Old parameters for member 2: 
3: Rank: 0 | Number expt sites mapped to DOFs: 1
3: Rank: 0 | Number expt sites mapped to DOFs: 1
3: Getting the perturbed innovation...
3: Applying the Kalman gain...
3: Getting the perturbed innovation...
3: Applying the Kalman gain...
3: Updating the ensemble members...
3: Done.
3: 60% completed
3: Updating the ensemble members...
3: Done.
3: 60% completed
3: 70% completed
3: 70% completed
3: 80% completed
3: 80% completed
3: 90% completed
3: 90% completed
3: 100% completed
3: 100% completed
3: /var/jenkins/workspace/adamantine-nightly/tests/test_integration_da.cc(148): Leaving test case "integration_3D_da_point_cloud_add_material"; testing time: 3569126us
3: /var/jenkins/workspace/adamantine-nightly/tests/test_integration_da.cc(231): Entering test case "integration_3D_da_ray_add_material"
3: /var/jenkins/workspace/adamantine-nightly/tests/test_integration_da.cc(148): Leaving test case "integration_3D_da_point_cloud_add_material"; testing time: 4030367us
3: /var/jenkins/workspace/adamantine-nightly/tests/test_integration_da.cc(231): Entering test case "integration_3D_da_ray_add_material"
3: Reading the experimental log file...
3: Done. Log entries found for 1 camera(s), with 1 frame(s).
3: Starting the main time stepping loop...
3: Rank: 1 | Old parameters for member 2: 
3: Rank: 1 | Number expt sites mapped to DOFs: 1
3: 10% completed
3: 20% completed
3: 30% completed
3: 40% completed
3: 50% completed
3: Performing data assimilation at time 0.12...
3: Rank: 0 | Old parameters for member 0: 
3: Rank: 0 | Old parameters for member 1: 
3: Rank: 0 | Number expt sites mapped to DOFs: 1
3: Getting the perturbed innovation...
3: Applying the Kalman gain...
3: Updating the ensemble members...
3: Done.
3: 60% completed
3: 70% completed
3: 80% completed
3: 90% completed
3: 100% completed
3: Reading the experimental log file...
3: Done. Log entries found for 1 camera(s), with 1 frame(s).
3: Reading the experimental log file...
3: Done. Log entries found for 1 camera(s), with 1 frame(s).
3: Starting the main time stepping loop...
3: Starting the main time stepping loop...
3: 10% completed
3: 10% completed
3: 20% completed
3: 20% completed
3: 30% completed
3: 30% completed
3: 40% completed
3: 40% completed
3: 50% completed
3: 50% completed
3: Performing data assimilation at time 0.12...
3: Rank: 0 | Old parameters for member 0: 
3: Rank: 0 | Old parameters for member 1: 
3: Rank: 0 | Old parameters for member 2: 
3: Rank: 0 | Number expt sites mapped to DOFs: 1
3: Performing data assimilation at time 0.12...
3: Rank: 0 | Old parameters for member 0: 
3: Rank: 0 | Old parameters for member 1: 
3: Rank: 0 | Old parameters for member 2: 
3: Rank: 0 | Number expt sites mapped to DOFs: 1
3: Getting the perturbed innovation...
3: Applying the Kalman gain...
3: Getting the perturbed innovation...
3: Applying the Kalman gain...
3: Updating the ensemble members...
3: Done.
3: 60% completed
3: Updating the ensemble members...
3: Done.
3: 60% completed
3: 70% completed
3: 70% completed
3: 80% completed
3: 80% completed
3: 90% completed
3: 90% completed
3: 100% completed
3: 100% completed
3: 
3: *** No errors detected
3: /var/jenkins/workspace/adamantine-nightly/tests/test_integration_da.cc(231): Leaving test case "integration_3D_da_ray_add_material"; testing time: 3351847us
3: Leaving test module "Integration_Data_Assimilation"; testing time: 83408488us
3: /var/jenkins/workspace/adamantine-nightly/tests/test_integration_da.cc(231): Leaving test case "integration_3D_da_ray_add_material"; testing time: 3351769us
3: Leaving test module "Integration_Data_Assimilation"; testing time: 83410407us
3: 
3: *** No errors detected
3: 
 2/48 Test  #3: test_integration_da_2 ....................   Passed   84.58 sec
test 4
      Start  4: test_integration_da_3

4: Test command: /usr/bin/mpiexec "-n" "3" "/var/jenkins/workspace/adamantine-nightly/build/bin/test_integration_da"
4: Working Directory: /var/jenkins/workspace/adamantine-nightly/build/tests
4: Test timeout computed to be: 7200
4: Running 3 test cases...
4: Entering test module "Integration_Data_Assimilation"
4: /var/jenkins/workspace/adamantine-nightly/tests/test_integration_da.cc(78): Entering test case "integration_data_assimilation"
4: Running 3 test cases...
4: Entering test module "Integration_Data_Assimilation"
4: /var/jenkins/workspace/adamantine-nightly/tests/test_integration_da.cc(78): Entering test case "integration_data_assimilation"
4: Running 3 test cases...
4: Entering test module "Integration_Data_Assimilation"
4: /var/jenkins/workspace/adamantine-nightly/tests/test_integration_da.cc(78): Entering test case "integration_data_assimilation"
4: Reading the experimental log file...
4: Done. Log entries found for 1 camera(s), with 2 frame(s).
4: Starting the main time stepping loop...
4: 10% completed
4: 20% completed
4: 30% completed
4: 40% completed
4: Rank: 2 | Old parameters for member 2: 
4: Rank: 1 | Old parameters for member 1: 
4: Rank: 2 | Number expt sites mapped to DOFs: 1
4: Rank: 1 | Number expt sites mapped to DOFs: 1
4: Performing data assimilation at time 0.0211...
4: Rank: 0 | Old parameters for member 0: 
4: Rank: 0 | Number expt sites mapped to DOFs: 1
4: Getting the perturbed innovation...
4: Applying the Kalman gain...
4: Updating the ensemble members...
4: Done.
4: 50% completed
4: 60% completed
4: Rank: 1 | Old parameters for member 1: 
4: Rank: 2 | Old parameters for member 2: 
4: Rank: 1 | Number expt sites mapped to DOFs: 1
4: Rank: 2 | Number expt sites mapped to DOFs: 1
4: Performing data assimilation at time 0.0316...
4: Rank: 0 | Old parameters for member 0: 
4: Rank: 0 | Number expt sites mapped to DOFs: 1
4: Getting the perturbed innovation...
4: Applying the Kalman gain...
4: Updating the ensemble members...
4: Done.
4: 70% completed
4: 80% completed
4: 90% completed
4: 100% completed
4: Reading the experimental log file...
4: Done. Log entries found for 1 camera(s), with 2 frame(s).
4: Reading the experimental log file...
4: Done. Log entries found for 1 camera(s), with 2 frame(s).
4: Reading the experimental log file...
4: Done. Log entries found for 1 camera(s), with 2 frame(s).
4: Starting the main time stepping loop...
4: Starting the main time stepping loop...
4: Starting the main time stepping loop...
4: 10% completed
4: 10% completed
4: 10% completed
4: 20% completed
4: 20% completed
4: 20% completed
4: 30% completed
4: 30% completed
4: 30% completed
4: 40% completed
4: 40% completed
4: 40% completed
4: Performing data assimilation at time 0.0211...
4: Rank: 0 | Old parameters for member 0: 
4: Rank: 0 | Old parameters for member 1: 
4: Rank: 0 | Old parameters for member 2: 
4: Performing data assimilation at time 0.0211...
4: Rank: 0 | Old parameters for member 0: 
4: Rank: 0 | Old parameters for member 1: 
4: Rank: 0 | Old parameters for member 2: 
4: Rank: 0 | Number expt sites mapped to DOFs: 1
4: Rank: 0 | Number expt sites mapped to DOFs: 1
4: Performing data assimilation at time 0.0211...
4: Rank: 0 | Old parameters for member 0: 
4: Rank: 0 | Old parameters for member 1: 
4: Rank: 0 | Old parameters for member 2: 
4: Rank: 0 | Number expt sites mapped to DOFs: 1
4: Getting the perturbed innovation...
4: Applying the Kalman gain...
4: Getting the perturbed innovation...
4: Applying the Kalman gain...
4: Getting the perturbed innovation...
4: Applying the Kalman gain...
4: Updating the ensemble members...
4: Done.
4: Updating the ensemble members...
4: Done.
4: Updating the ensemble members...
4: Done.
4: 50% completed
4: 50% completed
4: 50% completed
4: 60% completed
4: 60% completed
4: 60% completed
4: Performing data assimilation at time 0.0316...
4: Rank: 0 | Old parameters for member 0: 
4: Rank: 0 | Old parameters for member 1: 
4: Rank: 0 | Old parameters for member 2: 
4: Rank: 0 | Number expt sites mapped to DOFs: 1
4: Performing data assimilation at time 0.0316...
4: Rank: 0 | Old parameters for member 0: 
4: Rank: 0 | Old parameters for member 1: 
4: Rank: 0 | Old parameters for member 2: 
4: Rank: 0 | Number expt sites mapped to DOFs: 1
4: Performing data assimilation at time 0.0316...
4: Rank: 0 | Old parameters for member 0: 
4: Rank: 0 | Old parameters for member 1: 
4: Rank: 0 | Old parameters for member 2: 
4: Rank: 0 | Number expt sites mapped to DOFs: 1
4: Getting the perturbed innovation...
4: Applying the Kalman gain...
4: Getting the perturbed innovation...
4: Applying the Kalman gain...
4: Getting the perturbed innovation...
4: Applying the Kalman gain...
4: Updating the ensemble members...
4: Done.
4: Updating the ensemble members...
4: Done.
4: Updating the ensemble members...
4: Done.
4: 70% completed
4: 70% completed
4: 70% completed
4: 80% completed
4: 80% completed
4: 80% completed
4: 90% completed
4: 90% completed
4: 90% completed
4: 100% completed
4: 100% completed
4: /var/jenkins/workspace/adamantine-nightly/tests/test_integration_da.cc(78): Leaving test case "integration_data_assimilation"; testing time: 63186961us
4: /var/jenkins/workspace/adamantine-nightly/tests/test_integration_da.cc(148): Entering test case "integration_3D_da_point_cloud_add_material"
4: 100% completed
4: /var/jenkins/workspace/adamantine-nightly/tests/test_integration_da.cc(78): Leaving test case "integration_data_assimilation"; testing time: 63273903us
4: /var/jenkins/workspace/adamantine-nightly/tests/test_integration_da.cc(148): Entering test case "integration_3D_da_point_cloud_add_material"
4: /var/jenkins/workspace/adamantine-nightly/tests/test_integration_da.cc(78): Leaving test case "integration_data_assimilation"; testing time: 63499281us
4: /var/jenkins/workspace/adamantine-nightly/tests/test_integration_da.cc(148): Entering test case "integration_3D_da_point_cloud_add_material"
4: Reading the experimental log file...
4: Done. Log entries found for 1 camera(s), with 1 frame(s).
4: Starting the main time stepping loop...
4: 10% completed
4: 20% completed
4: 30% completed
4: 40% completed
4: 50% completed
4: Rank: 1 | Old parameters for member 1: 
4: Performing data assimilation at time 0.12...
4: Rank: 0 | Old parameters for member 0: 
4: Rank: 2 | Old parameters for member 2: 
4: Rank: 1 | Number expt sites mapped to DOFs: 1
4: Rank: 0 | Number expt sites mapped to DOFs: 1
4: Rank: 2 | Number expt sites mapped to DOFs: 1
4: Getting the perturbed innovation...
4: Applying the Kalman gain...
4: Updating the ensemble members...
4: Done.
4: 60% completed
4: 70% completed
4: 80% completed
4: 90% completed
4: 100% completed
4: Reading the experimental log file...
4: Done. Log entries found for 1 camera(s), with 1 frame(s).
4: Reading the experimental log file...
4: Done. Log entries found for 1 camera(s), with 1 frame(s).
4: Reading the experimental log file...
4: Done. Log entries found for 1 camera(s), with 1 frame(s).
4: Starting the main time stepping loop...
4: Starting the main time stepping loop...
4: Starting the main time stepping loop...
4: 10% completed
4: 10% completed
4: 10% completed
4: 20% completed
4: 20% completed
4: 20% completed
4: 30% completed
4: 30% completed
4: 30% completed
4: 40% completed
4: 40% completed
4: 40% completed
4: 50% completed
4: 50% completed
4: 50% completed
4: Performing data assimilation at time 0.12...
4: Rank: 0 | Old parameters for member 0: 
4: Rank: 0 | Old parameters for member 1: 
4: Rank: 0 | Old parameters for member 2: 
4: Rank: 0 | Number expt sites mapped to DOFs: 1
4: Performing data assimilation at time 0.12...
4: Rank: 0 | Old parameters for member 0: 
4: Rank: 0 | Old parameters for member 1: 
4: Rank: 0 | Old parameters for member 2: 
4: Rank: 0 | Number expt sites mapped to DOFs: 1
4: Performing data assimilation at time 0.12...
4: Rank: 0 | Old parameters for member 0: 
4: Rank: 0 | Old parameters for member 1: 
4: Rank: 0 | Old parameters for member 2: 
4: Rank: 0 | Number expt sites mapped to DOFs: 1
4: Getting the perturbed innovation...
4: Applying the Kalman gain...
4: Getting the perturbed innovation...
4: Applying the Kalman gain...
4: Getting the perturbed innovation...
4: Applying the Kalman gain...
4: Updating the ensemble members...
4: Done.
4: 60% completed
4: Updating the ensemble members...
4: Done.
4: 60% completed
4: Updating the ensemble members...
4: Done.
4: 60% completed
4: 70% completed
4: 70% completed
4: 70% completed
4: 80% completed
4: 80% completed
4: 80% completed
4: 90% completed
4: 90% completed
4: 90% completed
4: 100% completed
4: 100% completed
4: 100% completed
4: /var/jenkins/workspace/adamantine-nightly/tests/test_integration_da.cc(148): Leaving test case "integration_3D_da_point_cloud_add_material"; testing time: 2758848us
4: /var/jenkins/workspace/adamantine-nightly/tests/test_integration_da.cc(231): Entering test case "integration_3D_da_ray_add_material"
4: /var/jenkins/workspace/adamantine-nightly/tests/test_integration_da.cc(148): Leaving test case "integration_3D_da_point_cloud_add_material"; testing time: 2465025us
4: /var/jenkins/workspace/adamantine-nightly/tests/test_integration_da.cc(231): Entering test case "integration_3D_da_ray_add_material"
4: /var/jenkins/workspace/adamantine-nightly/tests/test_integration_da.cc(148): Leaving test case "integration_3D_da_point_cloud_add_material"; testing time: 2700470us
4: /var/jenkins/workspace/adamantine-nightly/tests/test_integration_da.cc(231): Entering test case "integration_3D_da_ray_add_material"
4: Reading the experimental log file...
4: Done. Log entries found for 1 camera(s), with 1 frame(s).
4: Starting the main time stepping loop...
4: 10% completed
4: 20% completed
4: 30% completed
4: 40% completed
4: 50% completed
4: Rank: 2 | Old parameters for member 2: 
4: Rank: 2 | Number expt sites mapped to DOFs: 1
4: Performing data assimilation at time 0.12...
4: Rank: 0 | Old parameters for member 0: 
4: Rank: 1 | Old parameters for member 1: 
4: Rank: 0 | Number expt sites mapped to DOFs: 1
4: Rank: 1 | Number expt sites mapped to DOFs: 1
4: Getting the perturbed innovation...
4: Applying the Kalman gain...
4: Updating the ensemble members...
4: Done.
4: 60% completed
4: 70% completed
4: 80% completed
4: 90% completed
4: 100% completed
4: Reading the experimental log file...
4: Done. Log entries found for 1 camera(s), with 1 frame(s).
4: Reading the experimental log file...
4: Done. Log entries found for 1 camera(s), with 1 frame(s).
4: Reading the experimental log file...
4: Done. Log entries found for 1 camera(s), with 1 frame(s).
4: Starting the main time stepping loop...
4: Starting the main time stepping loop...
4: Starting the main time stepping loop...
4: 10% completed
4: 10% completed
4: 10% completed
4: 20% completed
4: 20% completed
4: 20% completed
4: 30% completed
4: 30% completed
4: 30% completed
4: 40% completed
4: 40% completed
4: 40% completed
4: 50% completed
4: 50% completed
4: 50% completed
4: Performing data assimilation at time 0.12...
4: Rank: 0 | Old parameters for member 0: 
4: Rank: 0 | Old parameters for member 1: 
4: Rank: 0 | Old parameters for member 2: 
4: Rank: 0 | Number expt sites mapped to DOFs: 1
4: Performing data assimilation at time 0.12...
4: Rank: 0 | Old parameters for member 0: 
4: Rank: 0 | Old parameters for member 1: 
4: Rank: 0 | Old parameters for member 2: 
4: Performing data assimilation at time 0.12...
4: Rank: 0 | Old parameters for member 0: 
4: Rank: 0 | Old parameters for member 1: 
4: Rank: 0 | Old parameters for member 2: 
4: Rank: 0 | Number expt sites mapped to DOFs: 1
4: Rank: 0 | Number expt sites mapped to DOFs: 1
4: Getting the perturbed innovation...
4: Applying the Kalman gain...
4: Getting the perturbed innovation...
4: Applying the Kalman gain...
4: Getting the perturbed innovation...
4: Applying the Kalman gain...
4: Updating the ensemble members...
4: Done.
4: 60% completed
4: Updating the ensemble members...
4: Done.
4: 60% completed
4: Updating the ensemble members...
4: Done.
4: 60% completed
4: 70% completed
4: 70% completed
4: 70% completed
4: 80% completed
4: 80% completed
4: 80% completed
4: 90% completed
4: 90% completed
4: 90% completed
4: 100% completed
4: 100% completed
4: 100% completed
4: 
4: *** No errors detected
4: /var/jenkins/workspace/adamantine-nightly/tests/test_integration_da.cc(231): Leaving test case "integration_3D_da_ray_add_material"; testing time: 2492022us
4: Leaving test module "Integration_Data_Assimilation"; testing time: 68456479us
4: /var/jenkins/workspace/adamantine-nightly/tests/test_integration_da.cc(231): Leaving test case "integration_3D_da_ray_add_material"; testing time: 2521591us
4: Leaving test module "Integration_Data_Assimilation"; testing time: 68496112us
4: 
4: *** No errors detected
4: /var/jenkins/workspace/adamantine-nightly/tests/test_integration_da.cc(231): Leaving test case "integration_3D_da_ray_add_material"; testing time: 2547443us
4: Leaving test module "Integration_Data_Assimilation"; testing time: 68493390us
4: 
4: *** No errors detected
4: 
 3/48 Test  #4: test_integration_da_3 ....................   Passed   69.81 sec
test 5
      Start  5: test_integration_da_6

5: Test command: /usr/bin/mpiexec "-n" "6" "/var/jenkins/workspace/adamantine-nightly/build/bin/test_integration_da"
5: Working Directory: /var/jenkins/workspace/adamantine-nightly/build/tests
5: Test timeout computed to be: 7200
5: Running 3 test cases...
5: Entering test module "Integration_Data_Assimilation"
5: /var/jenkins/workspace/adamantine-nightly/tests/test_integration_da.cc(78): Entering test case "integration_data_assimilation"
5: Running 3 test cases...
5: Entering test module "Integration_Data_Assimilation"
5: /var/jenkins/workspace/adamantine-nightly/tests/test_integration_da.cc(78): Entering test case "integration_data_assimilation"
5: Running 3 test cases...
5: Entering test module "Integration_Data_Assimilation"
5: /var/jenkins/workspace/adamantine-nightly/tests/test_integration_da.cc(78): Entering test case "integration_data_assimilation"
5: Running 3 test cases...
5: Entering test module "Integration_Data_Assimilation"
5: /var/jenkins/workspace/adamantine-nightly/tests/test_integration_da.cc(78): Entering test case "integration_data_assimilation"
5: Running 3 test cases...
5: Entering test module "Integration_Data_Assimilation"
5: /var/jenkins/workspace/adamantine-nightly/tests/test_integration_da.cc(78): Entering test case "integration_data_assimilation"
5: Running 3 test cases...
5: Entering test module "Integration_Data_Assimilation"
5: /var/jenkins/workspace/adamantine-nightly/tests/test_integration_da.cc(78): Entering test case "integration_data_assimilation"
5: Reading the experimental log file...
5: Done. Log entries found for 1 camera(s), with 2 frame(s).
5: Starting the main time stepping loop...
5: 10% completed
5: 20% completed
5: 30% completed
5: 40% completed
5: Rank: 2 | Old parameters for member 1: 
5: Rank: 3 | Old parameters for member 1: 
5: Rank: 5 | Old parameters for member 2: 
5: Rank: 4 | Old parameters for member 2: 
5: Rank: 3 | Number expt sites mapped to DOFs: 1
5: Rank: 2 | Number expt sites mapped to DOFs: 1
5: Rank: 4 | Number expt sites mapped to DOFs: 1
5: Rank: 5 | Number expt sites mapped to DOFs: 1
5: Performing data assimilation at time 0.0211...
5: Rank: 0 | Old parameters for member 0: 
5: Rank: 1 | Old parameters for member 0: 
5: Rank: 1 | Number expt sites mapped to DOFs: 1
5: Rank: 0 | Number expt sites mapped to DOFs: 1
5: Getting the perturbed innovation...
5: Applying the Kalman gain...
5: Updating the ensemble members...
5: Done.
5: 50% completed
5: 60% completed
5: Rank: 3 | Old parameters for member 1: 
5: Rank: 2 | Old parameters for member 1: 
5: Rank: 2 | Number expt sites mapped to DOFs: 1
5: Rank: 3 | Number expt sites mapped to DOFs: 1
5: Performing data assimilation at time 0.0316...
5: Rank: 0 | Old parameters for member 0: 
5: Rank: 1 | Old parameters for member 0: 
5: Rank: 5 | Old parameters for member 2: 
5: Rank: 4 | Old parameters for member 2: 
5: Rank: 1 | Number expt sites mapped to DOFs: 1
5: Rank: 0 | Number expt sites mapped to DOFs: 1
5: Rank: 4 | Number expt sites mapped to DOFs: 1
5: Rank: 5 | Number expt sites mapped to DOFs: 1
5: Getting the perturbed innovation...
5: Applying the Kalman gain...
5: Updating the ensemble members...
5: Done.
5: 70% completed
5: 80% completed
5: 90% completed
5: 100% completed
5: Reading the experimental log file...
5: Done. Log entries found for 1 camera(s), with 2 frame(s).
5: Reading the experimental log file...
5: Done. Log entries found for 1 camera(s), with 2 frame(s).
5: Reading the experimental log file...
5: Done. Log entries found for 1 camera(s), with 2 frame(s).
5: Reading the experimental log file...
5: Done. Log entries found for 1 camera(s), with 2 frame(s).
5: Reading the experimental log file...
5: Done. Log entries found for 1 camera(s), with 2 frame(s).
5: Reading the experimental log file...
5: Done. Log entries found for 1 camera(s), with 2 frame(s).
5: Starting the main time stepping loop...
5: Starting the main time stepping loop...
5: Starting the main time stepping loop...
5: Starting the main time stepping loop...
5: Starting the main time stepping loop...
5: Starting the main time stepping loop...
5: 10% completed
5: 10% completed
5: 10% completed
5: 10% completed
5: 10% completed
5: 10% completed
5: 20% completed
5: 20% completed
5: 20% completed
5: 20% completed
5: 20% completed
5: 20% completed
5: 30% completed
5: 30% completed
5: 30% completed
5: 30% completed
5: 30% completed
5: 30% completed
5: 40% completed
5: 40% completed
5: 40% completed
5: 40% completed
5: 40% completed
5: 40% completed
5: Performing data assimilation at time 0.0211...
5: Rank: 0 | Old parameters for member 0: 
5: Rank: 0 | Old parameters for member 1: 
5: Rank: 0 | Old parameters for member 2: 
5: Rank: 0 | Number expt sites mapped to DOFs: 1
5: Performing data assimilation at time 0.0211...
5: Rank: 0 | Old parameters for member 0: 
5: Rank: 0 | Old parameters for member 1: 
5: Rank: 0 | Old parameters for member 2: 
5: Rank: 0 | Number expt sites mapped to DOFs: 1
5: Performing data assimilation at time 0.0211...
5: Rank: 0 | Old parameters for member 0: 
5: Rank: 0 | Old parameters for member 1: 
5: Rank: 0 | Old parameters for member 2: 
5: Performing data assimilation at time 0.0211...
5: Rank: 0 | Old parameters for member 0: 
5: Rank: 0 | Old parameters for member 1: 
5: Rank: 0 | Old parameters for member 2: 
5: Rank: 0 | Number expt sites mapped to DOFs: 1
5: Performing data assimilation at time 0.0211...
5: Rank: 0 | Old parameters for member 0: 
5: Rank: 0 | Old parameters for member 1: 
5: Rank: 0 | Old parameters for member 2: 
5: Rank: 0 | Number expt sites mapped to DOFs: 1
5: Rank: 0 | Number expt sites mapped to DOFs: 1
5: Performing data assimilation at time 0.0211...
5: Rank: 0 | Old parameters for member 0: 
5: Rank: 0 | Old parameters for member 1: 
5: Rank: 0 | Old parameters for member 2: 
5: Rank: 0 | Number expt sites mapped to DOFs: 1
5: Getting the perturbed innovation...
5: Applying the Kalman gain...
5: Getting the perturbed innovation...
5: Applying the Kalman gain...
5: Getting the perturbed innovation...
5: Applying the Kalman gain...
5: Getting the perturbed innovation...
5: Applying the Kalman gain...
5: Getting the perturbed innovation...
5: Applying the Kalman gain...
5: Getting the perturbed innovation...
5: Applying the Kalman gain...
5: Updating the ensemble members...
5: Done.
5: Updating the ensemble members...
5: Done.
5: Updating the ensemble members...
5: Done.
5: Updating the ensemble members...
5: Done.
5: Updating the ensemble members...
5: Done.
5: Updating the ensemble members...
5: Done.
5: 50% completed
5: 50% completed
5: 50% completed
5: 50% completed
5: 50% completed
5: 50% completed
5: 60% completed
5: 60% completed
5: 60% completed
5: 60% completed
5: 60% completed
5: 60% completed
5: Performing data assimilation at time 0.0316...
5: Rank: 0 | Old parameters for member 0: 
5: Rank: 0 | Old parameters for member 1: 
5: Rank: 0 | Old parameters for member 2: 
5: Performing data assimilation at time 0.0316...
5: Rank: 0 | Old parameters for member 0: 
5: Rank: 0 | Old parameters for member 1: 
5: Rank: 0 | Old parameters for member 2: 
5: Rank: 0 | Number expt sites mapped to DOFs: 1
5: Rank: 0 | Number expt sites mapped to DOFs: 1
5: Performing data assimilation at time 0.0316...
5: Rank: 0 | Old parameters for member 0: 
5: Rank: 0 | Old parameters for member 1: 
5: Rank: 0 | Old parameters for member 2: 
5: Performing data assimilation at time 0.0316...
5: Rank: 0 | Old parameters for member 0: 
5: Rank: 0 | Old parameters for member 1: 
5: Rank: 0 | Old parameters for member 2: 
5: Rank: 0 | Number expt sites mapped to DOFs: 1
5: Rank: 0 | Number expt sites mapped to DOFs: 1
5: Performing data assimilation at time 0.0316...
5: Rank: 0 | Old parameters for member 0: 
5: Rank: 0 | Old parameters for member 1: 
5: Rank: 0 | Old parameters for member 2: 
5: Rank: 0 | Number expt sites mapped to DOFs: 1
5: Performing data assimilation at time 0.0316...
5: Rank: 0 | Old parameters for member 0: 
5: Rank: 0 | Old parameters for member 1: 
5: Rank: 0 | Old parameters for member 2: 
5: Rank: 0 | Number expt sites mapped to DOFs: 1
5: Getting the perturbed innovation...
5: Applying the Kalman gain...
5: Getting the perturbed innovation...
5: Applying the Kalman gain...
5: Getting the perturbed innovation...
5: Applying the Kalman gain...
5: Getting the perturbed innovation...
5: Applying the Kalman gain...
5: Getting the perturbed innovation...
5: Applying the Kalman gain...
5: Getting the perturbed innovation...
5: Applying the Kalman gain...
5: Updating the ensemble members...
5: Updating the ensemble members...
5: Done.
5: Done.
5: Updating the ensemble members...
5: Updating the ensemble members...
5: Done.
5: Done.
5: Updating the ensemble members...
5: Done.
5: Updating the ensemble members...
5: Done.
5: 70% completed
5: 70% completed
5: 70% completed
5: 70% completed
5: 70% completed
5: 70% completed
5: 80% completed
5: 80% completed
5: 80% completed
5: 80% completed
5: 80% completed
5: 80% completed
5: 90% completed
5: 90% completed
5: 90% completed
5: 90% completed
5: 90% completed
5: 90% completed
5: 100% completed
5: 100% completed
5: 100% completed
5: 100% completed
5: 100% completed
5: /var/jenkins/workspace/adamantine-nightly/tests/test_integration_da.cc(78): Leaving test case "integration_data_assimilation"; testing time: 58107148us
5: /var/jenkins/workspace/adamantine-nightly/tests/test_integration_da.cc(148): Entering test case "integration_3D_da_point_cloud_add_material"
5: /var/jenkins/workspace/adamantine-nightly/tests/test_integration_da.cc(78): Leaving test case "integration_data_assimilation"; testing time: 58121664us
5: /var/jenkins/workspace/adamantine-nightly/tests/test_integration_da.cc(148): Entering test case "integration_3D_da_point_cloud_add_material"
5: /var/jenkins/workspace/adamantine-nightly/tests/test_integration_da.cc(78): Leaving test case "integration_data_assimilation"; testing time: 58168924us
5: /var/jenkins/workspace/adamantine-nightly/tests/test_integration_da.cc(148): Entering test case "integration_3D_da_point_cloud_add_material"
5: /var/jenkins/workspace/adamantine-nightly/tests/test_integration_da.cc(78): Leaving test case "integration_data_assimilation"; testing time: 58265242us
5: /var/jenkins/workspace/adamantine-nightly/tests/test_integration_da.cc(148): Entering test case "integration_3D_da_point_cloud_add_material"
5: /var/jenkins/workspace/adamantine-nightly/tests/test_integration_da.cc(78): Leaving test case "integration_data_assimilation"; testing time: 58300902us
5: /var/jenkins/workspace/adamantine-nightly/tests/test_integration_da.cc(148): Entering test case "integration_3D_da_point_cloud_add_material"
5: 100% completed
5: /var/jenkins/workspace/adamantine-nightly/tests/test_integration_da.cc(78): Leaving test case "integration_data_assimilation"; testing time: 58673964us
5: /var/jenkins/workspace/adamantine-nightly/tests/test_integration_da.cc(148): Entering test case "integration_3D_da_point_cloud_add_material"
5: Reading the experimental log file...
5: Done. Log entries found for 1 camera(s), with 1 frame(s).
5: Starting the main time stepping loop...
5: 10% completed
5: 20% completed
5: 30% completed
5: 40% completed
5: 50% completed
5: Performing data assimilation at time 0.12...
5: Rank: 0 | Old parameters for member 0: 
5: Rank: 1 | Old parameters for member 0: 
5: Rank: 4 | Old parameters for member 2: 
5: Rank: 2 | Old parameters for member 1: 
5: Rank: 5 | Old parameters for member 2: 
5: Rank: 3 | Old parameters for member 1: 
5: Rank: 1 | Number expt sites mapped to DOFs: 1
5: Rank: 0 | Number expt sites mapped to DOFs: 1
5: Rank: 2 | Number expt sites mapped to DOFs: 1
5: Rank: 3 | Number expt sites mapped to DOFs: 1
5: Rank: 5 | Number expt sites mapped to DOFs: 1
5: Rank: 4 | Number expt sites mapped to DOFs: 1
5: Getting the perturbed innovation...
5: Applying the Kalman gain...
5: Updating the ensemble members...
5: Done.
5: 60% completed
5: 70% completed
5: 80% completed
5: 90% completed
5: 100% completed
5: Reading the experimental log file...
5: Done. Log entries found for 1 camera(s), with 1 frame(s).
5: Reading the experimental log file...
5: Done. Log entries found for 1 camera(s), with 1 frame(s).
5: Reading the experimental log file...
5: Done. Log entries found for 1 camera(s), with 1 frame(s).
5: Reading the experimental log file...
5: Done. Log entries found for 1 camera(s), with 1 frame(s).
5: Reading the experimental log file...
5: Done. Log entries found for 1 camera(s), with 1 frame(s).
5: Reading the experimental log file...
5: Done. Log entries found for 1 camera(s), with 1 frame(s).
5: Starting the main time stepping loop...
5: Starting the main time stepping loop...
5: Starting the main time stepping loop...
5: Starting the main time stepping loop...
5: Starting the main time stepping loop...
5: Starting the main time stepping loop...
5: 10% completed
5: 10% completed
5: 10% completed
5: 10% completed
5: 10% completed
5: 20% completed
5: 10% completed
5: 20% completed
5: 20% completed
5: 20% completed
5: 30% completed
5: 20% completed
5: 20% completed
5: 30% completed
5: 30% completed
5: 30% completed
5: 40% completed
5: 30% completed
5: 40% completed
5: 30% completed
5: 40% completed
5: 40% completed
5: 50% completed
5: 40% completed
5: 50% completed
5: 40% completed
5: 50% completed
5: 50% completed
5: Performing data assimilation at time 0.12...
5: Rank: 0 | Old parameters for member 0: 
5: Rank: 0 | Old parameters for member 1: 
5: Rank: 0 | Old parameters for member 2: 
5: Rank: 0 | Number expt sites mapped to DOFs: 1
5: 50% completed
5: Performing data assimilation at time 0.12...
5: Rank: 0 | Old parameters for member 0: 
5: Rank: 0 | Old parameters for member 1: 
5: Rank: 0 | Old parameters for member 2: 
5: Rank: 0 | Number expt sites mapped to DOFs: 1
5: Performing data assimilation at time 0.12...
5: Rank: 0 | Old parameters for member 0: 
5: Rank: 0 | Old parameters for member 1: 
5: Rank: 0 | Old parameters for member 2: 
5: 50% completed
5: Performing data assimilation at time 0.12...
5: Rank: 0 | Old parameters for member 0: 
5: Rank: 0 | Old parameters for member 1: 
5: Rank: 0 | Old parameters for member 2: 
5: Rank: 0 | Number expt sites mapped to DOFs: 1
5: Rank: 0 | Number expt sites mapped to DOFs: 1
5: Performing data assimilation at time 0.12...
5: Rank: 0 | Old parameters for member 0: 
5: Rank: 0 | Old parameters for member 1: 
5: Rank: 0 | Old parameters for member 2: 
5: Rank: 0 | Number expt sites mapped to DOFs: 1
5: Performing data assimilation at time 0.12...
5: Rank: 0 | Old parameters for member 0: 
5: Rank: 0 | Old parameters for member 1: 
5: Rank: 0 | Old parameters for member 2: 
5: Rank: 0 | Number expt sites mapped to DOFs: 1
5: Getting the perturbed innovation...
5: Applying the Kalman gain...
5: Getting the perturbed innovation...
5: Applying the Kalman gain...
5: Getting the perturbed innovation...
5: Applying the Kalman gain...
5: Getting the perturbed innovation...
5: Applying the Kalman gain...
5: Getting the perturbed innovation...
5: Applying the Kalman gain...
5: Getting the perturbed innovation...
5: Applying the Kalman gain...
5: Updating the ensemble members...
5: Done.
5: 60% completed
5: Updating the ensemble members...
5: Done.
5: 60% completed
5: Updating the ensemble members...
5: Done.
5: 60% completed
5: Updating the ensemble members...
5: Done.
5: 60% completed
5: 70% completed
5: Updating the ensemble members...
5: Done.
5: 60% completed
5: 70% completed
5: 70% completed
5: Updating the ensemble members...
5: Done.
5: 60% completed
5: 70% completed
5: 80% completed
5: 70% completed
5: 80% completed
5: 80% completed
5: 80% completed
5: 70% completed
5: 90% completed
5: 80% completed
5: 90% completed
5: 90% completed
5: 90% completed
5: 80% completed
5: 90% completed
5: 90% completed
5: 100% completed
5: 100% completed
5: 100% completed
5: 100% completed
5: 100% completed
5: /var/jenkins/workspace/adamantine-nightly/tests/test_integration_da.cc(148): Leaving test case "integration_3D_da_point_cloud_add_material"; testing time: 2743015us
5: /var/jenkins/workspace/adamantine-nightly/tests/test_integration_da.cc(231): Entering test case "integration_3D_da_ray_add_material"
5: /var/jenkins/workspace/adamantine-nightly/tests/test_integration_da.cc(148): Leaving test case "integration_3D_da_point_cloud_add_material"; testing time: 2897502us
5: /var/jenkins/workspace/adamantine-nightly/tests/test_integration_da.cc(231): Entering test case "integration_3D_da_ray_add_material"
5: /var/jenkins/workspace/adamantine-nightly/tests/test_integration_da.cc(148): Leaving test case "integration_3D_da_point_cloud_add_material"; testing time: 2362981us
5: /var/jenkins/workspace/adamantine-nightly/tests/test_integration_da.cc(231): Entering test case "integration_3D_da_ray_add_material"
5: /var/jenkins/workspace/adamantine-nightly/tests/test_integration_da.cc(148): Leaving test case "integration_3D_da_point_cloud_add_material"; testing time: 2870928us
5: /var/jenkins/workspace/adamantine-nightly/tests/test_integration_da.cc(231): Entering test case "integration_3D_da_ray_add_material"
5: 100% completed
5: /var/jenkins/workspace/adamantine-nightly/tests/test_integration_da.cc(148): Leaving test case "integration_3D_da_point_cloud_add_material"; testing time: 2949324us
5: /var/jenkins/workspace/adamantine-nightly/tests/test_integration_da.cc(231): Entering test case "integration_3D_da_ray_add_material"
5: /var/jenkins/workspace/adamantine-nightly/tests/test_integration_da.cc(148): Leaving test case "integration_3D_da_point_cloud_add_material"; testing time: 2793675us
5: /var/jenkins/workspace/adamantine-nightly/tests/test_integration_da.cc(231): Entering test case "integration_3D_da_ray_add_material"
5: Reading the experimental log file...
5: Done. Log entries found for 1 camera(s), with 1 frame(s).
5: Starting the main time stepping loop...
5: 10% completed
5: 20% completed
5: 30% completed
5: 40% completed
5: 50% completed
5: Rank: 5 | Old parameters for member 2: 
5: Rank: 4 | Old parameters for member 2: 
5: Rank: 2 | Old parameters for member 1: 
5: Rank: 3 | Old parameters for member 1: 
5: Rank: 4 | Number expt sites mapped to DOFs: 1
5: Rank: 5 | Number expt sites mapped to DOFs: 1
5: Rank: 2 | Number expt sites mapped to DOFs: 1
5: Rank: 3 | Number expt sites mapped to DOFs: 1
5: Rank: 1 | Old parameters for member 0: 
5: Performing data assimilation at time 0.12...
5: Rank: 0 | Old parameters for member 0: 
5: Rank: 0 | Number expt sites mapped to DOFs: 1
5: Rank: 1 | Number expt sites mapped to DOFs: 1
5: Getting the perturbed innovation...
5: Applying the Kalman gain...
5: Updating the ensemble members...
5: Done.
5: 60% completed
5: 70% completed
5: 80% completed
5: 90% completed
5: 100% completed
5: Reading the experimental log file...
5: Done. Log entries found for 1 camera(s), with 1 frame(s).
5: Reading the experimental log file...
5: Done. Log entries found for 1 camera(s), with 1 frame(s).
5: Reading the experimental log file...
5: Done. Log entries found for 1 camera(s), with 1 frame(s).
5: Reading the experimental log file...
5: Done. Log entries found for 1 camera(s), with 1 frame(s).
5: Reading the experimental log file...
5: Done. Log entries found for 1 camera(s), with 1 frame(s).
5: Reading the experimental log file...
5: Done. Log entries found for 1 camera(s), with 1 frame(s).
5: Starting the main time stepping loop...
5: Starting the main time stepping loop...
5: Starting the main time stepping loop...
5: Starting the main time stepping loop...
5: Starting the main time stepping loop...
5: Starting the main time stepping loop...
5: 10% completed
5: 10% completed
5: 10% completed
5: 10% completed
5: 10% completed
5: 10% completed
5: 20% completed
5: 20% completed
5: 20% completed
5: 20% completed
5: 20% completed
5: 20% completed
5: 30% completed
5: 30% completed
5: 30% completed
5: 30% completed
5: 30% completed
5: 30% completed
5: 40% completed
5: 40% completed
5: 40% completed
5: 40% completed
5: 40% completed
5: 40% completed
5: 50% completed
5: 50% completed
5: 50% completed
5: 50% completed
5: 50% completed
5: 50% completed
5: Performing data assimilation at time 0.12...
5: Rank: 0 | Old parameters for member 0: 
5: Rank: 0 | Old parameters for member 1: 
5: Rank: 0 | Old parameters for member 2: 
5: Performing data assimilation at time 0.12...
5: Rank: 0 | Old parameters for member 0: 
5: Rank: 0 | Old parameters for member 1: 
5: Rank: 0 | Old parameters for member 2: 
5: Rank: 0 | Number expt sites mapped to DOFs: 1
5: Rank: 0 | Number expt sites mapped to DOFs: 1
5: Performing data assimilation at time 0.12...
5: Rank: 0 | Old parameters for member 0: 
5: Rank: 0 | Old parameters for member 1: 
5: Rank: 0 | Old parameters for member 2: 
5: Rank: 0 | Number expt sites mapped to DOFs: 1
5: Performing data assimilation at time 0.12...
5: Rank: 0 | Old parameters for member 0: 
5: Rank: 0 | Old parameters for member 1: 
5: Rank: 0 | Old parameters for member 2: 
5: Performing data assimilation at time 0.12...
5: Rank: 0 | Old parameters for member 0: 
5: Rank: 0 | Old parameters for member 1: 
5: Rank: 0 | Old parameters for member 2: 
5: Performing data assimilation at time 0.12...
5: Rank: 0 | Old parameters for member 0: 
5: Rank: 0 | Old parameters for member 1: 
5: Rank: 0 | Old parameters for member 2: 
5: Rank: 0 | Number expt sites mapped to DOFs: 1
5: Rank: 0 | Number expt sites mapped to DOFs: 1
5: Rank: 0 | Number expt sites mapped to DOFs: 1
5: Getting the perturbed innovation...
5: Applying the Kalman gain...
5: Getting the perturbed innovation...
5: Applying the Kalman gain...
5: Getting the perturbed innovation...
5: Applying the Kalman gain...
5: Getting the perturbed innovation...
5: Applying the Kalman gain...
5: Getting the perturbed innovation...
5: Applying the Kalman gain...
5: Getting the perturbed innovation...
5: Applying the Kalman gain...
5: Updating the ensemble members...
5: Updating the ensemble members...
5: Done.
5: Done.
5: 60% completed
5: 60% completed
5: Updating the ensemble members...
5: Done.
5: 60% completed
5: Updating the ensemble members...
5: Done.
5: 60% completed
5: Updating the ensemble members...
5: Done.
5: 60% completed
5: Updating the ensemble members...
5: Done.
5: 60% completed
5: 70% completed
5: 70% completed
5: 70% completed
5: 70% completed
5: 70% completed
5: 70% completed
5: 80% completed
5: 80% completed
5: 80% completed
5: 80% completed
5: 80% completed
5: 80% completed
5: 90% completed
5: 90% completed
5: 90% completed
5: 90% completed
5: 90% completed
5: 90% completed
5: 100% completed
5: 100% completed
5: 100% completed
5: 100% completed
5: 100% completed
5: 100% completed
5: 
5: *** No errors detected
5: 
5: *** No errors detected
5: /var/jenkins/workspace/adamantine-nightly/tests/test_integration_da.cc(231): Leaving test case "integration_3D_da_ray_add_material"; testing time: 2409732us
5: Leaving test module "Integration_Data_Assimilation"; testing time: 63504448us
5: /var/jenkins/workspace/adamantine-nightly/tests/test_integration_da.cc(231): Leaving test case "integration_3D_da_ray_add_material"; testing time: 2461335us
5: Leaving test module "Integration_Data_Assimilation"; testing time: 63501292us
5: 
5: *** No errors detected
5: /var/jenkins/workspace/adamantine-nightly/tests/test_integration_da.cc(231): Leaving test case "integration_3D_da_ray_add_material"; testing time: 2441841us
5: Leaving test module "Integration_Data_Assimilation"; testing time: 63498438us
5: /var/jenkins/workspace/adamantine-nightly/tests/test_integration_da.cc(231): Leaving test case "integration_3D_da_ray_add_material"; testing time: 2466050us
5: Leaving test module "Integration_Data_Assimilation"; testing time: 63503143us
5: 
5: *** No errors detected
5: /var/jenkins/workspace/adamantine-nightly/tests/test_integration_da.cc(231): Leaving test case "integration_3D_da_ray_add_material"; testing time: 2500614us
5: Leaving test module "Integration_Data_Assimilation"; testing time: 63519917us
5: 
5: *** No errors detected
5: /var/jenkins/workspace/adamantine-nightly/tests/test_integration_da.cc(231): Leaving test case "integration_3D_da_ray_add_material"; testing time: 2520304us
5: Leaving test module "Integration_Data_Assimilation"; testing time: 63528687us
5: 
5: *** No errors detected
5: 
 4/48 Test  #5: test_integration_da_6 ....................   Passed   65.58 sec
test 6
      Start  6: test_closest_source_point_adaptation_1

6: Test command: /usr/bin/mpiexec "-n" "1" "/var/jenkins/workspace/adamantine-nightly/build/bin/test_closest_source_point_adaptation"
6: Working Directory: /var/jenkins/workspace/adamantine-nightly/build/tests
6: Test timeout computed to be: 7200
6: Running 1 test case...
6: Entering test module "ClosestSourcePointAdaptation"
6: /var/jenkins/workspace/adamantine-nightly/tests/test_closest_source_point_adaptation.cc(124): Entering test case "closest_source_point_adaptation"
6: /var/jenkins/workspace/adamantine-nightly/tests/test_closest_source_point_adaptation.cc(124): Leaving test case "closest_source_point_adaptation"; testing time: 11762887us
6: Leaving test module "ClosestSourcePointAdaptation"; testing time: 11762949us
6: 
6: *** No errors detected
6: 
 5/48 Test  #6: test_closest_source_point_adaptation_1 ...   Passed   12.99 sec
test 7
      Start  7: test_closest_source_point_adaptation_2

7: Test command: /usr/bin/mpiexec "-n" "2" "/var/jenkins/workspace/adamantine-nightly/build/bin/test_closest_source_point_adaptation"
7: Working Directory: /var/jenkins/workspace/adamantine-nightly/build/tests
7: Test timeout computed to be: 7200
7: Running 1 test case...
7: Entering test module "ClosestSourcePointAdaptation"
7: /var/jenkins/workspace/adamantine-nightly/tests/test_closest_source_point_adaptation.cc(124): Entering test case "closest_source_point_adaptation"
7: Running 1 test case...
7: Entering test module "ClosestSourcePointAdaptation"
7: /var/jenkins/workspace/adamantine-nightly/tests/test_closest_source_point_adaptation.cc(124): Entering test case "closest_source_point_adaptation"
7: /var/jenkins/workspace/adamantine-nightly/tests/test_closest_source_point_adaptation.cc(124): Leaving test case "closest_source_point_adaptation"; testing time: 8098679us
7: Leaving test module "ClosestSourcePointAdaptation"; testing time: 8098729us
7: /var/jenkins/workspace/adamantine-nightly/tests/test_closest_source_point_adaptation.cc(124): Leaving test case "closest_source_point_adaptation"; testing time: 8101476us
7: Leaving test module "ClosestSourcePointAdaptation"; testing time: 8101521us
7: 
7: *** No errors detected
7: 
7: *** No errors detected
7: 
 6/48 Test  #7: test_closest_source_point_adaptation_2 ...   Passed    9.17 sec
test 8
      Start  8: test_closest_source_point_adaptation_3

8: Test command: /usr/bin/mpiexec "-n" "3" "/var/jenkins/workspace/adamantine-nightly/build/bin/test_closest_source_point_adaptation"
8: Working Directory: /var/jenkins/workspace/adamantine-nightly/build/tests
8: Test timeout computed to be: 7200
8: Running 1 test case...
8: Entering test module "ClosestSourcePointAdaptation"
8: /var/jenkins/workspace/adamantine-nightly/tests/test_closest_source_point_adaptation.cc(124): Entering test case "closest_source_point_adaptation"
8: Running 1 test case...
8: Entering test module "ClosestSourcePointAdaptation"
8: /var/jenkins/workspace/adamantine-nightly/tests/test_closest_source_point_adaptation.cc(124): Entering test case "closest_source_point_adaptation"
8: Running 1 test case...
8: Entering test module "ClosestSourcePointAdaptation"
8: /var/jenkins/workspace/adamantine-nightly/tests/test_closest_source_point_adaptation.cc(124): Entering test case "closest_source_point_adaptation"
8: /var/jenkins/workspace/adamantine-nightly/tests/test_closest_source_point_adaptation.cc(124): Leaving test case "closest_source_point_adaptation"; testing time: 7163ms
8: Leaving test module "ClosestSourcePointAdaptation"; testing time: 7163041us
8: 
8: *** No errors detected
8: 
8: *** No errors detected
8: 
8: *** No errors detected
8: /var/jenkins/workspace/adamantine-nightly/tests/test_closest_source_point_adaptation.cc(124): Leaving test case "closest_source_point_adaptation"; testing time: 7158002us
8: Leaving test module "ClosestSourcePointAdaptation"; testing time: 7158050us
8: /var/jenkins/workspace/adamantine-nightly/tests/test_closest_source_point_adaptation.cc(124): Leaving test case "closest_source_point_adaptation"; testing time: 7164838us
8: Leaving test module "ClosestSourcePointAdaptation"; testing time: 7164881us
8: 
 7/48 Test  #8: test_closest_source_point_adaptation_3 ...   Passed    8.48 sec
test 9
      Start  9: test_closest_source_point_adaptation_6

9: Test command: /usr/bin/mpiexec "-n" "6" "/var/jenkins/workspace/adamantine-nightly/build/bin/test_closest_source_point_adaptation"
9: Working Directory: /var/jenkins/workspace/adamantine-nightly/build/tests
9: Test timeout computed to be: 7200
9: Running 1 test case...
9: Entering test module "ClosestSourcePointAdaptation"
9: /var/jenkins/workspace/adamantine-nightly/tests/test_closest_source_point_adaptation.cc(124): Entering test case "closest_source_point_adaptation"
9: Running 1 test case...
9: Entering test module "ClosestSourcePointAdaptation"
9: /var/jenkins/workspace/adamantine-nightly/tests/test_closest_source_point_adaptation.cc(124): Entering test case "closest_source_point_adaptation"
9: Running 1 test case...
9: Entering test module "ClosestSourcePointAdaptation"
9: /var/jenkins/workspace/adamantine-nightly/tests/test_closest_source_point_adaptation.cc(124): Entering test case "closest_source_point_adaptation"
9: Running 1 test case...
9: Entering test module "ClosestSourcePointAdaptation"
9: /var/jenkins/workspace/adamantine-nightly/tests/test_closest_source_point_adaptation.cc(124): Entering test case "closest_source_point_adaptation"
9: Running 1 test case...
9: Entering test module "ClosestSourcePointAdaptation"
9: /var/jenkins/workspace/adamantine-nightly/tests/test_closest_source_point_adaptation.cc(124): Entering test case "closest_source_point_adaptation"
9: Running 1 test case...
9: Entering test module "ClosestSourcePointAdaptation"
9: /var/jenkins/workspace/adamantine-nightly/tests/test_closest_source_point_adaptation.cc(124): Entering test case "closest_source_point_adaptation"
9: /var/jenkins/workspace/adamantine-nightly/tests/test_closest_source_point_adaptation.cc(124): Leaving test case "closest_source_point_adaptation"; testing time: 4552835us
9: Leaving test module "ClosestSourcePointAdaptation"; testing time: 4552879us
9: 
9: *** No errors detected
9: /var/jenkins/workspace/adamantine-nightly/tests/test_closest_source_point_adaptation.cc(124): Leaving test case "closest_source_point_adaptation"; testing time: 4511279us
9: Leaving test module "ClosestSourcePointAdaptation"; testing time: 4511331us
9: /var/jenkins/workspace/adamantine-nightly/tests/test_closest_source_point_adaptation.cc(124): Leaving test case "closest_source_point_adaptation"; testing time: 4512480us
9: Leaving test module "ClosestSourcePointAdaptation"; testing time: 4512540us
9: 
9: *** No errors detected
9: 
9: *** No errors detected
9: /var/jenkins/workspace/adamantine-nightly/tests/test_closest_source_point_adaptation.cc(124): Leaving test case "closest_source_point_adaptation"; testing time: 4517786us
9: Leaving test module "ClosestSourcePointAdaptation"; testing time: 4517830us
9: /var/jenkins/workspace/adamantine-nightly/tests/test_closest_source_point_adaptation.cc(124): Leaving test case "closest_source_point_adaptation"; testing time: 4517106us
9: Leaving test module "ClosestSourcePointAdaptation"; testing time: 4517177us
9: 
9: *** No errors detected
9: 
9: *** No errors detected
9: 
9: *** No errors detected
9: /var/jenkins/workspace/adamantine-nightly/tests/test_closest_source_point_adaptation.cc(124): Leaving test case "closest_source_point_adaptation"; testing time: 4504421us
9: Leaving test module "ClosestSourcePointAdaptation"; testing time: 4504471us
9: 
 8/48 Test  #9: test_closest_source_point_adaptation_6 ...   Passed    6.49 sec
test 10
      Start 10: test_data_assimilator_1

10: Test command: /usr/bin/mpiexec "-n" "1" "/var/jenkins/workspace/adamantine-nightly/build/bin/test_data_assimilator"
10: Working Directory: /var/jenkins/workspace/adamantine-nightly/build/tests
10: Test timeout computed to be: 7200
10: Running 1 test case...
10: Entering test module "DataAssimilator"
10: /var/jenkins/workspace/adamantine-nightly/tests/test_data_assimilator.cc(948): Entering test case "data_assimilator"
10: Getting the perturbed innovation...
10: Applying the Kalman gain...
10: Updating the ensemble members...
10: Getting the perturbed innovation...
10: Applying the Kalman gain...
10: Updating the ensemble members...
10: 
10: /var/jenkins/workspace/adamantine-nightly/tests/test_data_assimilator.cc(948): Leaving test case "data_assimilator"; testing time: 149419us
10: Leaving test module "DataAssimilator"; testing time: 149448us
10: *** No errors detected
10: 
 9/48 Test #10: test_data_assimilator_1 ..................   Passed    1.36 sec
test 11
      Start 11: test_experimental_data_1

11: Test command: /usr/bin/mpiexec "-n" "1" "/var/jenkins/workspace/adamantine-nightly/build/bin/test_experimental_data"
11: Working Directory: /var/jenkins/workspace/adamantine-nightly/build/tests
11: Test timeout computed to be: 7200
11: Running 6 test cases...
11: Entering test module "ExperimentaData"
11: /var/jenkins/workspace/adamantine-nightly/tests/test_experimental_data.cc(22): Entering test case "read_experimental_data_point_cloud_from_file"
11: /var/jenkins/workspace/adamantine-nightly/tests/test_experimental_data.cc(22): Leaving test case "read_experimental_data_point_cloud_from_file"; testing time: 15517us
11: /var/jenkins/workspace/adamantine-nightly/tests/test_experimental_data.cc(75): Entering test case "set_vector_with_experimental_data_point_cloud"
11: /var/jenkins/workspace/adamantine-nightly/tests/test_experimental_data.cc(75): Leaving test case "set_vector_with_experimental_data_point_cloud"; testing time: 9321us
11: /var/jenkins/workspace/adamantine-nightly/tests/test_experimental_data.cc(138): Entering test case "read_experimental_data_ray_tracing_from_file"
11: /var/jenkins/workspace/adamantine-nightly/tests/test_experimental_data.cc(138): Leaving test case "read_experimental_data_ray_tracing_from_file"; testing time: 7083us
11: /var/jenkins/workspace/adamantine-nightly/tests/test_experimental_data.cc(199): Entering test case "timestamp"
11: /var/jenkins/workspace/adamantine-nightly/tests/test_experimental_data.cc(199): Leaving test case "timestamp"; testing time: 1215us
11: /var/jenkins/workspace/adamantine-nightly/tests/test_experimental_data.cc(225): Entering test case "project_ray_data_on_mesh"
11: /var/jenkins/workspace/adamantine-nightly/tests/test_experimental_data.cc(225): Leaving test case "project_ray_data_on_mesh"; testing time: 35910320us
11: /var/jenkins/workspace/adamantine-nightly/tests/test_experimental_data.cc(302): Entering test case "project_ray_data_on_nonaligned_mesh"
11: 
11: *** No errors detected
11: /var/jenkins/workspace/adamantine-nightly/tests/test_experimental_data.cc(302): Leaving test case "project_ray_data_on_nonaligned_mesh"; testing time: 31643us
11: Leaving test module "ExperimentaData"; testing time: 35975988us
11: 
10/48 Test #11: test_experimental_data_1 .................   Passed   37.21 sec
test 12
      Start 12: test_geometry_1

12: Test command: /usr/bin/mpiexec "-n" "1" "/var/jenkins/workspace/adamantine-nightly/build/bin/test_geometry"
12: Working Directory: /var/jenkins/workspace/adamantine-nightly/build/tests
12: Test timeout computed to be: 7200
12: Running 6 test cases...
12: Entering test module "Geometry"
12: /var/jenkins/workspace/adamantine-nightly/tests/test_geometry.cc(61): Entering test case "geometry_2D"
12: /var/jenkins/workspace/adamantine-nightly/tests/test_geometry.cc(61): Leaving test case "geometry_2D"; testing time: 8463us
12: /var/jenkins/workspace/adamantine-nightly/tests/test_geometry.cc(86): Entering test case "geometry_3D"
12: /var/jenkins/workspace/adamantine-nightly/tests/test_geometry.cc(86): Leaving test case "geometry_3D"; testing time: 12975us
12: /var/jenkins/workspace/adamantine-nightly/tests/test_geometry.cc(113): Entering test case "geometry_shifted_origin"
12: /var/jenkins/workspace/adamantine-nightly/tests/test_geometry.cc(113): Leaving test case "geometry_shifted_origin"; testing time: 11283us
12: /var/jenkins/workspace/adamantine-nightly/tests/test_geometry.cc(148): Entering test case "gmsh"
12: /var/jenkins/workspace/adamantine-nightly/tests/test_geometry.cc(148): Leaving test case "gmsh"; testing time: 111312us
12: /var/jenkins/workspace/adamantine-nightly/tests/test_geometry.cc(171): Entering test case "read_stl"
12: /var/jenkins/workspace/adamantine-nightly/tests/test_geometry.cc(171): Leaving test case "read_stl"; testing time: 12337us
12: /var/jenkins/workspace/adamantine-nightly/tests/test_geometry.cc(232): Entering test case "geometry_stl_mesh"
12: 
12: *** No errors detected
12: /var/jenkins/workspace/adamantine-nightly/tests/test_geometry.cc(232): Leaving test case "geometry_stl_mesh"; testing time: 11231us
12: Leaving test module "Geometry"; testing time: 168200us
12: 
11/48 Test #12: test_geometry_1 ..........................   Passed    1.43 sec
test 13
      Start 13: test_heat_source_1

13: Test command: /usr/bin/mpiexec "-n" "1" "/var/jenkins/workspace/adamantine-nightly/build/bin/test_heat_source"
13: Working Directory: /var/jenkins/workspace/adamantine-nightly/build/tests
13: Test timeout computed to be: 7200
13: Running 6 test cases...
13: Entering test module "HeatSource"
13: /var/jenkins/workspace/adamantine-nightly/tests/test_heat_source.cc(104): Entering test case "gaussian_heat_source_value_2d"
13: /var/jenkins/workspace/adamantine-nightly/tests/test_heat_source.cc(104): Leaving test case "gaussian_heat_source_value_2d"; testing time: 1554us
13: /var/jenkins/workspace/adamantine-nightly/tests/test_heat_source.cc(109): Entering test case "gaussian_heat_source_value_3d"
13: /var/jenkins/workspace/adamantine-nightly/tests/test_heat_source.cc(109): Leaving test case "gaussian_heat_source_value_3d"; testing time: 236us
13: /var/jenkins/workspace/adamantine-nightly/tests/test_heat_source.cc(114): Entering test case "heat_source_value_2d"
13: /var/jenkins/workspace/adamantine-nightly/tests/test_heat_source.cc(114): Leaving test case "heat_source_value_2d"; testing time: 293us
13: /var/jenkins/workspace/adamantine-nightly/tests/test_heat_source.cc(190): Entering test case "heat_source_vectorized_value_2d"
13: /var/jenkins/workspace/adamantine-nightly/tests/test_heat_source.cc(190): Leaving test case "heat_source_vectorized_value_2d"; testing time: 262us
13: /var/jenkins/workspace/adamantine-nightly/tests/test_heat_source.cc(315): Entering test case "heat_source_value_3d"
13: /var/jenkins/workspace/adamantine-nightly/tests/test_heat_source.cc(315): Leaving test case "heat_source_value_3d"; testing time: 293us
13: /var/jenkins/workspace/adamantine-nightly/tests/test_heat_source.cc(381): Entering test case "heat_source_vectorized_value_3d"
13: 
13: *** No errors detected
13: /var/jenkins/workspace/adamantine-nightly/tests/test_heat_source.cc(381): Leaving test case "heat_source_vectorized_value_3d"; testing time: 263us
13: Leaving test module "HeatSource"; testing time: 4162us
13: 
12/48 Test #13: test_heat_source_1 .......................   Passed    1.22 sec
test 14
      Start 14: test_integration_3d_device_1

14: Test command: /usr/bin/mpiexec "-n" "1" "/var/jenkins/workspace/adamantine-nightly/build/bin/test_integration_3d_device"
14: Working Directory: /var/jenkins/workspace/adamantine-nightly/build/tests
14: Test timeout computed to be: 7200
14: Running 2 test cases...
14: Entering test module "Integration_3D_Device"
14: /var/jenkins/workspace/adamantine-nightly/tests/test_integration_3d_device.cc(19): Entering test case "integration_3D_device"
14: 10% completed
14: 20% completed
14: 30% completed
14: 40% completed
14: 50% completed
14: 60% completed
14: 70% completed
14: 80% completed
14: 90% completed
14: 100% completed
14: /var/jenkins/workspace/adamantine-nightly/tests/test_integration_3d_device.cc(19): Leaving test case "integration_3D_device"; testing time: 417735422us
14: /var/jenkins/workspace/adamantine-nightly/tests/test_integration_3d_device.cc(46): Entering test case "integration_3D_checkpoint_restart_device"
14: 10% completed
14: 20% completed
14: 30% completed
14: 40% completed
14: 50% completed
14: 60% completed
14: 70% completed
14: Checkpoint reached
14: 80% completed
14: 90% completed
14: 100% completed
14: Restarting from file
14: 80% completed
14: 90% completed
14: 100% completed
14: /var/jenkins/workspace/adamantine-nightly/tests/test_integration_3d_device.cc(46): Leaving test case "integration_3D_checkpoint_restart_device"; testing time: 158175635us
14: Leaving test module "Integration_3D_Device"; testing time: 575912640us
14: 
14: *** No errors detected
14: 
13/48 Test #14: test_integration_3d_device_1 .............   Passed  577.14 sec
test 15
      Start 15: test_material_property_1

15: Test command: /usr/bin/mpiexec "-n" "1" "/var/jenkins/workspace/adamantine-nightly/build/bin/test_material_property"
15: Working Directory: /var/jenkins/workspace/adamantine-nightly/build/tests
15: Test timeout computed to be: 7200
15: Running 4 test cases...
15: Entering test module "MaterialProperty"
15: /var/jenkins/workspace/adamantine-nightly/tests/test_material_property.cc(13): Entering test case "material_property_host"
15: /var/jenkins/workspace/adamantine-nightly/tests/test_material_property.cc(13): Leaving test case "material_property_host"; testing time: 26003us
15: /var/jenkins/workspace/adamantine-nightly/tests/test_material_property.cc(18): Entering test case "ratios_host"
15: /var/jenkins/workspace/adamantine-nightly/tests/test_material_property.cc(18): Leaving test case "ratios_host"; testing time: 10777us
15: /var/jenkins/workspace/adamantine-nightly/tests/test_material_property.cc(20): Entering test case "material_property_table_host"
15: /var/jenkins/workspace/adamantine-nightly/tests/test_material_property.cc(20): Leaving test case "material_property_table_host"; testing time: 14928us
15: /var/jenkins/workspace/adamantine-nightly/tests/test_material_property.cc(25): Entering test case "material_property_polynomials_host"
15: /var/jenkins/workspace/adamantine-nightly/tests/test_material_property.cc(25): Leaving test case "material_property_polynomials_host"; testing time: 13786us
15: Leaving test module "MaterialProperty"; testing time: 65620us
15: 
15: *** No errors detected
15: 
14/48 Test #15: test_material_property_1 .................   Passed    1.36 sec
test 16
      Start 16: test_material_property_device_1

16: Test command: /usr/bin/mpiexec "-n" "1" "/var/jenkins/workspace/adamantine-nightly/build/bin/test_material_property_device"
16: Working Directory: /var/jenkins/workspace/adamantine-nightly/build/tests
16: Test timeout computed to be: 7200
16: Running 4 test cases...
16: Entering test module "MaterialPropertyDevice"
16: /var/jenkins/workspace/adamantine-nightly/tests/test_material_property_device.cc(13): Entering test case "material_property_device"
16: /var/jenkins/workspace/adamantine-nightly/tests/test_material_property_device.cc(13): Leaving test case "material_property_device"; testing time: 48467us
16: /var/jenkins/workspace/adamantine-nightly/tests/test_material_property_device.cc(18): Entering test case "ratios_device"
16: /var/jenkins/workspace/adamantine-nightly/tests/test_material_property_device.cc(18): Leaving test case "ratios_device"; testing time: 22638us
16: /var/jenkins/workspace/adamantine-nightly/tests/test_material_property_device.cc(20): Entering test case "material_property_table_device"
16: /var/jenkins/workspace/adamantine-nightly/tests/test_material_property_device.cc(20): Leaving test case "material_property_table_device"; testing time: 15584us
16: /var/jenkins/workspace/adamantine-nightly/tests/test_material_property_device.cc(25): Entering test case "material_property_polynomials_device"
16: /var/jenkins/workspace/adamantine-nightly/tests/test_material_property_device.cc(25): Leaving test case "material_property_polynomials_device"; testing time: 15482us
16: Leaving test module "MaterialPropertyDevice"; testing time: 102302us
16: 
16: *** No errors detected
16: 
15/48 Test #16: test_material_property_device_1 ..........   Passed    1.30 sec
test 17
      Start 17: test_mechanical_operator_1

17: Test command: /usr/bin/mpiexec "-n" "1" "/var/jenkins/workspace/adamantine-nightly/build/bin/test_mechanical_operator"
17: Working Directory: /var/jenkins/workspace/adamantine-nightly/build/tests
17: Test timeout computed to be: 7200
17: Running 2 test cases...
17: Entering test module "MechanicalOperator"
17: /var/jenkins/workspace/adamantine-nightly/tests/test_mechanical_operator.cc(71): Entering test case "elastostatic"
17: /var/jenkins/workspace/adamantine-nightly/tests/test_mechanical_operator.cc(71): Leaving test case "elastostatic"; testing time: 13813931us
17: /var/jenkins/workspace/adamantine-nightly/tests/test_mechanical_operator.cc(303): Entering test case "thermoelastic"
17: 
17: *** No errors detected
17: /var/jenkins/workspace/adamantine-nightly/tests/test_mechanical_operator.cc(303): Leaving test case "thermoelastic"; testing time: 3933438us
17: Leaving test module "MechanicalOperator"; testing time: 17748009us
17: 
16/48 Test #17: test_mechanical_operator_1 ...............   Passed   18.97 sec
test 18
      Start 18: test_mechanical_physics_1

18: Test command: /usr/bin/mpiexec "-n" "1" "/var/jenkins/workspace/adamantine-nightly/build/bin/test_mechanical_physics"
18: Working Directory: /var/jenkins/workspace/adamantine-nightly/build/tests
18: Test timeout computed to be: 7200
18: Running 7 test cases...
18: Entering test module "MechanicalPhysics"
18: /var/jenkins/workspace/adamantine-nightly/tests/test_mechanical_physics.cc(197): Entering test case "elastostatic"
18: /var/jenkins/workspace/adamantine-nightly/tests/test_mechanical_physics.cc(197): Leaving test case "elastostatic"; testing time: 652493us
18: /var/jenkins/workspace/adamantine-nightly/tests/test_mechanical_physics.cc(267): Entering test case "fe_nothing"
18: /var/jenkins/workspace/adamantine-nightly/tests/test_mechanical_physics.cc(267): Leaving test case "fe_nothing"; testing time: 643039us
18: /var/jenkins/workspace/adamantine-nightly/tests/test_mechanical_physics.cc(534): Entering test case "thermoelastic_eshelby"
18: /var/jenkins/workspace/adamantine-nightly/tests/test_mechanical_physics.cc(534): Leaving test case "thermoelastic_eshelby"; testing time: 59270798us
18: /var/jenkins/workspace/adamantine-nightly/tests/test_mechanical_physics.cc(562): Entering test case "elastoplastic_radial_return"
18: /var/jenkins/workspace/adamantine-nightly/tests/test_mechanical_physics.cc(562): Leaving test case "elastoplastic_radial_return"; testing time: 60407us
18: /var/jenkins/workspace/adamantine-nightly/tests/test_mechanical_physics.cc(668): Entering test case "cell_data_transfer_refine_coarsen"
18: /var/jenkins/workspace/adamantine-nightly/tests/test_mechanical_physics.cc(668): Leaving test case "cell_data_transfer_refine_coarsen"; testing time: 919075us
18: /var/jenkins/workspace/adamantine-nightly/tests/test_mechanical_physics.cc(777): Entering test case "thermoelastic_stress_uniform_heating"
18: /var/jenkins/workspace/adamantine-nightly/tests/test_mechanical_physics.cc(777): Leaving test case "thermoelastic_stress_uniform_heating"; testing time: 68107us
18: /var/jenkins/workspace/adamantine-nightly/tests/test_mechanical_physics.cc(866): Entering test case "thermoelastoplastic_radial_return"
18: 
18: *** No errors detected
18: /var/jenkins/workspace/adamantine-nightly/tests/test_mechanical_physics.cc(866): Leaving test case "thermoelastoplastic_radial_return"; testing time: 74539us
18: Leaving test module "MechanicalPhysics"; testing time: 61689063us
18: 
17/48 Test #18: test_mechanical_physics_1 ................   Passed   62.91 sec
test 19
      Start 19: test_post_processor_1

19: Test command: /usr/bin/mpiexec "-n" "1" "/var/jenkins/workspace/adamantine-nightly/build/bin/test_post_processor"
19: Working Directory: /var/jenkins/workspace/adamantine-nightly/build/tests
19: Test timeout computed to be: 7200
19: Running 2 test cases...
19: Entering test module "PostProcessor"
19: /var/jenkins/workspace/adamantine-nightly/tests/test_post_processor.cc(27): Entering test case "thermal_post_processor"
19: /var/jenkins/workspace/adamantine-nightly/tests/test_post_processor.cc(27): Leaving test case "thermal_post_processor"; testing time: 63187us
19: /var/jenkins/workspace/adamantine-nightly/tests/test_post_processor.cc(149): Entering test case "mechanical_post_processor"
19: 
19: *** No errors detected
19: /var/jenkins/workspace/adamantine-nightly/tests/test_post_processor.cc(149): Leaving test case "mechanical_post_processor"; testing time: 4060076us
19: Leaving test module "PostProcessor"; testing time: 4123335us
19: 
18/48 Test #19: test_post_processor_1 ....................   Passed    5.38 sec
test 20
      Start 20: test_quaternion_1

20: Test command: /usr/bin/mpiexec "-n" "1" "/var/jenkins/workspace/adamantine-nightly/build/bin/test_quaternion"
20: Working Directory: /var/jenkins/workspace/adamantine-nightly/build/tests
20: Test timeout computed to be: 7200
20: Running 1 test case...
20: Entering test module "Quaternion"
20: /var/jenkins/workspace/adamantine-nightly/tests/test_quaternion.cc(11): Entering test case "rotation"
20: 
20: *** No errors detected
20: /var/jenkins/workspace/adamantine-nightly/tests/test_quaternion.cc(11): Leaving test case "rotation"; testing time: 187us
20: Leaving test module "Quaternion"; testing time: 213us
20: 
19/48 Test #20: test_quaternion_1 ........................   Passed    1.26 sec
test 21
      Start 21: test_scan_path_1

21: Test command: /usr/bin/mpiexec "-n" "1" "/var/jenkins/workspace/adamantine-nightly/build/bin/test_scan_path"
21: Working Directory: /var/jenkins/workspace/adamantine-nightly/build/tests
21: Test timeout computed to be: 7200
21: Running 3 test cases...
21: Entering test module "ScanPath"
21: /var/jenkins/workspace/adamantine-nightly/tests/test_scan_path.cc(36): Entering test case "scan_path"
21: /var/jenkins/workspace/adamantine-nightly/tests/test_scan_path.cc(36): Leaving test case "scan_path"; testing time: 1574us
21: /var/jenkins/workspace/adamantine-nightly/tests/test_scan_path.cc(78): Entering test case "scan_path_location"
21: /var/jenkins/workspace/adamantine-nightly/tests/test_scan_path.cc(78): Leaving test case "scan_path_location"; testing time: 160us
21: /var/jenkins/workspace/adamantine-nightly/tests/test_scan_path.cc(106): Entering test case "five_axis"
21: /var/jenkins/workspace/adamantine-nightly/tests/test_scan_path.cc(106): Leaving test case "five_axis"; testing time: 2890us
21: Leaving test module "ScanPath"; testing time: 5263us
21: 
21: *** No errors detected
21: 
20/48 Test #21: test_scan_path_1 .........................   Passed    1.24 sec
test 22
      Start 22: test_thermal_operator_1

22: Test command: /usr/bin/mpiexec "-n" "1" "/var/jenkins/workspace/adamantine-nightly/build/bin/test_thermal_operator"
22: Working Directory: /var/jenkins/workspace/adamantine-nightly/build/tests
22: Test timeout computed to be: 7200
22: Running 6 test cases...
22: Entering test module "ThermalOperator"
22: /var/jenkins/workspace/adamantine-nightly/tests/test_thermal_operator.cc(41): Entering test case "thermal_operator"
22: /var/jenkins/workspace/adamantine-nightly/tests/test_thermal_operator.cc(41): Leaving test case "thermal_operator"; testing time: 46367us
22: /var/jenkins/workspace/adamantine-nightly/tests/test_thermal_operator.cc(148): Entering test case "spmv"
22: /var/jenkins/workspace/adamantine-nightly/tests/test_thermal_operator.cc(148): Leaving test case "spmv"; testing time: 125576us
22: /var/jenkins/workspace/adamantine-nightly/tests/test_thermal_operator.cc(265): Entering test case "spmv_anisotropic"
22: /var/jenkins/workspace/adamantine-nightly/tests/test_thermal_operator.cc(265): Leaving test case "spmv_anisotropic"; testing time: 123487us
22: /var/jenkins/workspace/adamantine-nightly/tests/test_thermal_operator.cc(415): Entering test case "spmv_anisotropic_angle"
22: /var/jenkins/workspace/adamantine-nightly/tests/test_thermal_operator.cc(415): Leaving test case "spmv_anisotropic_angle"; testing time: 667389us
22: /var/jenkins/workspace/adamantine-nightly/tests/test_thermal_operator.cc(580): Entering test case "spmv_rad"
22: /var/jenkins/workspace/adamantine-nightly/tests/test_thermal_operator.cc(580): Leaving test case "spmv_rad"; testing time: 957954us
22: /var/jenkins/workspace/adamantine-nightly/tests/test_thermal_operator.cc(772): Entering test case "spmv_conv"
22: /var/jenkins/workspace/adamantine-nightly/tests/test_thermal_operator.cc(772): Leaving test case "spmv_conv"; testing time: 904867us
22: Leaving test module "ThermalOperator"; testing time: 2827518us
22: 
22: *** No errors detected
22: 
21/48 Test #22: test_thermal_operator_1 ..................   Passed    3.72 sec
test 23
      Start 23: test_thermal_operator_device_1

23: Test command: /usr/bin/mpiexec "-n" "1" "/var/jenkins/workspace/adamantine-nightly/build/bin/test_thermal_operator_device"
23: Working Directory: /var/jenkins/workspace/adamantine-nightly/build/tests
23: Test timeout computed to be: 7200
23: Running 4 test cases...
23: Entering test module "ThermalOperatorDevice"
23: /var/jenkins/workspace/adamantine-nightly/tests/test_thermal_operator_device.cc(31): Entering test case "thermal_operator_dev"
23: /var/jenkins/workspace/adamantine-nightly/tests/test_thermal_operator_device.cc(31): Leaving test case "thermal_operator_dev"; testing time: 97271us
23: /var/jenkins/workspace/adamantine-nightly/tests/test_thermal_operator_device.cc(124): Entering test case "spmv"
23: /var/jenkins/workspace/adamantine-nightly/tests/test_thermal_operator_device.cc(124): Leaving test case "spmv"; testing time: 66950us
23: /var/jenkins/workspace/adamantine-nightly/tests/test_thermal_operator_device.cc(237): Entering test case "mf_spmv"
23: /var/jenkins/workspace/adamantine-nightly/tests/test_thermal_operator_device.cc(237): Leaving test case "mf_spmv"; testing time: 886069us
23: /var/jenkins/workspace/adamantine-nightly/tests/test_thermal_operator_device.cc(375): Entering test case "spmv_anisotropic_angle"
23: /var/jenkins/workspace/adamantine-nightly/tests/test_thermal_operator_device.cc(375): Leaving test case "spmv_anisotropic_angle"; testing time: 282538us
23: Leaving test module "ThermalOperatorDevice"; testing time: 1334080us
23: 
23: *** No errors detected
23: 
22/48 Test #23: test_thermal_operator_device_1 ...........   Passed    2.22 sec
test 24
      Start 24: test_thermal_physics_device_1

24: Test command: /usr/bin/mpiexec "-n" "1" "/var/jenkins/workspace/adamantine-nightly/build/bin/test_thermal_physics_device"
24: Working Directory: /var/jenkins/workspace/adamantine-nightly/build/tests
24: Test timeout computed to be: 7200
24: Running 4 test cases...
24: Entering test module "ThermalPhysicsDevice"
24: /var/jenkins/workspace/adamantine-nightly/tests/test_thermal_physics_device.cc(13): Entering test case "thermal_2d_explicit_device"
24: /var/jenkins/workspace/adamantine-nightly/tests/test_thermal_physics_device.cc(13): Leaving test case "thermal_2d_explicit_device"; testing time: 108600us
24: /var/jenkins/workspace/adamantine-nightly/tests/test_thermal_physics_device.cc(26): Entering test case "thermal_2d_manufactured_solution_device"
24: /var/jenkins/workspace/adamantine-nightly/tests/test_thermal_physics_device.cc(26): Leaving test case "thermal_2d_manufactured_solution_device"; testing time: 32749us
24: /var/jenkins/workspace/adamantine-nightly/tests/test_thermal_physics_device.cc(31): Entering test case "initial_temperature_device"
24: /var/jenkins/workspace/adamantine-nightly/tests/test_thermal_physics_device.cc(31): Leaving test case "initial_temperature_device"; testing time: 7467us
24: /var/jenkins/workspace/adamantine-nightly/tests/test_thermal_physics_device.cc(36): Entering test case "energy_conservation_device"
24: /var/jenkins/workspace/adamantine-nightly/tests/test_thermal_physics_device.cc(36): Leaving test case "energy_conservation_device"; testing time: 34534675us
24: Leaving test module "ThermalPhysicsDevice"; testing time: 34683661us
24: 
24: *** No errors detected
24: 
23/48 Test #24: test_thermal_physics_device_1 ............   Passed   35.58 sec
test 25
      Start 25: test_timer_1

25: Test command: /usr/bin/mpiexec "-n" "1" "/var/jenkins/workspace/adamantine-nightly/build/bin/test_timer"
25: Working Directory: /var/jenkins/workspace/adamantine-nightly/build/tests
25: Test timeout computed to be: 7200
25: Running 1 test case...
25: Entering test module "Timer"
25: /var/jenkins/workspace/adamantine-nightly/tests/test_timer.cc(15): Entering test case "test_timer"
25: /var/jenkins/workspace/adamantine-nightly/tests/test_timer.cc(15): Leaving test case "test_timer"; testing time: 600327us
25: Leaving test module "Timer"; testing time: 600363us
25: 
25: *** No errors detected
25: 
24/48 Test #25: test_timer_1 .............................   Passed    1.83 sec
test 26
      Start 26: test_utils_1

26: Test command: /usr/bin/mpiexec "-n" "1" "/var/jenkins/workspace/adamantine-nightly/build/bin/test_utils"
26: Working Directory: /var/jenkins/workspace/adamantine-nightly/build/tests
26: Test timeout computed to be: 7200
26: Running 1 test case...
26: Entering test module "utils"
26: /var/jenkins/workspace/adamantine-nightly/tests/test_utils.cc(11): Entering test case "utils"
26: 
26: *** No errors detected
26: /var/jenkins/workspace/adamantine-nightly/tests/test_utils.cc(11): Leaving test case "utils"; testing time: 220us
26: Leaving test module "utils"; testing time: 250us
26: 
25/48 Test #26: test_utils_1 .............................   Passed    1.02 sec
test 27
      Start 27: test_validate_input_database_1

27: Test command: /usr/bin/mpiexec "-n" "1" "/var/jenkins/workspace/adamantine-nightly/build/bin/test_validate_input_database"
27: Working Directory: /var/jenkins/workspace/adamantine-nightly/build/tests
27: Test timeout computed to be: 7200
27: Running 3 test cases...
27: Entering test module "validate_input_database"
27: /var/jenkins/workspace/adamantine-nightly/tests/test_validate_input_database.cc(14): Entering test case "expected_passes"
27: Test case expected_passes did not check any assertions
27: /var/jenkins/workspace/adamantine-nightly/tests/test_validate_input_database.cc(14): Leaving test case "expected_passes"; testing time: 690us
27: /var/jenkins/workspace/adamantine-nightly/tests/test_validate_input_database.cc(55): Entering test case "parse_test_input_files"
27: Test case parse_test_input_files did not check any assertions
27: /var/jenkins/workspace/adamantine-nightly/tests/test_validate_input_database.cc(55): Leaving test case "parse_test_input_files"; testing time: 5094us
27: /var/jenkins/workspace/adamantine-nightly/tests/test_validate_input_database.cc(76): Entering test case "expected_failures"
27: 
27: *** No errors detected
27: /var/jenkins/workspace/adamantine-nightly/tests/test_validate_input_database.cc(76): Leaving test case "expected_failures"; testing time: 6915us
27: Leaving test module "validate_input_database"; testing time: 12809us
27: 
26/48 Test #27: test_validate_input_database_1 ...........   Passed    0.88 sec
test 28
      Start 28: test_integration_2d_1

28: Test command: /usr/bin/mpiexec "-n" "1" "/var/jenkins/workspace/adamantine-nightly/build/bin/test_integration_2d"
28: Working Directory: /var/jenkins/workspace/adamantine-nightly/build/tests
28: Test timeout computed to be: 7200
28: Running 3 test cases...
28: Entering test module "Integration_2D"
28: /var/jenkins/workspace/adamantine-nightly/tests/test_integration_2d.cc(19): Entering test case "integration_2D"
28: 10% completed
28: 20% completed
28: 30% completed
28: 40% completed
28: 50% completed
28: 60% completed
28: 70% completed
28: 80% completed
28: 90% completed
28: 100% completed
28: /var/jenkins/workspace/adamantine-nightly/tests/test_integration_2d.cc(19): Leaving test case "integration_2D"; testing time: 2014947us
28: /var/jenkins/workspace/adamantine-nightly/tests/test_integration_2d.cc(46): Entering test case "integration_2D_ensemble"
28: Starting the main time stepping loop...
28: 10% completed
28: 20% completed
28: 30% completed
28: 40% completed
28: 50% completed
28: 60% completed
28: 70% completed
28: 80% completed
28: 90% completed
28: 100% completed
28: /var/jenkins/workspace/adamantine-nightly/tests/test_integration_2d.cc(46): Leaving test case "integration_2D_ensemble"; testing time: 5965588us
28: /var/jenkins/workspace/adamantine-nightly/tests/test_integration_2d.cc(78): Entering test case "integration_2D_units"
28: 10% completed
28: 20% completed
28: 30% completed
28: 40% completed
28: 50% completed
28: 60% completed
28: 70% completed
28: 80% completed
28: 90% completed
28: 100% completed
28: 
28: *** No errors detected
28: /var/jenkins/workspace/adamantine-nightly/tests/test_integration_2d.cc(78): Leaving test case "integration_2D_units"; testing time: 2100731us
28: Leaving test module "Integration_2D"; testing time: 10082110us
28: 
27/48 Test #28: test_integration_2d_1 ....................   Passed   10.95 sec
test 29
      Start 29: test_integration_2d_2

29: Test command: /usr/bin/mpiexec "-n" "2" "/var/jenkins/workspace/adamantine-nightly/build/bin/test_integration_2d"
29: Working Directory: /var/jenkins/workspace/adamantine-nightly/build/tests
29: Test timeout computed to be: 7200
29: Running 3 test cases...
29: Entering test module "Integration_2D"
29: /var/jenkins/workspace/adamantine-nightly/tests/test_integration_2d.cc(19): Entering test case "integration_2D"
29: Running 3 test cases...
29: Entering test module "Integration_2D"
29: /var/jenkins/workspace/adamantine-nightly/tests/test_integration_2d.cc(19): Entering test case "integration_2D"
29: 10% completed
29: 20% completed
29: 30% completed
29: 40% completed
29: 50% completed
29: 60% completed
29: 70% completed
29: 80% completed
29: 90% completed
29: 100% completed
29: /var/jenkins/workspace/adamantine-nightly/tests/test_integration_2d.cc(19): Leaving test case "integration_2D"; testing time: 1259273us
29: /var/jenkins/workspace/adamantine-nightly/tests/test_integration_2d.cc(46): Entering test case "integration_2D_ensemble"
29: /var/jenkins/workspace/adamantine-nightly/tests/test_integration_2d.cc(19): Leaving test case "integration_2D"; testing time: 1257518us
29: /var/jenkins/workspace/adamantine-nightly/tests/test_integration_2d.cc(46): Entering test case "integration_2D_ensemble"
29: Starting the main time stepping loop...
29: 10% completed
29: 20% completed
29: 30% completed
29: 40% completed
29: /var/jenkins/workspace/adamantine-nightly/tests/test_integration_2d.cc(46): Leaving test case "integration_2D_ensemble"; testing time: 2013068us
29: /var/jenkins/workspace/adamantine-nightly/tests/test_integration_2d.cc(78): Entering test case "integration_2D_units"
29: 50% completed
29: 60% completed
29: 70% completed
29: 80% completed
29: 90% completed
29: 100% completed
29: /var/jenkins/workspace/adamantine-nightly/tests/test_integration_2d.cc(46): Leaving test case "integration_2D_ensemble"; testing time: 3657814us
29: /var/jenkins/workspace/adamantine-nightly/tests/test_integration_2d.cc(78): Entering test case "integration_2D_units"
29: 10% completed
29: 20% completed
29: 30% completed
29: 40% completed
29: 50% completed
29: 60% completed
29: 70% completed
29: 80% completed
29: 90% completed
29: 100% completed
29: /var/jenkins/workspace/adamantine-nightly/tests/test_integration_2d.cc(78): Leaving test case "integration_2D_units"; testing time: 2926150us
29: Leaving test module "Integration_2D"; testing time: 6199406us
29: 
29: *** No errors detected
29: 
29: *** No errors detected
29: /var/jenkins/workspace/adamantine-nightly/tests/test_integration_2d.cc(78): Leaving test case "integration_2D_units"; testing time: 1281496us
29: Leaving test module "Integration_2D"; testing time: 6197702us
29: 
28/48 Test #29: test_integration_2d_2 ....................   Passed    7.27 sec
test 30
      Start 30: test_integration_2d_device_1

30: Test command: /usr/bin/mpiexec "-n" "1" "/var/jenkins/workspace/adamantine-nightly/build/bin/test_integration_2d_device"
30: Working Directory: /var/jenkins/workspace/adamantine-nightly/build/tests
30: Test timeout computed to be: 7200
30: Running 1 test case...
30: Entering test module "Integration_2D_Device"
30: /var/jenkins/workspace/adamantine-nightly/tests/test_integration_2d_device.cc(19): Entering test case "intregation_2D_device"
30: 10% completed
30: 20% completed
30: 30% completed
30: 40% completed
30: 50% completed
30: 60% completed
30: 70% completed
30: 80% completed
30: 90% completed
30: 100% completed
30: /var/jenkins/workspace/adamantine-nightly/tests/test_integration_2d_device.cc(19): Leaving test case "intregation_2D_device"; testing time: 2869731us
30: Leaving test module "Integration_2D_Device"; testing time: 2870019us
30: 
30: *** No errors detected
30: 
29/48 Test #30: test_integration_2d_device_1 .............   Passed    3.75 sec
test 31
      Start 31: test_integration_2d_device_2

31: Test command: /usr/bin/mpiexec "-n" "2" "/var/jenkins/workspace/adamantine-nightly/build/bin/test_integration_2d_device"
31: Working Directory: /var/jenkins/workspace/adamantine-nightly/build/tests
31: Test timeout computed to be: 7200
31: Running 1 test case...
31: Entering test module "Integration_2D_Device"
31: /var/jenkins/workspace/adamantine-nightly/tests/test_integration_2d_device.cc(19): Entering test case "intregation_2D_device"
31: Running 1 test case...
31: Entering test module "Integration_2D_Device"
31: /var/jenkins/workspace/adamantine-nightly/tests/test_integration_2d_device.cc(19): Entering test case "intregation_2D_device"
31: 10% completed
31: 20% completed
31: 30% completed
31: 40% completed
31: 50% completed
31: 60% completed
31: 70% completed
31: 80% completed
31: 90% completed
31: 100% completed
31: /var/jenkins/workspace/adamantine-nightly/tests/test_integration_2d_device.cc(19): Leaving test case "intregation_2D_device"; testing time: 1855578us
31: Leaving test module "Integration_2D_Device"; testing time: 1855883us
31: /var/jenkins/workspace/adamantine-nightly/tests/test_integration_2d_device.cc(19): Leaving test case "intregation_2D_device"; testing time: 1853898us
31: Leaving test module "Integration_2D_Device"; testing time: 1854178us
31: 
31: *** No errors detected
31: 
31: *** No errors detected
31: 
30/48 Test #31: test_integration_2d_device_2 .............   Passed    2.94 sec
test 32
      Start 32: test_integration_3d_1

32: Test command: /usr/bin/mpiexec "-n" "1" "/var/jenkins/workspace/adamantine-nightly/build/bin/test_integration_3d"
32: Working Directory: /var/jenkins/workspace/adamantine-nightly/build/tests
32: Test timeout computed to be: 7200
32: Running 5 test cases...
32: Entering test module "Integration_3D"
32: /var/jenkins/workspace/adamantine-nightly/tests/test_integration_3d.cc(102): Entering test case "integration_3D"
32: 10% completed
32: 20% completed
32: 30% completed
32: 40% completed
32: 50% completed
32: 60% completed
32: 70% completed
32: 80% completed
32: 90% completed
32: 100% completed
32: /var/jenkins/workspace/adamantine-nightly/tests/test_integration_3d.cc(102): Leaving test case "integration_3D"; testing time: 141468077us
32: /var/jenkins/workspace/adamantine-nightly/tests/test_integration_3d.cc(107): Entering test case "integration_3D_short"
32: 10% completed
32: 20% completed
32: 30% completed
32: 40% completed
32: 50% completed
32: 60% completed
32: 70% completed
32: 80% completed
32: 90% completed
32: 100% completed
32: /var/jenkins/workspace/adamantine-nightly/tests/test_integration_3d.cc(107): Leaving test case "integration_3D_short"; testing time: 1345072495us
32: /var/jenkins/workspace/adamantine-nightly/tests/test_integration_3d.cc(112): Entering test case "integration_3D_five_axis"
32: 10% completed
32: 20% completed
32: 30% completed
32: 40% completed
32: 50% completed
32: 60% completed
32: 70% completed
32: 80% completed
32: 90% completed
32: 100% completed
32: /var/jenkins/workspace/adamantine-nightly/tests/test_integration_3d.cc(112): Leaving test case "integration_3D_five_axis"; testing time: 4622405138us
32: /var/jenkins/workspace/adamantine-nightly/tests/test_integration_3d.cc(117): Entering test case "integration_3D_checkpoint_restart"
32: 10% completed
32: 20% completed
32: 30% completed
32: 40% completed
32: 50% completed
32: 60% completed
32: 70% completed
32: Checkpoint reached
32: 80% completed
32: 90% completed
32: 100% completed
32: Restarting from file
32: 80% completed
32: 90% completed
32: 100% completed
32: /var/jenkins/workspace/adamantine-nightly/tests/test_integration_3d.cc(117): Leaving test case "integration_3D_checkpoint_restart"; testing time: 173449825us
32: /var/jenkins/workspace/adamantine-nightly/tests/test_integration_3d.cc(167): Entering test case "hourglass"
32: Test case hourglass did not check any assertions
32: /var/jenkins/workspace/adamantine-nightly/tests/test_integration_3d.cc(167): Leaving test case "hourglass"; testing time: 92us
32: Leaving test module "Integration_3D"; testing time: 6282400067us
32: 
32: *** No errors detected
32: 
31/48 Test #32: test_integration_3d_1 ....................   Passed  6283.28 sec
test 33
      Start 33: test_integration_3d_2

33: Test command: /usr/bin/mpiexec "-n" "2" "/var/jenkins/workspace/adamantine-nightly/build/bin/test_integration_3d"
33: Working Directory: /var/jenkins/workspace/adamantine-nightly/build/tests
33: Test timeout computed to be: 7200
33: Running 5 test cases...
33: Entering test module "Integration_3D"
33: /var/jenkins/workspace/adamantine-nightly/tests/test_integration_3d.cc(102): Entering test case "integration_3D"
33: Running 5 test cases...
33: Entering test module "Integration_3D"
33: /var/jenkins/workspace/adamantine-nightly/tests/test_integration_3d.cc(102): Entering test case "integration_3D"
33: 10% completed
33: 20% completed
33: 30% completed
33: 40% completed
33: 50% completed
33: 60% completed
33: 70% completed
33: 80% completed
33: 90% completed
33: 100% completed
33: /var/jenkins/workspace/adamantine-nightly/tests/test_integration_3d.cc(102): Leaving test case "integration_3D"; testing time: 75672262us
33: /var/jenkins/workspace/adamantine-nightly/tests/test_integration_3d.cc(107): Entering test case "integration_3D_short"
33: /var/jenkins/workspace/adamantine-nightly/tests/test_integration_3d.cc(102): Leaving test case "integration_3D"; testing time: 75681111us
33: /var/jenkins/workspace/adamantine-nightly/tests/test_integration_3d.cc(107): Entering test case "integration_3D_short"
33: 10% completed
33: 20% completed
33: 30% completed
33: 40% completed
33: 50% completed
33: 60% completed
33: 70% completed
33: 80% completed
33: 90% completed
33: 100% completed
33: /var/jenkins/workspace/adamantine-nightly/tests/test_integration_3d.cc(107): Leaving test case "integration_3D_short"; testing time: 723612694us
33: /var/jenkins/workspace/adamantine-nightly/tests/test_integration_3d.cc(112): Entering test case "integration_3D_five_axis"
33: /var/jenkins/workspace/adamantine-nightly/tests/test_integration_3d.cc(107): Leaving test case "integration_3D_short"; testing time: 723615836us
33: /var/jenkins/workspace/adamantine-nightly/tests/test_integration_3d.cc(112): Entering test case "integration_3D_five_axis"
33: 10% completed
33: 20% completed
33: 30% completed
33: 40% completed
33: 50% completed
33: 60% completed
33: 70% completed
33: 80% completed
33: 90% completed
33: 100% completed
33: /var/jenkins/workspace/adamantine-nightly/tests/test_integration_3d.cc(112): Leaving test case "integration_3D_five_axis"; testing time: 2394823344us
33: /var/jenkins/workspace/adamantine-nightly/tests/test_integration_3d.cc(117): Entering test case "integration_3D_checkpoint_restart"
33: /var/jenkins/workspace/adamantine-nightly/tests/test_integration_3d.cc(112): Leaving test case "integration_3D_five_axis"; testing time: 2394828518us
33: /var/jenkins/workspace/adamantine-nightly/tests/test_integration_3d.cc(117): Entering test case "integration_3D_checkpoint_restart"
33: 10% completed
33: 20% completed
33: 30% completed
33: 40% completed
33: 50% completed
33: 60% completed
33: 70% completed
33: Checkpoint reached
33: 80% completed
33: 90% completed
33: 100% completed
33: Restarting from file
33: 80% completed
33: 90% completed
33: 100% completed
33: /var/jenkins/workspace/adamantine-nightly/tests/test_integration_3d.cc(117): Leaving test case "integration_3D_checkpoint_restart"; testing time: 93724327us
33: /var/jenkins/workspace/adamantine-nightly/tests/test_integration_3d.cc(167): Entering test case "hourglass"
33: /var/jenkins/workspace/adamantine-nightly/tests/test_integration_3d.cc(117): Leaving test case "integration_3D_checkpoint_restart"; testing time: 93724400us
33: /var/jenkins/workspace/adamantine-nightly/tests/test_integration_3d.cc(167): Entering test case "hourglass"
33: n_time_step: 1 time: 0 n_dofs (thermal) after mesh refinement: 1172
33: n_time_step: 100 time: 0.99 n_dofs (thermal) after cell activation: 1178
33: 10% completed
33: n_time_step: 101 time: 1 n_dofs (thermal) after cell activation: 1178
33: n_time_step: 124 time: 1.23 n_dofs (thermal) after cell activation: 1181
33: n_time_step: 147 time: 1.46 n_dofs (thermal) after cell activation: 1184
33: n_time_step: 170 time: 1.69 n_dofs (thermal) after cell activation: 1187
33: n_time_step: 171 time: 1.7 n_dofs (thermal) after cell activation: 1187
33: n_time_step: 194 time: 1.93 n_dofs (thermal) after cell activation: 1190
33: 20% completed
33: n_time_step: 217 time: 2.16 n_dofs (thermal) after cell activation: 1193
33: n_time_step: 241 time: 2.4 n_dofs (thermal) after cell activation: 1196
33: n_time_step: 264 time: 2.63 n_dofs (thermal) after cell activation: 1199
33: n_time_step: 287 time: 2.86 n_dofs (thermal) after cell activation: 1202
33: n_time_step: 301 time: 3 n_dofs (thermal) after cell activation: 1204
33: 30% completed
33: n_time_step: 325 time: 3.24 n_dofs (thermal) after cell activation: 1205
33: n_time_step: 348 time: 3.47 n_dofs (thermal) after cell activation: 1206
33: n_time_step: 371 time: 3.7 n_dofs (thermal) after cell activation: 1207
33: n_time_step: 395 time: 3.94 n_dofs (thermal) after cell activation: 1208
33: 40% completed
33: n_time_step: 418 time: 4.17 n_dofs (thermal) after cell activation: 1209
33: n_time_step: 441 time: 4.4 n_dofs (thermal) after cell activation: 1210
33: n_time_step: 465 time: 4.64 n_dofs (thermal) after cell activation: 1211
33: n_time_step: 488 time: 4.87 n_dofs (thermal) after cell activation: 1212
33: 50% completed
33: n_time_step: 507 time: 5.06 n_dofs (thermal) after cell activation: 1216
33: n_time_step: 531 time: 5.3 n_dofs (thermal) after cell activation: 1217
33: n_time_step: 554 time: 5.53 n_dofs (thermal) after cell activation: 1218
33: n_time_step: 577 time: 5.76 n_dofs (thermal) after cell activation: 1219
33: n_time_step: 601 time: 6 n_dofs (thermal) after cell activation: 1220
33: 60% completed
33: n_time_step: 624 time: 6.23 n_dofs (thermal) after cell activation: 1221
33: n_time_step: 647 time: 6.46 n_dofs (thermal) after cell activation: 1222
33: n_time_step: 671 time: 6.7 n_dofs (thermal) after cell activation: 1223
33: n_time_step: 694 time: 6.93 n_dofs (thermal) after cell activation: 1224
33: 70% completed
33: n_time_step: 717 time: 7.16 n_dofs (thermal) after cell activation: 1226
33: n_time_step: 740 time: 7.39 n_dofs (thermal) after cell activation: 1227
33: n_time_step: 763 time: 7.62 n_dofs (thermal) after cell activation: 1228
33: n_time_step: 787 time: 7.86 n_dofs (thermal) after cell activation: 1229
33: 80% completed
33: n_time_step: 810 time: 8.09 n_dofs (thermal) after cell activation: 1230
33: n_time_step: 833 time: 8.32 n_dofs (thermal) after cell activation: 1231
33: n_time_step: 857 time: 8.56 n_dofs (thermal) after cell activation: 1232
33: n_time_step: 880 time: 8.79 n_dofs (thermal) after cell activation: 1233
33: 90% completed
33: n_time_step: 903 time: 9.02 n_dofs (thermal) after cell activation: 1234
33: n_time_step: 927 time: 9.26 n_dofs (thermal) after cell activation: 1235
33: n_time_step: 928 time: 9.27 n_dofs (thermal) after cell activation: 1238
33: n_time_step: 951 time: 9.5 n_dofs (thermal) after cell activation: 1239
33: n_time_step: 975 time: 9.74 n_dofs (thermal) after cell activation: 1240
33: n_time_step: 998 time: 9.97 n_dofs (thermal) after cell activation: 1241
33: 100% completed
33: 
33: *** No errors detected
33: Test case hourglass did not check any assertions
33: /var/jenkins/workspace/adamantine-nightly/tests/test_integration_3d.cc(167): Leaving test case "hourglass"; testing time: 2189321554us
33: Leaving test module "Integration_3D"; testing time: 5477170133us
33: Test case hourglass did not check any assertions
33: /var/jenkins/workspace/adamantine-nightly/tests/test_integration_3d.cc(167): Leaving test case "hourglass"; testing time: 2189337348us
33: Leaving test module "Integration_3D"; testing time: 5477179340us
33: 
33: *** No errors detected
33: 
32/48 Test #33: test_integration_3d_2 ....................   Passed  5478.30 sec
test 34
      Start 34: test_integration_3d_amr_1

34: Test command: /usr/bin/mpiexec "-n" "1" "/var/jenkins/workspace/adamantine-nightly/build/bin/test_integration_3d_amr"
34: Working Directory: /var/jenkins/workspace/adamantine-nightly/build/tests
34: Test timeout computed to be: 7200
34: Running 2 test cases...
34: Entering test module "Integration_3D_AMR"
34: /var/jenkins/workspace/adamantine-nightly/tests/test_integration_3d_amr.cc(19): Entering test case "integration_3D_amr"
34: 10% completed
34: 20% completed
34: 30% completed
34: 40% completed
34: 50% completed
34: 60% completed
34: 70% completed
34: 80% completed
34: 90% completed
34: 100% completed
34: /var/jenkins/workspace/adamantine-nightly/tests/test_integration_3d_amr.cc(19): Leaving test case "integration_3D_amr"; testing time: 10080979us
34: /var/jenkins/workspace/adamantine-nightly/tests/test_integration_3d_amr.cc(60): Entering test case "integration_3D_amr_refine_coarsen"
34: 10% completed
34: 20% completed
34: 30% completed
34: 40% completed
34: 50% completed
34: 60% completed
34: 70% completed
34: 80% completed
34: 90% completed
34: 100% completed
34: 
34: *** No errors detected
34: /var/jenkins/workspace/adamantine-nightly/tests/test_integration_3d_amr.cc(60): Leaving test case "integration_3D_amr_refine_coarsen"; testing time: 135035679us
34: Leaving test module "Integration_3D_AMR"; testing time: 145117310us
34: 
33/48 Test #34: test_integration_3d_amr_1 ................   Passed  146.08 sec
test 35
      Start 35: test_integration_3d_amr_2

35: Test command: /usr/bin/mpiexec "-n" "2" "/var/jenkins/workspace/adamantine-nightly/build/bin/test_integration_3d_amr"
35: Working Directory: /var/jenkins/workspace/adamantine-nightly/build/tests
35: Test timeout computed to be: 7200
35: Running 2 test cases...
35: Entering test module "Integration_3D_AMR"
35: /var/jenkins/workspace/adamantine-nightly/tests/test_integration_3d_amr.cc(19): Entering test case "integration_3D_amr"
35: Running 2 test cases...
35: Entering test module "Integration_3D_AMR"
35: /var/jenkins/workspace/adamantine-nightly/tests/test_integration_3d_amr.cc(19): Entering test case "integration_3D_amr"
35: 10% completed
35: 20% completed
35: 30% completed
35: 40% completed
35: 50% completed
35: 60% completed
35: 70% completed
35: 80% completed
35: 90% completed
35: 100% completed
35: /var/jenkins/workspace/adamantine-nightly/tests/test_integration_3d_amr.cc(19): Leaving test case "integration_3D_amr"; testing time: 5826168us
35: /var/jenkins/workspace/adamantine-nightly/tests/test_integration_3d_amr.cc(60): Entering test case "integration_3D_amr_refine_coarsen"
35: /var/jenkins/workspace/adamantine-nightly/tests/test_integration_3d_amr.cc(19): Leaving test case "integration_3D_amr"; testing time: 5822944us
35: /var/jenkins/workspace/adamantine-nightly/tests/test_integration_3d_amr.cc(60): Entering test case "integration_3D_amr_refine_coarsen"
35: 10% completed
35: 20% completed
35: 30% completed
35: 40% completed
35: 50% completed
35: 60% completed
35: 70% completed
35: 80% completed
35: 90% completed
35: 100% completed
35: /var/jenkins/workspace/adamantine-nightly/tests/test_integration_3d_amr.cc(60): Leaving test case "integration_3D_amr_refine_coarsen"; testing time: 75043458us
35: Leaving test module "Integration_3D_AMR"; testing time: 80867232us
35: /var/jenkins/workspace/adamantine-nightly/tests/test_integration_3d_amr.cc(60): Leaving test case "integration_3D_amr_refine_coarsen"; testing time: 75043465us
35: Leaving test module "Integration_3D_AMR"; testing time: 80870462us
35: 
35: *** No errors detected
35: 
35: *** No errors detected
35: 
34/48 Test #35: test_integration_3d_amr_2 ................   Passed   82.03 sec
test 36
      Start 36: test_integration_3d_amr_device_1

36: Test command: /usr/bin/mpiexec "-n" "1" "/var/jenkins/workspace/adamantine-nightly/build/bin/test_integration_3d_amr_device"
36: Working Directory: /var/jenkins/workspace/adamantine-nightly/build/tests
36: Test timeout computed to be: 7200
36: Running 1 test case...
36: Entering test module "Integration_3D_AMR"
36: /var/jenkins/workspace/adamantine-nightly/tests/test_integration_3d_amr_device.cc(19): Entering test case "integration_3D_amr_device"
36: 10% completed
36: 20% completed
36: 30% completed
36: 40% completed
36: 50% completed
36: 60% completed
36: 70% completed
36: 80% completed
36: 90% completed
36: 100% completed
36: 
36: *** No errors detected
36: /var/jenkins/workspace/adamantine-nightly/tests/test_integration_3d_amr_device.cc(19): Leaving test case "integration_3D_amr_device"; testing time: 104104920us
36: Leaving test module "Integration_3D_AMR"; testing time: 104105675us
36: 
35/48 Test #36: test_integration_3d_amr_device_1 .........   Passed  105.06 sec
test 37
      Start 37: test_integration_3d_amr_device_2

37: Test command: /usr/bin/mpiexec "-n" "2" "/var/jenkins/workspace/adamantine-nightly/build/bin/test_integration_3d_amr_device"
37: Working Directory: /var/jenkins/workspace/adamantine-nightly/build/tests
37: Test timeout computed to be: 7200
37: Running 1 test case...
37: Entering test module "Integration_3D_AMR"
37: /var/jenkins/workspace/adamantine-nightly/tests/test_integration_3d_amr_device.cc(19): Entering test case "integration_3D_amr_device"
37: Running 1 test case...
37: Entering test module "Integration_3D_AMR"
37: /var/jenkins/workspace/adamantine-nightly/tests/test_integration_3d_amr_device.cc(19): Entering test case "integration_3D_amr_device"
37: 10% completed
37: 20% completed
37: 30% completed
37: 40% completed
37: 50% completed
37: 60% completed
37: 70% completed
37: 80% completed
37: 90% completed
37: 100% completed
37: /var/jenkins/workspace/adamantine-nightly/tests/test_integration_3d_amr_device.cc(19): Leaving test case "integration_3D_amr_device"; testing time: 56743480us
37: Leaving test module "Integration_3D_AMR"; testing time: 56743904us
37: /var/jenkins/workspace/adamantine-nightly/tests/test_integration_3d_amr_device.cc(19): Leaving test case "integration_3D_amr_device"; testing time: 56741336us
37: Leaving test module "Integration_3D_AMR"; testing time: 56741702us
37: 
37: *** No errors detected
37: 
37: *** No errors detected
37: 
36/48 Test #37: test_integration_3d_amr_device_2 .........   Passed   57.90 sec
test 38
      Start 38: test_integration_da_augmented_1

38: Test command: /usr/bin/mpiexec "-n" "1" "/var/jenkins/workspace/adamantine-nightly/build/bin/test_integration_da_augmented"
38: Working Directory: /var/jenkins/workspace/adamantine-nightly/build/tests
38: Test timeout computed to be: 7200
38: Running 1 test case...
38: Entering test module "Integration_Data_Assimilation_Augmented"
38: /var/jenkins/workspace/adamantine-nightly/tests/test_integration_da_augmented.cc(19): Entering test case "integration_3D_data_assimilation_augmented"
38: Reading the experimental log file...
38: Done. Log entries found for 1 camera(s), with 2 frame(s).
38: Starting the main time stepping loop...
38: 10% completed
38: 20% completed
38: 30% completed
38: 40% completed
38: 50% completed
38: 60% completed
38: 70% completed
38: Performing data assimilation at time 0.04...
38: Rank: 0 | Old parameters for member 0: 0.413453 
38: Rank: 0 | Old parameters for member 1: 0.385362 
38: Rank: 0 | Old parameters for member 2: 0.446065 
38: Rank: 0 | Number expt sites mapped to DOFs: 2
38: Getting the perturbed innovation...
38: Applying the Kalman gain...
38: Updating the ensemble members...
38: Done.
38: Rank: 0 | New parameters for member 0: 0.121104 
38: Rank: 0 | New parameters for member 1: 0.142225 
38: Rank: 0 | New parameters for member 2: 0.107206 
38: 80% completed
38: 90% completed
38: 100% completed
38: 
38: *** No errors detected
38: /var/jenkins/workspace/adamantine-nightly/tests/test_integration_da_augmented.cc(19): Leaving test case "integration_3D_data_assimilation_augmented"; testing time: 47135777us
38: Leaving test module "Integration_Data_Assimilation_Augmented"; testing time: 47136225us
38: 
37/48 Test #38: test_integration_da_augmented_1 ..........   Passed   48.10 sec
test 39
      Start 39: test_integration_da_augmented_2

39: Test command: /usr/bin/mpiexec "-n" "2" "/var/jenkins/workspace/adamantine-nightly/build/bin/test_integration_da_augmented"
39: Working Directory: /var/jenkins/workspace/adamantine-nightly/build/tests
39: Test timeout computed to be: 7200
39: Running 1 test case...
39: Entering test module "Integration_Data_Assimilation_Augmented"
39: /var/jenkins/workspace/adamantine-nightly/tests/test_integration_da_augmented.cc(19): Entering test case "integration_3D_data_assimilation_augmented"
39: Running 1 test case...
39: Entering test module "Integration_Data_Assimilation_Augmented"
39: /var/jenkins/workspace/adamantine-nightly/tests/test_integration_da_augmented.cc(19): Entering test case "integration_3D_data_assimilation_augmented"
39: Reading the experimental log file...
39: Done. Log entries found for 1 camera(s), with 2 frame(s).
39: Starting the main time stepping loop...
39: 10% completed
39: 20% completed
39: 30% completed
39: Rank: 1 | Old parameters for member 2: 0.446065 
39: Rank: 1 | Number expt sites mapped to DOFs: 2
39: 40% completed
39: 50% completed
39: 60% completed
39: 70% completed
39: Performing data assimilation at time 0.04...
39: Rank: 0 | Old parameters for member 0: 0.413453 
39: Rank: 0 | Old parameters for member 1: 0.385362 
39: Rank: 0 | Number expt sites mapped to DOFs: 2
39: Getting the perturbed innovation...
39: Applying the Kalman gain...
39: Updating the ensemble members...
39: Rank: 1 | New parameters for member 2: 0.107206 
39: Done.
39: Rank: 0 | New parameters for member 0: 0.121104 
39: Rank: 0 | New parameters for member 1: 0.142225 
39: 80% completed
39: 90% completed
39: 100% completed
39: 
39: *** No errors detected
39: 
39: *** No errors detected
39: /var/jenkins/workspace/adamantine-nightly/tests/test_integration_da_augmented.cc(19): Leaving test case "integration_3D_data_assimilation_augmented"; testing time: 32645771us
39: Leaving test module "Integration_Data_Assimilation_Augmented"; testing time: 32646112us
39: /var/jenkins/workspace/adamantine-nightly/tests/test_integration_da_augmented.cc(19): Leaving test case "integration_3D_data_assimilation_augmented"; testing time: 32647087us
39: Leaving test module "Integration_Data_Assimilation_Augmented"; testing time: 32647522us
39: 
38/48 Test #39: test_integration_da_augmented_2 ..........   Passed   33.79 sec
test 40
      Start 40: test_integration_thermoelastic_1

40: Test command: /usr/bin/mpiexec "-n" "1" "/var/jenkins/workspace/adamantine-nightly/build/bin/test_integration_thermoelastic"
40: Working Directory: /var/jenkins/workspace/adamantine-nightly/build/tests
40: Test timeout computed to be: 7200
40: Running 2 test cases...
40: Entering test module "Integration_Thermoelastic"
40: /var/jenkins/workspace/adamantine-nightly/tests/test_integration_thermoelastic.cc(19): Entering test case "integration_thermoelastic"
40: 10% completed
40: 20% completed
40: 30% completed
40: 40% completed
40: 50% completed
40: 60% completed
40: 70% completed
40: 80% completed
40: 90% completed
40: 100% completed
40: /var/jenkins/workspace/adamantine-nightly/tests/test_integration_thermoelastic.cc(19): Leaving test case "integration_thermoelastic"; testing time: 4040525459us
40: /var/jenkins/workspace/adamantine-nightly/tests/test_integration_thermoelastic.cc(47): Entering test case "integration_thermoelastic_add_material"
40: 10% completed
40: 20% completed
40: 30% completed
40: 40% completed
40: 50% completed
40: 60% completed
40: 70% completed
40: 80% completed
40: 90% completed
40: 100% completed
40: 
40: *** No errors detected
40: /var/jenkins/workspace/adamantine-nightly/tests/test_integration_thermoelastic.cc(47): Leaving test case "integration_thermoelastic_add_material"; testing time: 2561320716us
40: Leaving test module "Integration_Thermoelastic"; testing time: 6601849633us
40: 
39/48 Test #40: test_integration_thermoelastic_1 .........   Passed  6602.81 sec
test 41
      Start 41: test_integration_thermoelastic_2

41: Test command: /usr/bin/mpiexec "-n" "2" "/var/jenkins/workspace/adamantine-nightly/build/bin/test_integration_thermoelastic"
41: Working Directory: /var/jenkins/workspace/adamantine-nightly/build/tests
41: Test timeout computed to be: 7200
41: Running 2 test cases...
41: Entering test module "Integration_Thermoelastic"
41: /var/jenkins/workspace/adamantine-nightly/tests/test_integration_thermoelastic.cc(19): Entering test case "integration_thermoelastic"
41: Running 2 test cases...
41: Entering test module "Integration_Thermoelastic"
41: /var/jenkins/workspace/adamantine-nightly/tests/test_integration_thermoelastic.cc(19): Entering test case "integration_thermoelastic"
41: 10% completed
41: 20% completed
Cancelling nested steps due to timeout
Sending interrupt signal to process
Sending interrupt signal to process
Terminated
[Pipeline] }
[Pipeline] // dir
Post stage
[Pipeline] xunit
INFO: Processing CTest-Version 3.x (default)
Error when executing always post condition:
Also:   hudson.remoting.Channel$CallSiteStackTrace: Remote call to JNLP4-connect connection from 10.64.199.41/10.64.199.41:41626
		at hudson.remoting.Channel.attachCallSiteStackTrace(Channel.java:1916)
		at hudson.remoting.UserRequest$ExceptionResponse.retrieve(UserRequest.java:384)
		at hudson.remoting.Channel.call(Channel.java:1108)
		at hudson.FilePath.act(FilePath.java:1220)
		at hudson.FilePath.act(FilePath.java:1209)
		at PluginClassLoader for xunit//org.jenkinsci.plugins.xunit.XUnitProcessor.processTestsReport(XUnitProcessor.java:214)
		at PluginClassLoader for xunit//org.jenkinsci.plugins.xunit.XUnitProcessor.process(XUnitProcessor.java:163)
		at PluginClassLoader for xunit//org.jenkinsci.plugins.xunit.pipeline.XUnitResultsStepExecution.run(XUnitResultsStepExecution.java:94)
		at PluginClassLoader for xunit//org.jenkinsci.plugins.xunit.pipeline.XUnitResultsStepExecution.run(XUnitResultsStepExecution.java:53)
		at PluginClassLoader for workflow-step-api//org.jenkinsci.plugins.workflow.steps.SynchronousNonBlockingStepExecution.lambda$start$0(SynchronousNonBlockingStepExecution.java:49)
		at java.base/java.util.concurrent.Executors$RunnableAdapter.call(Unknown Source)
		at java.base/java.util.concurrent.FutureTask.run(Unknown Source)
		at java.base/java.util.concurrent.ThreadPoolExecutor.runWorker(Unknown Source)
		at java.base/java.util.concurrent.ThreadPoolExecutor$Worker.run(Unknown Source)
		at java.base/java.lang.Thread.run(Unknown Source)
Also:   org.jenkinsci.plugins.workflow.actions.ErrorAction$ErrorId: 607be47e-f433-4ffd-9d19-be434c145959
org.jenkinsci.plugins.xunit.service.NoTestFoundException: [CTest-Version 3.x (default)] - No test report file(s) were found with the pattern 'build/Testing/**/Test.xml' relative to '/var/jenkins/workspace/adamantine-nightly' for the testing framework 'CTest-Version 3.x (default)'.
Did you enter a pattern relative to (and within) the workspace directory?
Did you generate the result report(s) for 'CTest-Version 3.x (default)'?"
	at PluginClassLoader for xunit//org.jenkinsci.plugins.xunit.service.XUnitReportProcessorService.findReports(XUnitReportProcessorService.java:79)
	at PluginClassLoader for xunit//org.jenkinsci.plugins.xunit.service.XUnitTransformerCallable.invoke(XUnitTransformerCallable.java:87)
	at PluginClassLoader for xunit//org.jenkinsci.plugins.xunit.service.XUnitTransformerCallable.invoke(XUnitTransformerCallable.java:39)
	at Jenkins v2.568.3//hudson.FilePath$FileCallableWrapper.call(FilePath.java:3655)
	at hudson.remoting.UserRequest.perform(UserRequest.java:225)
	at hudson.remoting.UserRequest.perform(UserRequest.java:50)
	at hudson.remoting.Request$2.run(Request.java:391)
	at hudson.remoting.InterceptingExecutorService.lambda$wrap$0(InterceptingExecutorService.java:81)
	at java.base/java.util.concurrent.FutureTask.run(FutureTask.java:317)
	at java.base/java.util.concurrent.ThreadPoolExecutor.runWorker(ThreadPoolExecutor.java:1144)
	at java.base/java.util.concurrent.ThreadPoolExecutor$Worker.run(ThreadPoolExecutor.java:642)
	at hudson.remoting.Engine$1.lambda$newThread$0(Engine.java:312)
	at java.base/java.lang.Thread.run(Thread.java:1583)

[Pipeline] }
[Pipeline] // withEnv
[Pipeline] }
$ docker stop --time=1 2a2bb63f798223109ab975c9f066e871b69b5dac43f80f3a0f311b1ca47fc807
$ docker rm -f --volumes 2a2bb63f798223109ab975c9f066e871b69b5dac43f80f3a0f311b1ca47fc807
[Pipeline] // withDockerContainer
[Pipeline] }
[Pipeline] // withEnv
[Pipeline] }
[Pipeline] // node
[Pipeline] }
[Pipeline] // stage
[Pipeline] }
Failed in branch CUDA
[Pipeline] // parallel
[Pipeline] }
[Pipeline] // stage
[Pipeline] }
[Pipeline] // timeout
[Pipeline] }
[Pipeline] // withEnv
[Pipeline] End of Pipeline
ERROR: script returned exit code 2
Finished: FAILURE