Console Output
+ make -j8
[ 0%] Copying bare_plate_L_da_aug_ref_data_0_1.csv
[ 1%] Copying bare_plate_L_da_aug_ref_data_0_0.csv
[ 3%] Copying bare_plate_L_da.info
[ 4%] Copying amr_test.info
[ 4%] Copying bare_plate_L_da_augmented.info
[ 4%] Copying bare_plate_L_da_aug_ref_log.txt
[ 4%] Building CXX object source/CMakeFiles/Adamantine.dir/BodyForce.cc.o
[ 4%] Copying analytical_1D_transient.py
[ 4%] Built target _var_jenkins_workspace_adamantine-nightly_build_bin_bare_plate_L_da_augmented.info
[ 4%] Built target _var_jenkins_workspace_adamantine-nightly_build_bin_analytical_1D_transient.py
[ 4%] Built target _var_jenkins_workspace_adamantine-nightly_build_bin_bare_plate_L_da_aug_ref_data_0_1.csv
[ 4%] Built target _var_jenkins_workspace_adamantine-nightly_build_bin_bare_plate_L_da.info
[ 4%] Built target _var_jenkins_workspace_adamantine-nightly_build_bin_bare_plate_L_da_aug_ref_data_0_0.csv
[ 4%] Built target _var_jenkins_workspace_adamantine-nightly_build_bin_amr_test.info
[ 4%] Built target _var_jenkins_workspace_adamantine-nightly_build_bin_bare_plate_L_da_aug_ref_log.txt
[ 5%] Building CXX object source/CMakeFiles/Adamantine.dir/Boundary.cc.o
[ 5%] Building CXX object source/CMakeFiles/Adamantine.dir/CubeHeatSource.cc.o
[ 5%] Building CXX object source/CMakeFiles/Adamantine.dir/ElectronBeamHeatSource.cc.o
[ 6%] Building CXX object source/CMakeFiles/Adamantine.dir/DataAssimilator.cc.o
[ 7%] Building CXX object source/CMakeFiles/Adamantine.dir/Geometry.cc.o
[ 8%] Copying bare_plate_L_ensemble.info
[ 8%] Copying bare_plate_L_expt_data_0_0.csv
[ 8%] Built target _var_jenkins_workspace_adamantine-nightly_build_bin_bare_plate_L_ensemble.info
[ 8%] Built target _var_jenkins_workspace_adamantine-nightly_build_bin_bare_plate_L_expt_data_0_0.csv
[ 9%] Building CXX object source/CMakeFiles/Adamantine.dir/GoldakHeatSource.cc.o
[ 10%] Copying bare_plate_L_expt_data_0_1.csv
[ 10%] Built target _var_jenkins_workspace_adamantine-nightly_build_bin_bare_plate_L_expt_data_0_1.csv
[ 11%] Copying bare_plate_L_expt_log.txt
[ 11%] Built target _var_jenkins_workspace_adamantine-nightly_build_bin_bare_plate_L_expt_log.txt
[ 11%] Copying bare_plate_L_scan_path.txt
[ 11%] Built target _var_jenkins_workspace_adamantine-nightly_build_bin_bare_plate_L_scan_path.txt
[ 12%] Copying bare_plate_L_scan_path_fast.txt
[ 12%] Built target _var_jenkins_workspace_adamantine-nightly_build_bin_bare_plate_L_scan_path_fast.txt
[ 12%] Copying convective_bc_gold.txt
[ 12%] Built target _var_jenkins_workspace_adamantine-nightly_build_bin_convective_bc_gold.txt
[ 13%] Copying demo_316_short.info
[ 13%] Built target _var_jenkins_workspace_adamantine-nightly_build_bin_demo_316_short.info
[ 14%] Copying demo_316_short_amr.info
[ 14%] Built target _var_jenkins_workspace_adamantine-nightly_build_bin_demo_316_short_amr.info
[ 14%] Copying demo_316_short_anisotropic.info
[ 14%] Built target _var_jenkins_workspace_adamantine-nightly_build_bin_demo_316_short_anisotropic.info
[ 15%] Copying demo_316_short_scan_path.txt
[ 15%] Built target _var_jenkins_workspace_adamantine-nightly_build_bin_demo_316_short_scan_path.txt
[ 15%] Copying demo_316_short_scan_path_amr.txt
[ 15%] Built target _var_jenkins_workspace_adamantine-nightly_build_bin_demo_316_short_scan_path_amr.txt
[ 16%] Copying experiment_log_test.txt
[ 16%] Built target _var_jenkins_workspace_adamantine-nightly_build_bin_experiment_log_test.txt
[ 17%] Copying experimental_data_0_0.csv
[ 17%] Built target _var_jenkins_workspace_adamantine-nightly_build_bin_experimental_data_0_0.csv
[ 17%] Copying extruded_cube.msh
[ 17%] Built target _var_jenkins_workspace_adamantine-nightly_build_bin_extruded_cube.msh
[ 18%] Copying hexahedra.msh
[ 18%] Built target _var_jenkins_workspace_adamantine-nightly_build_bin_hexahedra.msh
[ 19%] Copying five_axis.info
[ 19%] Built target _var_jenkins_workspace_adamantine-nightly_build_bin_five_axis.info
[ 19%] Copying five_axis_scan_path.txt
[ 19%] Built target _var_jenkins_workspace_adamantine-nightly_build_bin_five_axis_scan_path.txt
[ 19%] Copying HourGlass_AOP.info
[ 19%] Built target _var_jenkins_workspace_adamantine-nightly_build_bin_HourGlass_AOP.info
[ 20%] Copying HourGlass_AOP.vtk
[ 20%] Built target _var_jenkins_workspace_adamantine-nightly_build_bin_HourGlass_AOP.vtk
[ 21%] Copying HourGlass_AOP_scan_path.txt
[ 21%] Built target _var_jenkins_workspace_adamantine-nightly_build_bin_HourGlass_AOP_scan_path.txt
[ 22%] Copying integration_2d.info
[ 22%] Built target _var_jenkins_workspace_adamantine-nightly_build_bin_integration_2d.info
[ 22%] Copying integration_2d_ensemble.info
[ 22%] Built target _var_jenkins_workspace_adamantine-nightly_build_bin_integration_2d_ensemble.info
[ 23%] Copying integration_2d_gold.txt
[ 23%] Built target _var_jenkins_workspace_adamantine-nightly_build_bin_integration_2d_gold.txt
[ 23%] Copying integration_2d_units.info
[ 23%] Built target _var_jenkins_workspace_adamantine-nightly_build_bin_integration_2d_units.info
[ 24%] Copying integration_3d_gold.txt
[ 24%] Built target _var_jenkins_workspace_adamantine-nightly_build_bin_integration_3d_gold.txt
[ 25%] Copying integration_3d_gold_0.txt
[ 25%] Built target _var_jenkins_workspace_adamantine-nightly_build_bin_integration_3d_gold_0.txt
[ 25%] Copying integration_3d_gold_1.txt
[ 25%] Built target _var_jenkins_workspace_adamantine-nightly_build_bin_integration_3d_gold_1.txt
[ 26%] Copying integration_3d_gold_five_axis.txt
[ 26%] Built target _var_jenkins_workspace_adamantine-nightly_build_bin_integration_3d_gold_five_axis.txt
[ 26%] Copying integration_3d_gold_five_axis_0.txt
[ 26%] Built target _var_jenkins_workspace_adamantine-nightly_build_bin_integration_3d_gold_five_axis_0.txt
[ 27%] Copying integration_3d_gold_five_axis_1.txt
[ 27%] Built target _var_jenkins_workspace_adamantine-nightly_build_bin_integration_3d_gold_five_axis_1.txt
[ 28%] Copying integration_3d_gold_short.txt
[ 28%] Built target _var_jenkins_workspace_adamantine-nightly_build_bin_integration_3d_gold_short.txt
[ 28%] Copying integration_3d_gold_short_0.txt
[ 28%] Built target _var_jenkins_workspace_adamantine-nightly_build_bin_integration_3d_gold_short_0.txt
[ 29%] Copying integration_3d_gold_short_1.txt
[ 29%] Built target _var_jenkins_workspace_adamantine-nightly_build_bin_integration_3d_gold_short_1.txt
[ 29%] Copying integration_da_add_material.info
[ 29%] Built target _var_jenkins_workspace_adamantine-nightly_build_bin_integration_da_add_material.info
[ 30%] Copying integration_da_add_material_expt_log.txt
[ 30%] Built target _var_jenkins_workspace_adamantine-nightly_build_bin_integration_da_add_material_expt_log.txt
[ 31%] Copying integration_da_add_material_expt_pc_0_0.csv
[ 31%] Built target _var_jenkins_workspace_adamantine-nightly_build_bin_integration_da_add_material_expt_pc_0_0.csv
[ 31%] Copying integration_da_add_material_expt_ray_0_0.csv
[ 31%] Built target _var_jenkins_workspace_adamantine-nightly_build_bin_integration_da_add_material_expt_ray_0_0.csv
[ 32%] Copying integration_da_add_material_sp.txt
[ 32%] Built target _var_jenkins_workspace_adamantine-nightly_build_bin_integration_da_add_material_sp.txt
[ 32%] Copying material_deposition_2d.txt
[ 32%] Built target _var_jenkins_workspace_adamantine-nightly_build_bin_material_deposition_2d.txt
[ 33%] Copying material_deposition_3d.txt
[ 33%] Built target _var_jenkins_workspace_adamantine-nightly_build_bin_material_deposition_3d.txt
[ 34%] Copying material_path_test_material_deposition.txt
[ 34%] Built target _var_jenkins_workspace_adamantine-nightly_build_bin_material_path_test_material_deposition.txt
[ 34%] Copying material_property_polynomial.info
[ 34%] Built target _var_jenkins_workspace_adamantine-nightly_build_bin_material_property_polynomial.info
[ 35%] Copying material_property_table.info
[ 35%] Built target _var_jenkins_workspace_adamantine-nightly_build_bin_material_property_table.info
[ 35%] Copying microstructure_G_R_gold_1.txt
[ 35%] Built target _var_jenkins_workspace_adamantine-nightly_build_bin_microstructure_G_R_gold_1.txt
[ 36%] Copying microstructure_G_R_gold_2.txt
[ 36%] Built target _var_jenkins_workspace_adamantine-nightly_build_bin_microstructure_G_R_gold_2.txt
[ 36%] Copying rays_cam-0-0_test_full.csv
[ 36%] Building CXX object source/CMakeFiles/Adamantine.dir/MaterialPropertyInstDev.cc.o
[ 36%] Built target _var_jenkins_workspace_adamantine-nightly_build_bin_rays_cam-0-0_test_full.csv
[ 37%] Copying raytracing_experimental_data_0_0.csv
[ 37%] Built target _var_jenkins_workspace_adamantine-nightly_build_bin_raytracing_experimental_data_0_0.csv
[ 38%] Copying raytracing_non_AA_cells-0-0.csv
[ 38%] Built target _var_jenkins_workspace_adamantine-nightly_build_bin_raytracing_non_AA_cells-0-0.csv
[ 38%] Copying scan_path.txt
[ 38%] Built target _var_jenkins_workspace_adamantine-nightly_build_bin_scan_path.txt
[ 39%] Copying scan_path_5_axis.txt
[ 39%] Built target _var_jenkins_workspace_adamantine-nightly_build_bin_scan_path_5_axis.txt
[ 40%] Copying scan_path_arcs.txt
[ 40%] Built target _var_jenkins_workspace_adamantine-nightly_build_bin_scan_path_arcs.txt
[ 41%] Copying scan_path_diagonal.txt
[ 41%] Built target _var_jenkins_workspace_adamantine-nightly_build_bin_scan_path_diagonal.txt
[ 41%] Copying scan_path_event_series.inp
[ 41%] Built target _var_jenkins_workspace_adamantine-nightly_build_bin_scan_path_event_series.inp
[ 41%] Copying scan_path_L.txt
[ 41%] Built target _var_jenkins_workspace_adamantine-nightly_build_bin_scan_path_L.txt
[ 42%] Copying scan_path_layers.txt
[ 42%] Built target _var_jenkins_workspace_adamantine-nightly_build_bin_scan_path_layers.txt
[ 42%] Copying scan_path_test_thermal_physics.txt
[ 42%] Built target _var_jenkins_workspace_adamantine-nightly_build_bin_scan_path_test_thermal_physics.txt
[ 43%] Copying scan_path_units.txt
[ 43%] Built target _var_jenkins_workspace_adamantine-nightly_build_bin_scan_path_units.txt
[ 43%] Copying Simple_3D_ring.stl
[ 43%] Built target _var_jenkins_workspace_adamantine-nightly_build_bin_Simple_3D_ring.stl
[ 44%] Copying thermoelastic_bare_plate.info
[ 44%] Built target _var_jenkins_workspace_adamantine-nightly_build_bin_thermoelastic_bare_plate.info
[ 44%] Copying thermoelastic_bare_plate_add_material_scan_path.txt
[ 44%] Built target _var_jenkins_workspace_adamantine-nightly_build_bin_thermoelastic_bare_plate_add_material_scan_path.txt
[ 45%] Building CXX object source/CMakeFiles/Adamantine.dir/MaterialPropertyInstHost.cc.o
[ 46%] Copying thermoelastic_bare_plate_scan_path.txt
[ 46%] Built target _var_jenkins_workspace_adamantine-nightly_build_bin_thermoelastic_bare_plate_scan_path.txt
[ 46%] Copying within_stl_gold.txt
[ 46%] Built target _var_jenkins_workspace_adamantine-nightly_build_bin_within_stl_gold.txt
[ 46%] Building CXX object source/CMakeFiles/Adamantine.dir/MechanicalOperator.cc.o
[ 47%] Building CXX object source/CMakeFiles/Adamantine.dir/MechanicalPhysics.cc.o
[ 48%] Building CXX object source/CMakeFiles/Adamantine.dir/Microstructure.cc.o
[ 48%] Building CXX object source/CMakeFiles/Adamantine.dir/PointCloud.cc.o
[ 49%] Building CXX object source/CMakeFiles/Adamantine.dir/PostProcessor.cc.o
[ 49%] Building CXX object source/CMakeFiles/Adamantine.dir/Quaternion.cc.o
[ 50%] Building CXX object source/CMakeFiles/Adamantine.dir/RayTracing.cc.o
[ 51%] Building CXX object source/CMakeFiles/Adamantine.dir/ScanPath.cc.o
[ 51%] Building CXX object source/CMakeFiles/Adamantine.dir/ThermalOperatorInstSHost.cc.o
[ 52%] Building CXX object source/CMakeFiles/Adamantine.dir/ThermalOperatorInstSLHost.cc.o
[ 52%] Building CXX object source/CMakeFiles/Adamantine.dir/ThermalOperatorInstSLPHost.cc.o
[ 53%] Building CXX object source/CMakeFiles/Adamantine.dir/ThermalOperatorDeviceInstSDev.cc.o
[ 54%] Building CXX object source/CMakeFiles/Adamantine.dir/ThermalOperatorDeviceInstSLDev.cc.o
[ 54%] Building CXX object source/CMakeFiles/Adamantine.dir/ThermalOperatorDeviceInstSLPDev.cc.o
[ 55%] Building CXX object source/CMakeFiles/Adamantine.dir/ThermalPhysicsInstSDev.cc.o
[ 55%] Building CXX object source/CMakeFiles/Adamantine.dir/ThermalPhysicsInstSLDev.cc.o
In file included from /var/jenkins/workspace/adamantine-nightly/source/ThermalOperatorDeviceInstSDev.cc:6:
/var/jenkins/workspace/adamantine-nightly/source/instantiation.hh:134:44: fatal error: error writing to /tmp/cc3J85uo.s: No space left on device
134 | dealii::MemorySpace::Default>;
| ^
/usr/include/boost/preprocessor/seq/for_each_product.hpp:62:71: note: in expansion of macro 'ADAMANTINE_D_N_U_P_F_S_DEV'
62 | # define BOOST_PP_SEQ_FOR_EACH_PRODUCT_I_I(r, cset, rset, res, macro) macro(r, BOOST_PP_SEQ_TAIL(res (BOOST_PP_SEQ_HEAD(cset))))
| ^~~~~
/var/jenkins/workspace/adamantine-nightly/source/ThermalOperatorDeviceInstSDev.cc:8:1: note: in expansion of macro 'INSTANTIATE_DIM_NMAT_USETABLE_PORDER_FEDEGREE_S_DEVICE'
8 | INSTANTIATE_DIM_NMAT_USETABLE_PORDER_FEDEGREE_S_DEVICE(ThermalOperatorDevice)
| ^~~~~~~~~~~~~~~~~~~~~~~~~~~~~~~~~~~~~~~~~~~~~~~~~~~~~~
compilation terminated.
make[2]: *** [source/CMakeFiles/Adamantine.dir/build.make:356: source/CMakeFiles/Adamantine.dir/ThermalOperatorDeviceInstSDev.cc.o] Error 1
make[2]: *** Waiting for unfinished jobs....
In file included from /var/jenkins/workspace/adamantine-nightly/source/ThermalOperatorInstSLHost.cc:6:
/var/jenkins/workspace/adamantine-nightly/source/instantiation.hh:94:41: fatal error: error writing to /tmp/ccr9bt4b.s: No space left on device
94 | dealii::MemorySpace::Host>;
| ^
/usr/include/boost/preprocessor/seq/for_each_product.hpp:62:71: note: in expansion of macro 'ADAMANTINE_D_N_U_P_F_SL_HOST'
62 | # define BOOST_PP_SEQ_FOR_EACH_PRODUCT_I_I(r, cset, rset, res, macro) macro(r, BOOST_PP_SEQ_TAIL(res (BOOST_PP_SEQ_HEAD(cset))))
| ^~~~~
/var/jenkins/workspace/adamantine-nightly/source/ThermalOperatorInstSLHost.cc:8:1: note: in expansion of macro 'INSTANTIATE_DIM_NMAT_USETABLE_PORDER_FEDEGREE_SL_HOST'
8 | INSTANTIATE_DIM_NMAT_USETABLE_PORDER_FEDEGREE_SL_HOST(ThermalOperator)
| ^~~~~~~~~~~~~~~~~~~~~~~~~~~~~~~~~~~~~~~~~~~~~~~~~~~~~
compilation terminated.
make[2]: *** [source/CMakeFiles/Adamantine.dir/build.make:328: source/CMakeFiles/Adamantine.dir/ThermalOperatorInstSLHost.cc.o] Error 1
In file included from /var/jenkins/workspace/adamantine-nightly/source/ThermalOperatorInstSLPHost.cc:6:
/var/jenkins/workspace/adamantine-nightly/source/instantiation.hh:114:41: fatal error: error writing to /tmp/ccFoq331.s: No space left on device
114 | dealii::MemorySpace::Host>;
| ^
/usr/include/boost/preprocessor/seq/for_each_product.hpp:62:71: note: in expansion of macro 'ADAMANTINE_D_N_U_P_F_SLP_HOST'
62 | # define BOOST_PP_SEQ_FOR_EACH_PRODUCT_I_I(r, cset, rset, res, macro) macro(r, BOOST_PP_SEQ_TAIL(res (BOOST_PP_SEQ_HEAD(cset))))
| ^~~~~
/var/jenkins/workspace/adamantine-nightly/source/ThermalOperatorInstSLPHost.cc:8:1: note: in expansion of macro 'INSTANTIATE_DIM_NMAT_USETABLE_PORDER_FEDEGREE_SLP_HOST'
8 | INSTANTIATE_DIM_NMAT_USETABLE_PORDER_FEDEGREE_SLP_HOST(ThermalOperator)
| ^~~~~~~~~~~~~~~~~~~~~~~~~~~~~~~~~~~~~~~~~~~~~~~~~~~~~~
compilation terminated.
In file included from /var/jenkins/workspace/adamantine-nightly/source/ThermalOperatorDeviceInstSLDev.cc:6:
/var/jenkins/workspace/adamantine-nightly/source/instantiation.hh:154:44: fatal error: error writing to /tmp/ccJIAwFn.s: No space left on device
154 | dealii::MemorySpace::Default>;
| ^
/usr/include/boost/preprocessor/seq/for_each_product.hpp:62:71: note: in expansion of macro 'ADAMANTINE_D_N_U_P_F_SL_DEV'
62 | # define BOOST_PP_SEQ_FOR_EACH_PRODUCT_I_I(r, cset, rset, res, macro) macro(r, BOOST_PP_SEQ_TAIL(res (BOOST_PP_SEQ_HEAD(cset))))
| ^~~~~
/var/jenkins/workspace/adamantine-nightly/source/ThermalOperatorDeviceInstSLDev.cc:8:1: note: in expansion of macro 'INSTANTIATE_DIM_NMAT_USETABLE_PORDER_FEDEGREE_SL_DEVICE'
8 | INSTANTIATE_DIM_NMAT_USETABLE_PORDER_FEDEGREE_SL_DEVICE(ThermalOperatorDevice)
| ^~~~~~~~~~~~~~~~~~~~~~~~~~~~~~~~~~~~~~~~~~~~~~~~~~~~~~~
compilation terminated.
make[2]: *** [source/CMakeFiles/Adamantine.dir/build.make:342: source/CMakeFiles/Adamantine.dir/ThermalOperatorInstSLPHost.cc.o] Error 1
make[2]: *** [source/CMakeFiles/Adamantine.dir/build.make:370: source/CMakeFiles/Adamantine.dir/ThermalOperatorDeviceInstSLDev.cc.o] Error 1
In file included from /var/jenkins/workspace/adamantine-nightly/source/ThermalOperatorDeviceInstSLPDev.cc:6:
/var/jenkins/workspace/adamantine-nightly/source/instantiation.hh:174:44: fatal error: error writing to /tmp/ccUlT2kS.s: No space left on device
174 | dealii::MemorySpace::Default>;
| ^
/usr/include/boost/preprocessor/seq/for_each_product.hpp:62:71: note: in expansion of macro 'ADAMANTINE_D_N_U_P_F_SLP_DEV'
62 | # define BOOST_PP_SEQ_FOR_EACH_PRODUCT_I_I(r, cset, rset, res, macro) macro(r, BOOST_PP_SEQ_TAIL(res (BOOST_PP_SEQ_HEAD(cset))))
| ^~~~~
/var/jenkins/workspace/adamantine-nightly/source/ThermalOperatorDeviceInstSLPDev.cc:8:1: note: in expansion of macro 'INSTANTIATE_DIM_NMAT_USETABLE_PORDER_FEDEGREE_SLP_DEVICE'
8 | INSTANTIATE_DIM_NMAT_USETABLE_PORDER_FEDEGREE_SLP_DEVICE(ThermalOperatorDevice)
| ^~~~~~~~~~~~~~~~~~~~~~~~~~~~~~~~~~~~~~~~~~~~~~~~~~~~~~~~
compilation terminated.
make[2]: *** [source/CMakeFiles/Adamantine.dir/build.make:384: source/CMakeFiles/Adamantine.dir/ThermalOperatorDeviceInstSLPDev.cc.o] Error 1
In file included from /var/jenkins/workspace/adamantine-nightly/source/ThermalPhysicsInstSLDev.cc:6:
/var/jenkins/workspace/adamantine-nightly/source/instantiation.hh:274:41: fatal error: error writing to /tmp/ccNEhlvp.s: No space left on device
274 | BOOST_PP_SEQ_ELEM(5, SEQ)>;
| ^
/usr/include/boost/preprocessor/seq/for_each_product.hpp:62:71: note: in expansion of macro 'ADAMANTINE_D_N_P_F_SL_Q_DEV'
62 | # define BOOST_PP_SEQ_FOR_EACH_PRODUCT_I_I(r, cset, rset, res, macro) macro(r, BOOST_PP_SEQ_TAIL(res (BOOST_PP_SEQ_HEAD(cset))))
| ^~~~~
/var/jenkins/workspace/adamantine-nightly/source/ThermalPhysicsInstSLDev.cc:8:1: note: in expansion of macro 'INSTANTIATE_DIM_NMAT_PORDER_FEDEGREE_SL_QUAD_DEVICE'
8 | INSTANTIATE_DIM_NMAT_PORDER_FEDEGREE_SL_QUAD_DEVICE(ThermalPhysics)
| ^~~~~~~~~~~~~~~~~~~~~~~~~~~~~~~~~~~~~~~~~~~~~~~~~~~
compilation terminated.
make[2]: *** [source/CMakeFiles/Adamantine.dir/build.make:412: source/CMakeFiles/Adamantine.dir/ThermalPhysicsInstSLDev.cc.o] Error 1
make[1]: *** [CMakeFiles/Makefile2:1143: source/CMakeFiles/Adamantine.dir/all] Error 2
make: *** [Makefile:146: all] Error 2