Skipping 540 KB..
Full LogTestTestTestTestTestTestTestTestTestTestTestTestTestTestTestTestTestTestTestTestTestTestTestTestTestTestTestTestTestTestTestTestTestTestTestTestTestTestTestTestTestTestTestTestTestTestTestTestTestTestTestTestTestTestTestTestTestTestTestTestTestTestTestTestTestTestTestTestTestTestTestTestTestTestTestTestTestTestTestTestTestTestTestTestTestTestTestTestTestTestTestTestTestTestTestTestTestTestTestTestTestTestTestTestTestTestTestTestTestTestTestTestTestTestTestTestTestTestTestTestTestTestTestTestTestTestTestTestTestTestTestTestTestTestTestTestTestTestTestTestTestTestTestTestTestTestTestTestTestTestTestTestTestTestTestTestTestTestTestTestTestTestTestTestTestTestTestTestTestTestTestTestTestTestTestTestTestTestTestTestTestTestTestTestTestTestTestTestTestTestTestTestTestTestTestTestTestTestTestTestTestTestTestTestTestTestTestTestTestTestTestTestTestTestTestTestTestTestTestTestTestTestTestTestTestTestTestTestTestTestTestTestTestTestTestTestTestTestTestTestTestTestTestTestTestTestTestTestTestTestTestTestTestTestTestTestTestTestTestTestTestTestTestTestTestTestTest
+ cmake --build build-kokkos --parallel 7
[ 8%] Building CXX object core/src/CMakeFiles/kokkoscore.dir/impl/Kokkos_CPUDiscovery.cpp.o
[ 8%] Building CXX object core/src/CMakeFiles/kokkoscore.dir/impl/Kokkos_Abort.cpp.o
[ 12%] Building CXX object core/src/CMakeFiles/kokkoscore.dir/impl/Kokkos_Core.cpp.o
[ 16%] Building CXX object core/src/CMakeFiles/kokkoscore.dir/impl/Kokkos_Command_Line_Parsing.cpp.o
[ 20%] Building CXX object core/src/CMakeFiles/kokkoscore.dir/impl/Kokkos_Error.cpp.o
[ 24%] Building CXX object core/src/CMakeFiles/kokkoscore.dir/impl/Kokkos_ExecPolicy.cpp.o
[ 24%] Built target Kokkos_AlwaysCheckGit
[ 28%] Building CXX object core/src/CMakeFiles/kokkoscore.dir/impl/Kokkos_HostBarrier.cpp.o
[ 32%] Building CXX object core/src/CMakeFiles/kokkoscore.dir/impl/Kokkos_HostSpace.cpp.o
[ 36%] Building CXX object core/src/CMakeFiles/kokkoscore.dir/impl/Kokkos_HostSpace_deepcopy.cpp.o
[ 40%] Building CXX object core/src/CMakeFiles/kokkoscore.dir/impl/Kokkos_HostThreadTeam.cpp.o
[ 44%] Building CXX object core/src/CMakeFiles/kokkoscore.dir/impl/Kokkos_MemoryPool.cpp.o
[ 48%] Building CXX object core/src/CMakeFiles/kokkoscore.dir/impl/Kokkos_Profiling.cpp.o
[ 52%] Building CXX object core/src/CMakeFiles/kokkoscore.dir/impl/Kokkos_SharedAlloc.cpp.o
[ 56%] Building CXX object core/src/CMakeFiles/kokkoscore.dir/impl/Kokkos_Stacktrace.cpp.o
[ 60%] Building CXX object core/src/CMakeFiles/kokkoscore.dir/impl/Kokkos_hwloc.cpp.o
[ 64%] Building CXX object core/src/CMakeFiles/kokkoscore.dir/Serial/Kokkos_Serial.cpp.o
[ 68%] Building CXX object CMakeFiles/impl_git_version.dir/generated/Kokkos_Version_Info.cpp.o
[ 72%] Linking CXX static library libimpl_git_version.a
[ 72%] Built target impl_git_version
[ 76%] Linking CXX static library libkokkoscore.a
[ 76%] Built target kokkoscore
[ 80%] Building CXX object algorithms/src/CMakeFiles/kokkosalgorithms.dir/KokkosAlgorithms_dummy.cpp.o
[ 88%] Building CXX object containers/src/CMakeFiles/kokkoscontainers.dir/impl/Kokkos_UnorderedMap_impl.cpp.o
[ 88%] Building CXX object simd/src/CMakeFiles/kokkossimd.dir/Kokkos_SIMD_dummy.cpp.o
[ 92%] Linking CXX static library libkokkosalgorithms.a
[ 96%] Linking CXX static library libkokkossimd.a
[ 96%] Built target kokkosalgorithms
[ 96%] Built target kokkossimd
[100%] Linking CXX static library libkokkoscontainers.a
[100%] Built target kokkoscontainers
[Pipeline] sh
+ cmake --install build-kokkos
-- Install configuration: "Release"
-- Installing: /var/jenkins/workspace/ArborX_nightly/install-kokkos/include
-- Installing: /var/jenkins/workspace/ArborX_nightly/install-kokkos/include/Kokkos_Array.hpp
-- Installing: /var/jenkins/workspace/ArborX_nightly/install-kokkos/include/Kokkos_MathematicalSpecialFunctions.hpp
-- Installing: /var/jenkins/workspace/ArborX_nightly/install-kokkos/include/Kokkos_Pair.hpp
-- Installing: /var/jenkins/workspace/ArborX_nightly/install-kokkos/include/Kokkos_Parallel_For.hpp
-- Installing: /var/jenkins/workspace/ArborX_nightly/install-kokkos/include/setup
-- Installing: /var/jenkins/workspace/ArborX_nightly/install-kokkos/include/setup/Kokkos_Setup_Cuda.hpp
-- Installing: /var/jenkins/workspace/ArborX_nightly/install-kokkos/include/setup/Kokkos_Setup_HIP.hpp
-- Installing: /var/jenkins/workspace/ArborX_nightly/install-kokkos/include/setup/Kokkos_Setup_SYCL.hpp
-- Installing: /var/jenkins/workspace/ArborX_nightly/install-kokkos/include/Kokkos_MathematicalConstants.hpp
-- Installing: /var/jenkins/workspace/ArborX_nightly/install-kokkos/include/Kokkos_MemoryPool.hpp
-- Installing: /var/jenkins/workspace/ArborX_nightly/install-kokkos/include/Kokkos_MinMax.hpp
-- Installing: /var/jenkins/workspace/ArborX_nightly/install-kokkos/include/Kokkos_GraphNode.hpp
-- Installing: /var/jenkins/workspace/ArborX_nightly/install-kokkos/include/SYCL
-- Installing: /var/jenkins/workspace/ArborX_nightly/install-kokkos/include/SYCL/Kokkos_SYCL.hpp
-- Installing: /var/jenkins/workspace/ArborX_nightly/install-kokkos/include/SYCL/Kokkos_SYCL_WorkgroupReduction.hpp
-- Installing: /var/jenkins/workspace/ArborX_nightly/install-kokkos/include/SYCL/Kokkos_SYCL_ParallelReduce_MDRange.hpp
-- Installing: /var/jenkins/workspace/ArborX_nightly/install-kokkos/include/SYCL/Kokkos_SYCL_ParallelReduce_Range.hpp
-- Installing: /var/jenkins/workspace/ArborX_nightly/install-kokkos/include/SYCL/Kokkos_SYCL_TeamPolicy.hpp
-- Installing: /var/jenkins/workspace/ArborX_nightly/install-kokkos/include/SYCL/Kokkos_SYCL_Half_Impl_Type.hpp
-- Installing: /var/jenkins/workspace/ArborX_nightly/install-kokkos/include/SYCL/Kokkos_SYCL_Instance.hpp
-- Installing: /var/jenkins/workspace/ArborX_nightly/install-kokkos/include/SYCL/Kokkos_SYCL_ParallelScan_Range.hpp
-- Installing: /var/jenkins/workspace/ArborX_nightly/install-kokkos/include/SYCL/Kokkos_SYCL_ParallelFor_Range.hpp
-- Installing: /var/jenkins/workspace/ArborX_nightly/install-kokkos/include/SYCL/Kokkos_SYCL_UniqueToken.hpp
-- Installing: /var/jenkins/workspace/ArborX_nightly/install-kokkos/include/SYCL/Kokkos_SYCL_ParallelFor_MDRange.hpp
-- Installing: /var/jenkins/workspace/ArborX_nightly/install-kokkos/include/SYCL/Kokkos_SYCL_ZeroMemset.hpp
-- Installing: /var/jenkins/workspace/ArborX_nightly/install-kokkos/include/SYCL/Kokkos_SYCL_MDRangePolicy.hpp
-- Installing: /var/jenkins/workspace/ArborX_nightly/install-kokkos/include/SYCL/Kokkos_SYCL_Abort.hpp
-- Installing: /var/jenkins/workspace/ArborX_nightly/install-kokkos/include/SYCL/Kokkos_SYCL_ParallelReduce_Team.hpp
-- Installing: /var/jenkins/workspace/ArborX_nightly/install-kokkos/include/SYCL/Kokkos_SYCL_Graph_Impl.hpp
-- Installing: /var/jenkins/workspace/ArborX_nightly/install-kokkos/include/SYCL/Kokkos_SYCL_GraphNodeKernel.hpp
-- Installing: /var/jenkins/workspace/ArborX_nightly/install-kokkos/include/SYCL/Kokkos_SYCL_Half_Conversion.hpp
-- Installing: /var/jenkins/workspace/ArborX_nightly/install-kokkos/include/SYCL/Kokkos_SYCL_GraphNode_Impl.hpp
-- Installing: /var/jenkins/workspace/ArborX_nightly/install-kokkos/include/SYCL/Kokkos_SYCL_Team.hpp
-- Installing: /var/jenkins/workspace/ArborX_nightly/install-kokkos/include/SYCL/Kokkos_SYCL_DeepCopy.hpp
-- Installing: /var/jenkins/workspace/ArborX_nightly/install-kokkos/include/SYCL/Kokkos_SYCL_Space.hpp
-- Installing: /var/jenkins/workspace/ArborX_nightly/install-kokkos/include/SYCL/Kokkos_SYCL_Half_MathematicalFunctions.hpp
-- Installing: /var/jenkins/workspace/ArborX_nightly/install-kokkos/include/SYCL/Kokkos_SYCL_ParallelFor_Team.hpp
-- Installing: /var/jenkins/workspace/ArborX_nightly/install-kokkos/include/Kokkos_Complex.hpp
-- Installing: /var/jenkins/workspace/ArborX_nightly/install-kokkos/include/Kokkos_ReductionIdentity.hpp
-- Installing: /var/jenkins/workspace/ArborX_nightly/install-kokkos/include/Kokkos_AcquireUniqueTokenImpl.hpp
-- Installing: /var/jenkins/workspace/ArborX_nightly/install-kokkos/include/Kokkos_Graph.hpp
-- Installing: /var/jenkins/workspace/ArborX_nightly/install-kokkos/include/Kokkos_UniqueToken.hpp
-- Installing: /var/jenkins/workspace/ArborX_nightly/install-kokkos/include/Kokkos_ScopeGuard.hpp
-- Installing: /var/jenkins/workspace/ArborX_nightly/install-kokkos/include/View
-- Installing: /var/jenkins/workspace/ArborX_nightly/install-kokkos/include/View/Kokkos_BasicView.hpp
-- Installing: /var/jenkins/workspace/ArborX_nightly/install-kokkos/include/View/Kokkos_ViewUniformType.hpp
-- Installing: /var/jenkins/workspace/ArborX_nightly/install-kokkos/include/View/MDSpan
-- Installing: /var/jenkins/workspace/ArborX_nightly/install-kokkos/include/View/MDSpan/Kokkos_MDSpan_Accessor.hpp
-- Installing: /var/jenkins/workspace/ArborX_nightly/install-kokkos/include/View/MDSpan/Kokkos_MDSpan_Header.hpp
-- Installing: /var/jenkins/workspace/ArborX_nightly/install-kokkos/include/View/MDSpan/Kokkos_MDSpan_Extents.hpp
-- Installing: /var/jenkins/workspace/ArborX_nightly/install-kokkos/include/View/MDSpan/Kokkos_MDSpan_Layout.hpp
-- Installing: /var/jenkins/workspace/ArborX_nightly/install-kokkos/include/View/Hooks
-- Installing: /var/jenkins/workspace/ArborX_nightly/install-kokkos/include/View/Hooks/Kokkos_ViewHooks.hpp
-- Installing: /var/jenkins/workspace/ArborX_nightly/install-kokkos/include/View/Kokkos_ViewTraits.hpp
-- Installing: /var/jenkins/workspace/ArborX_nightly/install-kokkos/include/View/Kokkos_ViewAlloc.hpp
-- Installing: /var/jenkins/workspace/ArborX_nightly/install-kokkos/include/View/Kokkos_ViewCtor.hpp
-- Installing: /var/jenkins/workspace/ArborX_nightly/install-kokkos/include/View/Kokkos_ViewCommonType.hpp
-- Installing: /var/jenkins/workspace/ArborX_nightly/install-kokkos/include/View/Kokkos_ViewDataAnalysis.hpp
-- Installing: /var/jenkins/workspace/ArborX_nightly/install-kokkos/include/View/Kokkos_ViewAccessPreconditionsCheck.hpp
-- Installing: /var/jenkins/workspace/ArborX_nightly/install-kokkos/include/View/Kokkos_ViewTracker.hpp
-- Installing: /var/jenkins/workspace/ArborX_nightly/install-kokkos/include/Kokkos_Abort.hpp
-- Installing: /var/jenkins/workspace/ArborX_nightly/install-kokkos/include/Kokkos_Layout.hpp
-- Installing: /var/jenkins/workspace/ArborX_nightly/install-kokkos/include/Kokkos_Crs.hpp
-- Installing: /var/jenkins/workspace/ArborX_nightly/install-kokkos/include/KokkosExp_InterOp.hpp
-- Installing: /var/jenkins/workspace/ArborX_nightly/install-kokkos/include/Kokkos_Macros.hpp
-- Installing: /var/jenkins/workspace/ArborX_nightly/install-kokkos/include/Kokkos_Atomics_Desul_Wrapper.hpp
-- Installing: /var/jenkins/workspace/ArborX_nightly/install-kokkos/include/Kokkos_BitManipulation.hpp
-- Installing: /var/jenkins/workspace/ArborX_nightly/install-kokkos/include/HIP
-- Installing: /var/jenkins/workspace/ArborX_nightly/install-kokkos/include/HIP/Kokkos_HIP_TeamPolicyInternal.hpp
-- Installing: /var/jenkins/workspace/ArborX_nightly/install-kokkos/include/HIP/Kokkos_HIP_Vectorization.hpp
-- Installing: /var/jenkins/workspace/ArborX_nightly/install-kokkos/include/HIP/Kokkos_HIP_UniqueToken.hpp
-- Installing: /var/jenkins/workspace/ArborX_nightly/install-kokkos/include/HIP/Kokkos_HIP_Shuffle_Reduce.hpp
-- Installing: /var/jenkins/workspace/ArborX_nightly/install-kokkos/include/HIP/Kokkos_HIP_Half_Conversion.hpp
-- Installing: /var/jenkins/workspace/ArborX_nightly/install-kokkos/include/HIP/Kokkos_HIP_ParallelReduce_Team.hpp
-- Installing: /var/jenkins/workspace/ArborX_nightly/install-kokkos/include/HIP/Kokkos_HIP_Instance.hpp
-- Installing: /var/jenkins/workspace/ArborX_nightly/install-kokkos/include/HIP/Kokkos_HIP.hpp
-- Installing: /var/jenkins/workspace/ArborX_nightly/install-kokkos/include/HIP/Kokkos_HIP_DeepCopy.hpp
-- Installing: /var/jenkins/workspace/ArborX_nightly/install-kokkos/include/HIP/Kokkos_HIP_Half_Impl_Type.hpp
-- Installing: /var/jenkins/workspace/ArborX_nightly/install-kokkos/include/HIP/Kokkos_HIP_WorkGraphPolicy.hpp
-- Installing: /var/jenkins/workspace/ArborX_nightly/install-kokkos/include/HIP/Kokkos_HIP_BlockSize_Deduction.hpp
-- Installing: /var/jenkins/workspace/ArborX_nightly/install-kokkos/include/HIP/Kokkos_HIP_GraphNodeKernel.hpp
-- Installing: /var/jenkins/workspace/ArborX_nightly/install-kokkos/include/HIP/Kokkos_HIP_Graph_Impl.hpp
-- Installing: /var/jenkins/workspace/ArborX_nightly/install-kokkos/include/HIP/Kokkos_HIP_Team.hpp
-- Installing: /var/jenkins/workspace/ArborX_nightly/install-kokkos/include/HIP/Kokkos_HIP_ParallelReduce_Range.hpp
-- Installing: /var/jenkins/workspace/ArborX_nightly/install-kokkos/include/HIP/Kokkos_HIP_GraphNode_Impl.hpp
-- Installing: /var/jenkins/workspace/ArborX_nightly/install-kokkos/include/HIP/Kokkos_HIP_Abort.hpp
-- Installing: /var/jenkins/workspace/ArborX_nightly/install-kokkos/include/HIP/Kokkos_HIP_ZeroMemset.hpp
-- Installing: /var/jenkins/workspace/ArborX_nightly/install-kokkos/include/HIP/Kokkos_HIP_ReduceScan.hpp
-- Installing: /var/jenkins/workspace/ArborX_nightly/install-kokkos/include/HIP/Kokkos_HIP_ParallelFor_MDRange.hpp
-- Installing: /var/jenkins/workspace/ArborX_nightly/install-kokkos/include/HIP/Kokkos_HIP_IsXnack.hpp
-- Installing: /var/jenkins/workspace/ArborX_nightly/install-kokkos/include/HIP/Kokkos_HIP_Space.hpp
-- Installing: /var/jenkins/workspace/ArborX_nightly/install-kokkos/include/HIP/Kokkos_HIP_Error.hpp
-- Installing: /var/jenkins/workspace/ArborX_nightly/install-kokkos/include/HIP/Kokkos_HIP_ParallelFor_Team.hpp
-- Installing: /var/jenkins/workspace/ArborX_nightly/install-kokkos/include/HIP/Kokkos_HIP_ParallelReduce_MDRange.hpp
-- Installing: /var/jenkins/workspace/ArborX_nightly/install-kokkos/include/HIP/Kokkos_HIP_MDRangePolicy.hpp
-- Installing: /var/jenkins/workspace/ArborX_nightly/install-kokkos/include/HIP/Kokkos_HIP_ParallelScan_Range.hpp
-- Installing: /var/jenkins/workspace/ArborX_nightly/install-kokkos/include/HIP/Kokkos_HIP_KernelLaunch.hpp
-- Installing: /var/jenkins/workspace/ArborX_nightly/install-kokkos/include/HIP/Kokkos_HIP_Half_MathematicalFunctions.hpp
-- Installing: /var/jenkins/workspace/ArborX_nightly/install-kokkos/include/HIP/Kokkos_HIP_ParallelFor_Range.hpp
-- Installing: /var/jenkins/workspace/ArborX_nightly/install-kokkos/include/Kokkos_hwloc.hpp
-- Installing: /var/jenkins/workspace/ArborX_nightly/install-kokkos/include/Kokkos_MemoryTraits.hpp
-- Installing: /var/jenkins/workspace/ArborX_nightly/install-kokkos/include/Kokkos_Timer.hpp
-- Installing: /var/jenkins/workspace/ArborX_nightly/install-kokkos/include/Cuda
-- Installing: /var/jenkins/workspace/ArborX_nightly/install-kokkos/include/Cuda/Kokkos_Cuda_Team.hpp
-- Installing: /var/jenkins/workspace/ArborX_nightly/install-kokkos/include/Cuda/Kokkos_Cuda_Instance.hpp
-- Installing: /var/jenkins/workspace/ArborX_nightly/install-kokkos/include/Cuda/Kokkos_Cuda_GraphNodeKernel.hpp
-- Installing: /var/jenkins/workspace/ArborX_nightly/install-kokkos/include/Cuda/Kokkos_Cuda_Half_MathematicalFunctions.hpp
-- Installing: /var/jenkins/workspace/ArborX_nightly/install-kokkos/include/Cuda/Kokkos_Cuda_Parallel_Range.hpp
-- Installing: /var/jenkins/workspace/ArborX_nightly/install-kokkos/include/Cuda/Kokkos_Cuda_WorkGraphPolicy.hpp
-- Installing: /var/jenkins/workspace/ArborX_nightly/install-kokkos/include/Cuda/Kokkos_Cuda_ZeroMemset.hpp
-- Installing: /var/jenkins/workspace/ArborX_nightly/install-kokkos/include/Cuda/Kokkos_Cuda_BlockSize_Deduction.hpp
-- Installing: /var/jenkins/workspace/ArborX_nightly/install-kokkos/include/Cuda/Kokkos_Cuda_Parallel_MDRange.hpp
-- Installing: /var/jenkins/workspace/ArborX_nightly/install-kokkos/include/Cuda/Kokkos_Cuda_Error.hpp
-- Installing: /var/jenkins/workspace/ArborX_nightly/install-kokkos/include/Cuda/Kokkos_Cuda_GraphNode_Impl.hpp
-- Installing: /var/jenkins/workspace/ArborX_nightly/install-kokkos/include/Cuda/Kokkos_Cuda_UniqueToken.hpp
-- Installing: /var/jenkins/workspace/ArborX_nightly/install-kokkos/include/Cuda/Kokkos_Cuda_MDRangePolicy.hpp
-- Installing: /var/jenkins/workspace/ArborX_nightly/install-kokkos/include/Cuda/Kokkos_CudaSpace.hpp
-- Installing: /var/jenkins/workspace/ArborX_nightly/install-kokkos/include/Cuda/Kokkos_Cuda_Half_Conversion.hpp
-- Installing: /var/jenkins/workspace/ArborX_nightly/install-kokkos/include/Cuda/Kokkos_Cuda_Vectorization.hpp
-- Installing: /var/jenkins/workspace/ArborX_nightly/install-kokkos/include/Cuda/Kokkos_Cuda_KernelLaunch.hpp
-- Installing: /var/jenkins/workspace/ArborX_nightly/install-kokkos/include/Cuda/Kokkos_Cuda_abort.hpp
-- Installing: /var/jenkins/workspace/ArborX_nightly/install-kokkos/include/Cuda/Kokkos_Cuda_Half_Impl_Type.hpp
-- Installing: /var/jenkins/workspace/ArborX_nightly/install-kokkos/include/Cuda/Kokkos_Cuda.hpp
-- Installing: /var/jenkins/workspace/ArborX_nightly/install-kokkos/include/Cuda/Kokkos_Cuda_Graph_Impl.hpp
-- Installing: /var/jenkins/workspace/ArborX_nightly/install-kokkos/include/Cuda/Kokkos_Cuda_Parallel_Team.hpp
-- Installing: /var/jenkins/workspace/ArborX_nightly/install-kokkos/include/Cuda/Kokkos_Cuda_ReduceScan.hpp
-- Installing: /var/jenkins/workspace/ArborX_nightly/install-kokkos/include/Kokkos_Atomic.hpp
-- Installing: /var/jenkins/workspace/ArborX_nightly/install-kokkos/include/Kokkos_CopyViews.hpp
-- Installing: /var/jenkins/workspace/ArborX_nightly/install-kokkos/include/Kokkos_Graph_fwd.hpp
-- Installing: /var/jenkins/workspace/ArborX_nightly/install-kokkos/include/fwd
-- Installing: /var/jenkins/workspace/ArborX_nightly/install-kokkos/include/fwd/Kokkos_Fwd_OPENACC.hpp
-- Installing: /var/jenkins/workspace/ArborX_nightly/install-kokkos/include/fwd/Kokkos_Fwd_NEXTSILICON.hpp
-- Installing: /var/jenkins/workspace/ArborX_nightly/install-kokkos/include/fwd/Kokkos_Fwd_SYCL.hpp
-- Installing: /var/jenkins/workspace/ArborX_nightly/install-kokkos/include/fwd/Kokkos_Fwd_THREADS.hpp
-- Installing: /var/jenkins/workspace/ArborX_nightly/install-kokkos/include/fwd/Kokkos_Fwd_CUDA.hpp
-- Installing: /var/jenkins/workspace/ArborX_nightly/install-kokkos/include/fwd/Kokkos_Fwd_OPENMP.hpp
-- Installing: /var/jenkins/workspace/ArborX_nightly/install-kokkos/include/fwd/Kokkos_Fwd_HIP.hpp
-- Installing: /var/jenkins/workspace/ArborX_nightly/install-kokkos/include/fwd/Kokkos_Fwd_SERIAL.hpp
-- Installing: /var/jenkins/workspace/ArborX_nightly/install-kokkos/include/fwd/Kokkos_Fwd_HPX.hpp
-- Installing: /var/jenkins/workspace/ArborX_nightly/install-kokkos/include/Kokkos_Core.hpp
-- Installing: /var/jenkins/workspace/ArborX_nightly/install-kokkos/include/Kokkos_TypeInfo.hpp
-- Installing: /var/jenkins/workspace/ArborX_nightly/install-kokkos/include/Kokkos_Iterator.hpp
-- Installing: /var/jenkins/workspace/ArborX_nightly/install-kokkos/include/OpenACC
-- Installing: /var/jenkins/workspace/ArborX_nightly/install-kokkos/include/OpenACC/Kokkos_OpenACCSpace.hpp
-- Installing: /var/jenkins/workspace/ArborX_nightly/install-kokkos/include/OpenACC/Kokkos_OpenACC_ParallelScan_Range.hpp
-- Installing: /var/jenkins/workspace/ArborX_nightly/install-kokkos/include/OpenACC/Kokkos_OpenACC_Instance.hpp
-- Installing: /var/jenkins/workspace/ArborX_nightly/install-kokkos/include/OpenACC/Kokkos_OpenACC_MDRangePolicy.hpp
-- Installing: /var/jenkins/workspace/ArborX_nightly/install-kokkos/include/OpenACC/Kokkos_OpenACC_ScheduleType.hpp
-- Installing: /var/jenkins/workspace/ArborX_nightly/install-kokkos/include/OpenACC/Kokkos_OpenACC_Macros.hpp
-- Installing: /var/jenkins/workspace/ArborX_nightly/install-kokkos/include/OpenACC/Kokkos_OpenACC_ParallelReduce_Range.hpp
-- Installing: /var/jenkins/workspace/ArborX_nightly/install-kokkos/include/OpenACC/Kokkos_OpenACC_ParallelReduce_Team.hpp
-- Installing: /var/jenkins/workspace/ArborX_nightly/install-kokkos/include/OpenACC/Kokkos_OpenACC_DeepCopy.hpp
-- Installing: /var/jenkins/workspace/ArborX_nightly/install-kokkos/include/OpenACC/Kokkos_OpenACC_ParallelFor_Team.hpp
-- Installing: /var/jenkins/workspace/ArborX_nightly/install-kokkos/include/OpenACC/Kokkos_OpenACC_ParallelReduce_MDRange.hpp
-- Installing: /var/jenkins/workspace/ArborX_nightly/install-kokkos/include/OpenACC/Kokkos_OpenACC_ParallelFor_Range.hpp
-- Installing: /var/jenkins/workspace/ArborX_nightly/install-kokkos/include/OpenACC/Kokkos_OpenACC_Traits.hpp
-- Installing: /var/jenkins/workspace/ArborX_nightly/install-kokkos/include/OpenACC/Kokkos_OpenACC_FunctorAdapter.hpp
-- Installing: /var/jenkins/workspace/ArborX_nightly/install-kokkos/include/OpenACC/Kokkos_OpenACC_Team.hpp
-- Installing: /var/jenkins/workspace/ArborX_nightly/install-kokkos/include/OpenACC/Kokkos_OpenACC_ParallelFor_MDRange.hpp
-- Installing: /var/jenkins/workspace/ArborX_nightly/install-kokkos/include/OpenACC/Kokkos_OpenACC.hpp
-- Installing: /var/jenkins/workspace/ArborX_nightly/install-kokkos/include/Serial
-- Installing: /var/jenkins/workspace/ArborX_nightly/install-kokkos/include/Serial/Kokkos_Serial_Parallel_MDRange.hpp
-- Installing: /var/jenkins/workspace/ArborX_nightly/install-kokkos/include/Serial/Kokkos_Serial.hpp
-- Installing: /var/jenkins/workspace/ArborX_nightly/install-kokkos/include/Serial/Kokkos_Serial_Parallel_Range.hpp
-- Installing: /var/jenkins/workspace/ArborX_nightly/install-kokkos/include/Serial/Kokkos_Serial_ZeroMemset.hpp
-- Installing: /var/jenkins/workspace/ArborX_nightly/install-kokkos/include/Serial/Kokkos_Serial_WorkGraphPolicy.hpp
-- Installing: /var/jenkins/workspace/ArborX_nightly/install-kokkos/include/Serial/Kokkos_Serial_Parallel_Team.hpp
-- Installing: /var/jenkins/workspace/ArborX_nightly/install-kokkos/include/Serial/Kokkos_Serial_UniqueToken.hpp
-- Installing: /var/jenkins/workspace/ArborX_nightly/install-kokkos/include/Serial/Kokkos_Serial_MDRangePolicy.hpp
-- Installing: /var/jenkins/workspace/ArborX_nightly/install-kokkos/include/Kokkos_Clamp.hpp
-- Installing: /var/jenkins/workspace/ArborX_nightly/install-kokkos/include/Threads
-- Installing: /var/jenkins/workspace/ArborX_nightly/install-kokkos/include/Threads/Kokkos_Threads_ParallelReduce_Range.hpp
-- Installing: /var/jenkins/workspace/ArborX_nightly/install-kokkos/include/Threads/Kokkos_Threads.hpp
-- Installing: /var/jenkins/workspace/ArborX_nightly/install-kokkos/include/Threads/Kokkos_Threads_Spinwait.hpp
-- Installing: /var/jenkins/workspace/ArborX_nightly/install-kokkos/include/Threads/Kokkos_Threads_MDRangePolicy.hpp
-- Installing: /var/jenkins/workspace/ArborX_nightly/install-kokkos/include/Threads/Kokkos_Threads_ParallelFor_MDRange.hpp
-- Installing: /var/jenkins/workspace/ArborX_nightly/install-kokkos/include/Threads/Kokkos_Threads_ParallelFor_Team.hpp
-- Installing: /var/jenkins/workspace/ArborX_nightly/install-kokkos/include/Threads/Kokkos_Threads_WorkGraphPolicy.hpp
-- Installing: /var/jenkins/workspace/ArborX_nightly/install-kokkos/include/Threads/Kokkos_Threads_ParallelFor_Range.hpp
-- Installing: /var/jenkins/workspace/ArborX_nightly/install-kokkos/include/Threads/Kokkos_Threads_State.hpp
-- Installing: /var/jenkins/workspace/ArborX_nightly/install-kokkos/include/Threads/Kokkos_Threads_ParallelReduce_MDRange.hpp
-- Installing: /var/jenkins/workspace/ArborX_nightly/install-kokkos/include/Threads/Kokkos_Threads_ParallelReduce_Team.hpp
-- Installing: /var/jenkins/workspace/ArborX_nightly/install-kokkos/include/Threads/Kokkos_Threads_ParallelScan_Range.hpp
-- Installing: /var/jenkins/workspace/ArborX_nightly/install-kokkos/include/Threads/Kokkos_Threads_ZeroMemset.hpp
-- Installing: /var/jenkins/workspace/ArborX_nightly/install-kokkos/include/Threads/Kokkos_Threads_UniqueToken.hpp
-- Installing: /var/jenkins/workspace/ArborX_nightly/install-kokkos/include/Threads/Kokkos_Threads_Team.hpp
-- Installing: /var/jenkins/workspace/ArborX_nightly/install-kokkos/include/Threads/Kokkos_Threads_Instance.hpp
-- Installing: /var/jenkins/workspace/ArborX_nightly/install-kokkos/include/Kokkos_MathematicalFunctions.hpp
-- Installing: /var/jenkins/workspace/ArborX_nightly/install-kokkos/include/traits
-- Installing: /var/jenkins/workspace/ArborX_nightly/install-kokkos/include/traits/Kokkos_IterationPatternTrait.hpp
-- Installing: /var/jenkins/workspace/ArborX_nightly/install-kokkos/include/traits/Kokkos_ScheduleTrait.hpp
-- Installing: /var/jenkins/workspace/ArborX_nightly/install-kokkos/include/traits/Kokkos_GraphKernelTrait.hpp
-- Installing: /var/jenkins/workspace/ArborX_nightly/install-kokkos/include/traits/Kokkos_WorkItemPropertyTrait.hpp
-- Installing: /var/jenkins/workspace/ArborX_nightly/install-kokkos/include/traits/Kokkos_TeamHandleTrait.hpp
-- Installing: /var/jenkins/workspace/ArborX_nightly/install-kokkos/include/traits/Kokkos_IndexTypeTrait.hpp
-- Installing: /var/jenkins/workspace/ArborX_nightly/install-kokkos/include/traits/Kokkos_StaticBatchSizeTrait.hpp
-- Installing: /var/jenkins/workspace/ArborX_nightly/install-kokkos/include/traits/Kokkos_ExecutionSpaceTrait.hpp
-- Installing: /var/jenkins/workspace/ArborX_nightly/install-kokkos/include/traits/Kokkos_LaunchBoundsTrait.hpp
-- Installing: /var/jenkins/workspace/ArborX_nightly/install-kokkos/include/traits/Kokkos_OccupancyControlTrait.hpp
-- Installing: /var/jenkins/workspace/ArborX_nightly/install-kokkos/include/traits/Kokkos_PolicyTraitMatcher.hpp
-- Installing: /var/jenkins/workspace/ArborX_nightly/install-kokkos/include/traits/Kokkos_WorkTagTrait.hpp
-- Installing: /var/jenkins/workspace/ArborX_nightly/install-kokkos/include/traits/Kokkos_Traits_fwd.hpp
-- Installing: /var/jenkins/workspace/ArborX_nightly/install-kokkos/include/traits/Kokkos_PolicyTraitAdaptor.hpp
-- Installing: /var/jenkins/workspace/ArborX_nightly/install-kokkos/include/Kokkos_Concepts.hpp
-- Installing: /var/jenkins/workspace/ArborX_nightly/install-kokkos/include/Kokkos_InitializeFinalize.hpp
-- Installing: /var/jenkins/workspace/ArborX_nightly/install-kokkos/include/Kokkos_Profiling_ScopedRegion.hpp
-- Installing: /var/jenkins/workspace/ArborX_nightly/install-kokkos/include/NextSilicon
-- Installing: /var/jenkins/workspace/ArborX_nightly/install-kokkos/include/NextSilicon/Kokkos_NextSilicon.hpp
-- Installing: /var/jenkins/workspace/ArborX_nightly/install-kokkos/include/NextSilicon/Kokkos_NextSilicon_Intrinsics.hpp
-- Installing: /var/jenkins/workspace/ArborX_nightly/install-kokkos/include/NextSilicon/Kokkos_NextSilicon_Instance.hpp
-- Installing: /var/jenkins/workspace/ArborX_nightly/install-kokkos/include/NextSilicon/Kokkos_NextSilicon_HeapBuffer.hpp
-- Installing: /var/jenkins/workspace/ArborX_nightly/install-kokkos/include/NextSilicon/Kokkos_NextSilicon_ZeroMemset.hpp
-- Installing: /var/jenkins/workspace/ArborX_nightly/install-kokkos/include/NextSilicon/Kokkos_NextSilicon_ThreadSpaceGuard.hpp
-- Installing: /var/jenkins/workspace/ArborX_nightly/install-kokkos/include/NextSilicon/Kokkos_NextSilicon_PageAlignedData.hpp
-- Installing: /var/jenkins/workspace/ArborX_nightly/install-kokkos/include/NextSilicon/Kokkos_NextSilicon_DeepCopy.hpp
-- Installing: /var/jenkins/workspace/ArborX_nightly/install-kokkos/include/NextSilicon/Kokkos_NextSilicon_ParallelReduce.hpp
-- Installing: /var/jenkins/workspace/ArborX_nightly/install-kokkos/include/NextSilicon/Kokkos_NextSilicon_ParallelFor_Range.hpp
-- Installing: /var/jenkins/workspace/ArborX_nightly/install-kokkos/include/NextSilicon/Kokkos_NextSilicon_Abort.hpp
-- Installing: /var/jenkins/workspace/ArborX_nightly/install-kokkos/include/NextSilicon/Kokkos_NextSiliconSpace.hpp
-- Installing: /var/jenkins/workspace/ArborX_nightly/install-kokkos/include/NextSilicon/Kokkos_NextSilicon_InitializationCallbacks.hpp
-- Installing: /var/jenkins/workspace/ArborX_nightly/install-kokkos/include/NextSilicon/Kokkos_NextSilicon_ParallelReduce_Range.hpp
-- Installing: /var/jenkins/workspace/ArborX_nightly/install-kokkos/include/NextSilicon/Kokkos_NextSilicon_Printf.hpp
-- Installing: /var/jenkins/workspace/ArborX_nightly/install-kokkos/include/Kokkos_ExecPolicy.hpp
-- Installing: /var/jenkins/workspace/ArborX_nightly/install-kokkos/include/Kokkos_Profiling_ProfileSection.hpp
-- Installing: /var/jenkins/workspace/ArborX_nightly/install-kokkos/include/decl
-- Installing: /var/jenkins/workspace/ArborX_nightly/install-kokkos/include/decl/Kokkos_Declare_NEXTSILICON.hpp
-- Installing: /var/jenkins/workspace/ArborX_nightly/install-kokkos/include/decl/Kokkos_Declare_HIP.hpp
-- Installing: /var/jenkins/workspace/ArborX_nightly/install-kokkos/include/decl/Kokkos_Declare_SERIAL.hpp
-- Installing: /var/jenkins/workspace/ArborX_nightly/install-kokkos/include/decl/Kokkos_Declare_CUDA.hpp
-- Installing: /var/jenkins/workspace/ArborX_nightly/install-kokkos/include/decl/Kokkos_Declare_OPENACC.hpp
-- Installing: /var/jenkins/workspace/ArborX_nightly/install-kokkos/include/decl/Kokkos_Declare_THREADS.hpp
-- Installing: /var/jenkins/workspace/ArborX_nightly/install-kokkos/include/decl/Kokkos_Declare_OPENMP.hpp
-- Installing: /var/jenkins/workspace/ArborX_nightly/install-kokkos/include/decl/Kokkos_Declare_SYCL.hpp
-- Installing: /var/jenkins/workspace/ArborX_nightly/install-kokkos/include/decl/Kokkos_Declare_HPX.hpp
-- Installing: /var/jenkins/workspace/ArborX_nightly/install-kokkos/include/Kokkos_Assert.hpp
-- Installing: /var/jenkins/workspace/ArborX_nightly/install-kokkos/include/Kokkos_Vectorization.hpp
-- Installing: /var/jenkins/workspace/ArborX_nightly/install-kokkos/include/Kokkos_ScratchSpace.hpp
-- Installing: /var/jenkins/workspace/ArborX_nightly/install-kokkos/include/Kokkos_Parallel_Reduce.hpp
-- Installing: /var/jenkins/workspace/ArborX_nightly/install-kokkos/include/Kokkos_Half.hpp
-- Installing: /var/jenkins/workspace/ArborX_nightly/install-kokkos/include/Kokkos_Rank.hpp
-- Installing: /var/jenkins/workspace/ArborX_nightly/install-kokkos/include/Kokkos_DetectionIdiom.hpp
-- Installing: /var/jenkins/workspace/ArborX_nightly/install-kokkos/include/Kokkos_Core_fwd.hpp
-- Installing: /var/jenkins/workspace/ArborX_nightly/install-kokkos/include/Kokkos_NumericTraits.hpp
-- Installing: /var/jenkins/workspace/ArborX_nightly/install-kokkos/include/HPX
-- Installing: /var/jenkins/workspace/ArborX_nightly/install-kokkos/include/HPX/Kokkos_HPX.hpp
-- Installing: /var/jenkins/workspace/ArborX_nightly/install-kokkos/include/HPX/Kokkos_HPX_WorkGraphPolicy.hpp
-- Installing: /var/jenkins/workspace/ArborX_nightly/install-kokkos/include/HPX/Kokkos_HPX_MDRangePolicy.hpp
-- Installing: /var/jenkins/workspace/ArborX_nightly/install-kokkos/include/Kokkos_Printf.hpp
-- Installing: /var/jenkins/workspace/ArborX_nightly/install-kokkos/include/Kokkos_Parallel_Scan.hpp
-- Installing: /var/jenkins/workspace/ArborX_nightly/install-kokkos/include/Kokkos_AnonymousSpace.hpp
-- Installing: /var/jenkins/workspace/ArborX_nightly/install-kokkos/include/OpenMP
-- Installing: /var/jenkins/workspace/ArborX_nightly/install-kokkos/include/OpenMP/Kokkos_OpenMP.hpp
-- Installing: /var/jenkins/workspace/ArborX_nightly/install-kokkos/include/OpenMP/Kokkos_OpenMP_ZeroMemset.hpp
-- Installing: /var/jenkins/workspace/ArborX_nightly/install-kokkos/include/OpenMP/Kokkos_OpenMP_Team.hpp
-- Installing: /var/jenkins/workspace/ArborX_nightly/install-kokkos/include/OpenMP/Kokkos_OpenMP_UniqueToken.hpp
-- Installing: /var/jenkins/workspace/ArborX_nightly/install-kokkos/include/OpenMP/Kokkos_OpenMP_Parallel_Scan.hpp
-- Installing: /var/jenkins/workspace/ArborX_nightly/install-kokkos/include/OpenMP/Kokkos_OpenMP_WorkGraphPolicy.hpp
-- Installing: /var/jenkins/workspace/ArborX_nightly/install-kokkos/include/OpenMP/Kokkos_OpenMP_Parallel_For.hpp
-- Installing: /var/jenkins/workspace/ArborX_nightly/install-kokkos/include/OpenMP/Kokkos_OpenMP_MDRangePolicy.hpp
-- Installing: /var/jenkins/workspace/ArborX_nightly/install-kokkos/include/OpenMP/Kokkos_OpenMP_Parallel_Reduce.hpp
-- Installing: /var/jenkins/workspace/ArborX_nightly/install-kokkos/include/OpenMP/Kokkos_OpenMP_Instance.hpp
-- Installing: /var/jenkins/workspace/ArborX_nightly/install-kokkos/include/impl
-- Installing: /var/jenkins/workspace/ArborX_nightly/install-kokkos/include/impl/Kokkos_DeviceHandle.hpp
-- Installing: /var/jenkins/workspace/ArborX_nightly/install-kokkos/include/impl/Kokkos_InitializationSettings.hpp
-- Installing: /var/jenkins/workspace/ArborX_nightly/install-kokkos/include/impl/Kokkos_RandomAccessIterator.hpp
-- Installing: /var/jenkins/workspace/ArborX_nightly/install-kokkos/include/impl/Kokkos_CPUDiscovery.hpp
-- Installing: /var/jenkins/workspace/ArborX_nightly/install-kokkos/include/impl/Kokkos_DesulAtomicsConfig.hpp
-- Installing: /var/jenkins/workspace/ArborX_nightly/install-kokkos/include/impl/Kokkos_Stacktrace.hpp
-- Installing: /var/jenkins/workspace/ArborX_nightly/install-kokkos/include/impl/Kokkos_GraphNodeCustomization.hpp
-- Installing: /var/jenkins/workspace/ArborX_nightly/install-kokkos/include/impl/Kokkos_EBO.hpp
-- Installing: /var/jenkins/workspace/ArborX_nightly/install-kokkos/include/impl/Kokkos_Error.hpp
-- Installing: /var/jenkins/workspace/ArborX_nightly/install-kokkos/include/impl/Kokkos_Half_ReductionIdentity.hpp
-- Installing: /var/jenkins/workspace/ArborX_nightly/install-kokkos/include/impl/Kokkos_Combined_Reducer.hpp
-- Installing: /var/jenkins/workspace/ArborX_nightly/install-kokkos/include/impl/Kokkos_CStyleMemoryManagement.hpp
-- Installing: /var/jenkins/workspace/ArborX_nightly/install-kokkos/include/impl/Kokkos_GraphNodeThenPolicy.hpp
-- Installing: /var/jenkins/workspace/ArborX_nightly/install-kokkos/include/impl/Kokkos_Utilities.hpp
-- Installing: /var/jenkins/workspace/ArborX_nightly/install-kokkos/include/impl/Kokkos_BuiltinReducers.hpp
-- Installing: /var/jenkins/workspace/ArborX_nightly/install-kokkos/include/impl/Kokkos_AnalyzePolicy.hpp
-- Installing: /var/jenkins/workspace/ArborX_nightly/install-kokkos/include/impl/Kokkos_CheckUsage.hpp
-- Installing: /var/jenkins/workspace/ArborX_nightly/install-kokkos/include/impl/Kokkos_HostBarrier.hpp
-- Installing: /var/jenkins/workspace/ArborX_nightly/install-kokkos/include/impl/Kokkos_Volatile_Load.hpp
-- Installing: /var/jenkins/workspace/ArborX_nightly/install-kokkos/include/impl/Kokkos_Tools.hpp
-- Installing: /var/jenkins/workspace/ArborX_nightly/install-kokkos/include/impl/Kokkos_CheckedIntegerOps.hpp
-- Installing: /var/jenkins/workspace/ArborX_nightly/install-kokkos/include/impl/Kokkos_Profiling_Interface.hpp
-- Installing: /var/jenkins/workspace/ArborX_nightly/install-kokkos/include/impl/Kokkos_GraphNodeThenImpl.hpp
-- Installing: /var/jenkins/workspace/ArborX_nightly/install-kokkos/include/impl/Kokkos_Profiling_DeviceInfo.hpp
-- Installing: /var/jenkins/workspace/ArborX_nightly/install-kokkos/include/impl/Kokkos_HostThreadTeam.hpp
-- Installing: /var/jenkins/workspace/ArborX_nightly/install-kokkos/include/impl/Kokkos_GraphNodeImpl.hpp
-- Installing: /var/jenkins/workspace/ArborX_nightly/install-kokkos/include/impl/Kokkos_Half_CommonType.hpp
-- Installing: /var/jenkins/workspace/ArborX_nightly/install-kokkos/include/impl/Kokkos_Default_Graph_Impl.hpp
-- Installing: /var/jenkins/workspace/ArborX_nightly/install-kokkos/include/impl/Kokkos_Default_Graph_fwd.hpp
-- Installing: /var/jenkins/workspace/ArborX_nightly/install-kokkos/include/impl/KokkosExp_Host_IterateTile.hpp
-- Installing: /var/jenkins/workspace/ArborX_nightly/install-kokkos/include/impl/Kokkos_GraphImpl.hpp
-- Installing: /var/jenkins/workspace/ArborX_nightly/install-kokkos/include/impl/Kokkos_FunctorAnalysis.hpp
-- Installing: /var/jenkins/workspace/ArborX_nightly/install-kokkos/include/impl/Kokkos_ConcurrentBitset.hpp
-- Installing: /var/jenkins/workspace/ArborX_nightly/install-kokkos/include/impl/Kokkos_Default_GraphNode_Impl.hpp
-- Installing: /var/jenkins/workspace/ArborX_nightly/install-kokkos/include/impl/Kokkos_Half_NumericTraits.hpp
-- Installing: /var/jenkins/workspace/ArborX_nightly/install-kokkos/include/impl/Kokkos_Traits.hpp
-- Installing: /var/jenkins/workspace/ArborX_nightly/install-kokkos/include/impl/Kokkos_GraphImpl_fwd.hpp
-- Installing: /var/jenkins/workspace/ArborX_nightly/install-kokkos/include/impl/Kokkos_Profiling_C_Interface.h
-- Installing: /var/jenkins/workspace/ArborX_nightly/install-kokkos/include/impl/KokkosExp_IterateTileGPU.hpp
-- Installing: /var/jenkins/workspace/ArborX_nightly/install-kokkos/include/impl/Kokkos_NvidiaGpuArchitectures.hpp
-- Installing: /var/jenkins/workspace/ArborX_nightly/install-kokkos/include/impl/Kokkos_ExecSpaceManager.hpp
-- Installing: /var/jenkins/workspace/ArborX_nightly/install-kokkos/include/impl/Kokkos_Tools_Generic.hpp
-- Installing: /var/jenkins/workspace/ArborX_nightly/install-kokkos/include/impl/Kokkos_HostSpace_deepcopy.hpp
-- Installing: /var/jenkins/workspace/ArborX_nightly/install-kokkos/include/impl/Kokkos_TeamMDPolicy.hpp
-- Installing: /var/jenkins/workspace/ArborX_nightly/install-kokkos/include/impl/Kokkos_StringManipulation.hpp
-- Installing: /var/jenkins/workspace/ArborX_nightly/install-kokkos/include/impl/Kokkos_GraphImpl_Utilities.hpp
-- Installing: /var/jenkins/workspace/ArborX_nightly/install-kokkos/include/impl/Kokkos_Default_GraphNodeKernel.hpp
-- Installing: /var/jenkins/workspace/ArborX_nightly/install-kokkos/include/impl/Kokkos_ClockTic.hpp
-- Installing: /var/jenkins/workspace/ArborX_nightly/install-kokkos/include/impl/Kokkos_RuntimeInfo.hpp
-- Installing: /var/jenkins/workspace/ArborX_nightly/install-kokkos/include/impl/Kokkos_Half_MathematicalFunctions.hpp
-- Installing: /var/jenkins/workspace/ArborX_nightly/install-kokkos/include/impl/Kokkos_Command_Line_Parsing.hpp
-- Installing: /var/jenkins/workspace/ArborX_nightly/install-kokkos/include/impl/Kokkos_Half_FloatingPointWrapper.hpp
-- Installing: /var/jenkins/workspace/ArborX_nightly/install-kokkos/include/impl/Kokkos_GraphNodeCtorProps.hpp
-- Installing: /var/jenkins/workspace/ArborX_nightly/install-kokkos/include/impl/Kokkos_ZeroMemset_fwd.hpp
-- Installing: /var/jenkins/workspace/ArborX_nightly/install-kokkos/include/impl/Kokkos_PartitionSpace.hpp
-- Installing: /var/jenkins/workspace/ArborX_nightly/install-kokkos/include/impl/Kokkos_Fence.hpp
-- Installing: /var/jenkins/workspace/ArborX_nightly/install-kokkos/include/impl/Kokkos_ParseCommandLineArgumentsAndEnvironmentVariables.hpp
-- Installing: /var/jenkins/workspace/ArborX_nightly/install-kokkos/include/impl/Kokkos_HostSharedPtr.hpp
-- Installing: /var/jenkins/workspace/ArborX_nightly/install-kokkos/include/impl/Kokkos_SharedAlloc_timpl.hpp
-- Installing: /var/jenkins/workspace/ArborX_nightly/install-kokkos/include/impl/Kokkos_SharedAlloc.hpp
-- Installing: /var/jenkins/workspace/ArborX_nightly/install-kokkos/include/impl/Kokkos_Profiling.hpp
-- Installing: /var/jenkins/workspace/ArborX_nightly/install-kokkos/include/impl/Kokkos_DeviceManagement.hpp
-- Installing: /var/jenkins/workspace/ArborX_nightly/install-kokkos/include/impl/Kokkos_QuadPrecisionMath.hpp
-- Installing: /var/jenkins/workspace/ArborX_nightly/install-kokkos/include/Kokkos_Parallel.hpp
-- Installing: /var/jenkins/workspace/ArborX_nightly/install-kokkos/include/Kokkos_HostSpace.hpp
-- Installing: /var/jenkins/workspace/ArborX_nightly/install-kokkos/include/KokkosExp_MDRangePolicy.hpp
-- Installing: /var/jenkins/workspace/ArborX_nightly/install-kokkos/include/Kokkos_View.hpp
-- Installing: /var/jenkins/workspace/ArborX_nightly/install-kokkos/include/Kokkos_Swap.hpp
-- Installing: /var/jenkins/workspace/ArborX_nightly/install-kokkos/include/Kokkos_WorkGraphPolicy.hpp
-- Installing: /var/jenkins/workspace/ArborX_nightly/install-kokkos/include/Kokkos_Tuners.hpp
-- Installing: /var/jenkins/workspace/ArborX_nightly/install-kokkos/include/desul
-- Installing: /var/jenkins/workspace/ArborX_nightly/install-kokkos/include/desul/atomics.hpp
-- Installing: /var/jenkins/workspace/ArborX_nightly/install-kokkos/include/desul/atomics
-- Installing: /var/jenkins/workspace/ArborX_nightly/install-kokkos/include/desul/atomics/Thread_Fence.hpp
-- Installing: /var/jenkins/workspace/ArborX_nightly/install-kokkos/include/desul/atomics/Fetch_Op_SYCL.hpp
-- Installing: /var/jenkins/workspace/ArborX_nightly/install-kokkos/include/desul/atomics/Lock_Free_Fetch_Op.hpp
-- Installing: /var/jenkins/workspace/ArborX_nightly/install-kokkos/include/desul/atomics/Lock_Free_Types_OpenMP.hpp
-- Installing: /var/jenkins/workspace/ArborX_nightly/install-kokkos/include/desul/atomics/Lock_Based_Fetch_Op.hpp
-- Installing: /var/jenkins/workspace/ArborX_nightly/install-kokkos/include/desul/atomics/Compare_Exchange_SYCL.hpp
-- Installing: /var/jenkins/workspace/ArborX_nightly/install-kokkos/include/desul/atomics/Compare_Exchange_GCC.hpp
-- Installing: /var/jenkins/workspace/ArborX_nightly/install-kokkos/include/desul/atomics/Lock_Based_Fetch_Op_Host.hpp
-- Installing: /var/jenkins/workspace/ArborX_nightly/install-kokkos/include/desul/atomics/Lock_Based_Fetch_Op_SYCL.hpp
-- Installing: /var/jenkins/workspace/ArborX_nightly/install-kokkos/include/desul/atomics/Lock_Free_Types_OpenACC.hpp
-- Installing: /var/jenkins/workspace/ArborX_nightly/install-kokkos/include/desul/atomics/Adapt_CXX.hpp
-- Installing: /var/jenkins/workspace/ArborX_nightly/install-kokkos/include/desul/atomics/Fetch_Op.hpp
-- Installing: /var/jenkins/workspace/ArborX_nightly/install-kokkos/include/desul/atomics/Thread_Fence_ScopeCaller.hpp
-- Installing: /var/jenkins/workspace/ArborX_nightly/install-kokkos/include/desul/atomics/Fetch_Op_OpenACC.hpp
-- Installing: /var/jenkins/workspace/ArborX_nightly/install-kokkos/include/desul/atomics/cuda
-- Installing: /var/jenkins/workspace/ArborX_nightly/install-kokkos/include/desul/atomics/cuda/cuda_cc7_asm_atomic_op.inc_isglobal
-- Installing: /var/jenkins/workspace/ArborX_nightly/install-kokkos/include/desul/atomics/cuda/cuda_cc7_asm_atomic_fetch_op.inc
-- Installing: /var/jenkins/workspace/ArborX_nightly/install-kokkos/include/desul/atomics/cuda/cuda_cc9_asm_exchange_op.inc
-- Installing: /var/jenkins/workspace/ArborX_nightly/install-kokkos/include/desul/atomics/cuda/cuda_cc7_asm_loadstore_memorder.inc
-- Installing: /var/jenkins/workspace/ArborX_nightly/install-kokkos/include/desul/atomics/cuda/cuda_cc9_asm_exchange_memorder.inc
-- Installing: /var/jenkins/workspace/ArborX_nightly/install-kokkos/include/desul/atomics/cuda/CUDA_asm_loadstore.hpp
-- Installing: /var/jenkins/workspace/ArborX_nightly/install-kokkos/include/desul/atomics/cuda/cuda_cc7_asm_atomic_op.inc
-- Installing: /var/jenkins/workspace/ArborX_nightly/install-kokkos/include/desul/atomics/cuda/cuda_cc7_asm_memorder.inc
-- Installing: /var/jenkins/workspace/ArborX_nightly/install-kokkos/include/desul/atomics/cuda/cuda_cc7_asm_exchange_memorder.inc
-- Installing: /var/jenkins/workspace/ArborX_nightly/install-kokkos/include/desul/atomics/cuda/cuda_cc7_asm_atomic_op.inc_predicate
-- Installing: /var/jenkins/workspace/ArborX_nightly/install-kokkos/include/desul/atomics/cuda/cuda_cc7_asm_exchange_op.inc
-- Installing: /var/jenkins/workspace/ArborX_nightly/install-kokkos/include/desul/atomics/cuda/CUDA_asm.hpp
-- Installing: /var/jenkins/workspace/ArborX_nightly/install-kokkos/include/desul/atomics/cuda/cuda_cc7_asm_loadstore.inc
-- Installing: /var/jenkins/workspace/ArborX_nightly/install-kokkos/include/desul/atomics/cuda/CUDA_asm_exchange.hpp
-- Installing: /var/jenkins/workspace/ArborX_nightly/install-kokkos/include/desul/atomics/cuda/cuda_cc7_asm_store_op.inc
-- Installing: /var/jenkins/workspace/ArborX_nightly/install-kokkos/include/desul/atomics/cuda/cuda_cc7_asm_atomic_fetch_op.inc_isglobal
-- Installing: /var/jenkins/workspace/ArborX_nightly/install-kokkos/include/desul/atomics/cuda/cuda_cc7_asm.inc
-- Installing: /var/jenkins/workspace/ArborX_nightly/install-kokkos/include/desul/atomics/cuda/cuda_cc7_asm_atomic_fetch_op.inc_predicate
-- Installing: /var/jenkins/workspace/ArborX_nightly/install-kokkos/include/desul/atomics/cuda/cuda_cc7_asm_load_op.inc
-- Installing: /var/jenkins/workspace/ArborX_nightly/install-kokkos/include/desul/atomics/cuda/cuda_cc9_asm_exchange.inc
-- Installing: /var/jenkins/workspace/ArborX_nightly/install-kokkos/include/desul/atomics/cuda/cuda_cc7_asm_exchange.inc
-- Installing: /var/jenkins/workspace/ArborX_nightly/install-kokkos/include/desul/atomics/Generic.hpp
-- Installing: /var/jenkins/workspace/ArborX_nightly/install-kokkos/include/desul/atomics/Thread_Fence_OpenMP.hpp
-- Installing: /var/jenkins/workspace/ArborX_nightly/install-kokkos/include/desul/atomics/Lock_Free_Types_HIP.hpp
-- Installing: /var/jenkins/workspace/ArborX_nightly/install-kokkos/include/desul/atomics/Compare_Exchange_ScopeCaller.hpp
-- Installing: /var/jenkins/workspace/ArborX_nightly/install-kokkos/include/desul/atomics/Load_And_Store_HIP.hpp
-- Installing: /var/jenkins/workspace/ArborX_nightly/install-kokkos/include/desul/atomics/Lock_Free_Types_MSVC.hpp
-- Installing: /var/jenkins/workspace/ArborX_nightly/install-kokkos/include/desul/atomics/Lock_Free_Types_SYCL.hpp
-- Installing: /var/jenkins/workspace/ArborX_nightly/install-kokkos/include/desul/atomics/Compare_Exchange_OpenMP.hpp
-- Installing: /var/jenkins/workspace/ArborX_nightly/install-kokkos/include/desul/atomics/Atomic_Ref.hpp
-- Installing: /var/jenkins/workspace/ArborX_nightly/install-kokkos/include/desul/atomics/Compare_Exchange_HIP.hpp
-- Installing: /var/jenkins/workspace/ArborX_nightly/install-kokkos/include/desul/atomics/Fetch_Op_HIP.hpp
-- Installing: /var/jenkins/workspace/ArborX_nightly/install-kokkos/include/desul/atomics/Common.hpp
-- Installing: /var/jenkins/workspace/ArborX_nightly/install-kokkos/include/desul/atomics/Compare_Exchange_MSVC.hpp
-- Installing: /var/jenkins/workspace/ArborX_nightly/install-kokkos/include/desul/atomics/Compare_Exchange_CUDA.hpp
-- Installing: /var/jenkins/workspace/ArborX_nightly/install-kokkos/include/desul/atomics/Adapt_GCC.hpp
-- Installing: /var/jenkins/workspace/ArborX_nightly/install-kokkos/include/desul/atomics/Fetch_Op_CUDA.hpp
-- Installing: /var/jenkins/workspace/ArborX_nightly/install-kokkos/include/desul/atomics/Lock_Array_HIP.hpp
-- Installing: /var/jenkins/workspace/ArborX_nightly/install-kokkos/include/desul/atomics/Thread_Fence_MSVC.hpp
-- Installing: /var/jenkins/workspace/ArborX_nightly/install-kokkos/include/desul/atomics/Adapt_HIP.hpp
-- Installing: /var/jenkins/workspace/ArborX_nightly/install-kokkos/include/desul/atomics/Load_And_Store_MSVC.hpp
-- Installing: /var/jenkins/workspace/ArborX_nightly/install-kokkos/include/desul/atomics/Lock_Free_Types_GCC.hpp
-- Installing: /var/jenkins/workspace/ArborX_nightly/install-kokkos/include/desul/atomics/Adapt_SYCL.hpp
-- Installing: /var/jenkins/workspace/ArborX_nightly/install-kokkos/include/desul/atomics/Compare_Exchange_OpenACC.hpp
-- Installing: /var/jenkins/workspace/ArborX_nightly/install-kokkos/include/desul/atomics/Lock_Based_Fetch_Op_OpenACC.hpp
-- Installing: /var/jenkins/workspace/ArborX_nightly/install-kokkos/include/desul/atomics/Load_And_Store_SYCL.hpp
-- Installing: /var/jenkins/workspace/ArborX_nightly/install-kokkos/include/desul/atomics/Lock_Based_Fetch_Op_HIP.hpp
-- Installing: /var/jenkins/workspace/ArborX_nightly/install-kokkos/include/desul/atomics/Operator_Function_Objects.hpp
-- Installing: /var/jenkins/workspace/ArborX_nightly/install-kokkos/include/desul/atomics/openmp
-- Installing: /var/jenkins/workspace/ArborX_nightly/install-kokkos/include/desul/atomics/openmp/OpenMP_40.hpp
-- Installing: /var/jenkins/workspace/ArborX_nightly/install-kokkos/include/desul/atomics/openmp/OpenMP_40_op.inc
-- Installing: /var/jenkins/workspace/ArborX_nightly/install-kokkos/include/desul/atomics/Load_And_Store_CUDA.hpp
-- Installing: /var/jenkins/workspace/ArborX_nightly/install-kokkos/include/desul/atomics/Load_And_Store.hpp
-- Installing: /var/jenkins/workspace/ArborX_nightly/install-kokkos/include/desul/atomics/Compare_Exchange.hpp
-- Installing: /var/jenkins/workspace/ArborX_nightly/install-kokkos/include/desul/atomics/Load_And_Store_OpenMP.hpp
-- Installing: /var/jenkins/workspace/ArborX_nightly/install-kokkos/include/desul/atomics/Thread_Fence_SYCL.hpp
-- Installing: /var/jenkins/workspace/ArborX_nightly/install-kokkos/include/desul/atomics/Fetch_Op_ScopeCaller.hpp
-- Installing: /var/jenkins/workspace/ArborX_nightly/install-kokkos/include/desul/atomics/Lock_Array.hpp
-- Installing: /var/jenkins/workspace/ArborX_nightly/install-kokkos/include/desul/atomics/Fetch_Op_GCC.hpp
-- Installing: /var/jenkins/workspace/ArborX_nightly/install-kokkos/include/desul/atomics/Thread_Fence_GCC.hpp
-- Installing: /var/jenkins/workspace/ArborX_nightly/install-kokkos/include/desul/atomics/Load_And_Store_OpenACC.hpp
-- Installing: /var/jenkins/workspace/ArborX_nightly/install-kokkos/include/desul/atomics/Thread_Fence_HIP.hpp
-- Installing: /var/jenkins/workspace/ArborX_nightly/install-kokkos/include/desul/atomics/Fetch_Op_Generic.hpp
-- Installing: /var/jenkins/workspace/ArborX_nightly/install-kokkos/include/desul/atomics/Load_And_Store_ScopeCaller.hpp
-- Installing: /var/jenkins/workspace/ArborX_nightly/install-kokkos/include/desul/atomics/Thread_Fence_OpenACC.hpp
-- Installing: /var/jenkins/workspace/ArborX_nightly/install-kokkos/include/desul/atomics/Load_And_Store_GCC.hpp
-- Installing: /var/jenkins/workspace/ArborX_nightly/install-kokkos/include/desul/atomics/Fetch_Op_OpenMP.hpp
-- Installing: /var/jenkins/workspace/ArborX_nightly/install-kokkos/include/desul/atomics/Lock_Array_CUDA.hpp
-- Installing: /var/jenkins/workspace/ArborX_nightly/install-kokkos/include/desul/atomics/Lock_Based_Fetch_Op_CUDA.hpp
-- Installing: /var/jenkins/workspace/ArborX_nightly/install-kokkos/include/desul/atomics/Thread_Fence_CUDA.hpp
-- Installing: /var/jenkins/workspace/ArborX_nightly/install-kokkos/include/desul/atomics/Lock_Free_Types_CUDA.hpp
-- Installing: /var/jenkins/workspace/ArborX_nightly/install-kokkos/include/desul/atomics/Lock_Array_SYCL.hpp
-- Installing: /var/jenkins/workspace/ArborX_nightly/install-kokkos/include/desul/atomics/Macros.hpp
-- Up-to-date: /var/jenkins/workspace/ArborX_nightly/install-kokkos/include/desul
-- Up-to-date: /var/jenkins/workspace/ArborX_nightly/install-kokkos/include/desul/atomics
-- Installing: /var/jenkins/workspace/ArborX_nightly/install-kokkos/include/desul/atomics/Config.hpp
-- Installing: /var/jenkins/workspace/ArborX_nightly/install-kokkos/lib/libkokkoscore.a
-- Up-to-date: /var/jenkins/workspace/ArborX_nightly/install-kokkos/include
-- Installing: /var/jenkins/workspace/ArborX_nightly/install-kokkos/include/mdspan
-- Installing: /var/jenkins/workspace/ArborX_nightly/install-kokkos/include/mdspan/mdarray.hpp
-- Installing: /var/jenkins/workspace/ArborX_nightly/install-kokkos/include/mdspan/mdspan.hpp
-- Installing: /var/jenkins/workspace/ArborX_nightly/install-kokkos/include/experimental
-- Installing: /var/jenkins/workspace/ArborX_nightly/install-kokkos/include/experimental/__p2389_bits
-- Installing: /var/jenkins/workspace/ArborX_nightly/install-kokkos/include/experimental/__p2389_bits/dims.hpp
-- Installing: /var/jenkins/workspace/ArborX_nightly/install-kokkos/include/experimental/__p1684_bits
-- Installing: /var/jenkins/workspace/ArborX_nightly/install-kokkos/include/experimental/__p1684_bits/mdarray.hpp
-- Installing: /var/jenkins/workspace/ArborX_nightly/install-kokkos/include/experimental/__p0009_bits
-- Installing: /var/jenkins/workspace/ArborX_nightly/install-kokkos/include/experimental/__p0009_bits/trait_backports.hpp
-- Installing: /var/jenkins/workspace/ArborX_nightly/install-kokkos/include/experimental/__p0009_bits/config.hpp
-- Installing: /var/jenkins/workspace/ArborX_nightly/install-kokkos/include/experimental/__p0009_bits/default_accessor.hpp
-- Installing: /var/jenkins/workspace/ArborX_nightly/install-kokkos/include/experimental/__p0009_bits/full_extent_t.hpp
-- Installing: /var/jenkins/workspace/ArborX_nightly/install-kokkos/include/experimental/__p0009_bits/no_unique_address.hpp
-- Installing: /var/jenkins/workspace/ArborX_nightly/install-kokkos/include/experimental/__p0009_bits/layout_left.hpp
-- Installing: /var/jenkins/workspace/ArborX_nightly/install-kokkos/include/experimental/__p0009_bits/layout_right.hpp
-- Installing: /var/jenkins/workspace/ArborX_nightly/install-kokkos/include/experimental/__p0009_bits/extents.hpp
-- Installing: /var/jenkins/workspace/ArborX_nightly/install-kokkos/include/experimental/__p0009_bits/compressed_pair.hpp
-- Installing: /var/jenkins/workspace/ArborX_nightly/install-kokkos/include/experimental/__p0009_bits/dynamic_extent.hpp
-- Installing: /var/jenkins/workspace/ArborX_nightly/install-kokkos/include/experimental/__p0009_bits/utility.hpp
-- Installing: /var/jenkins/workspace/ArborX_nightly/install-kokkos/include/experimental/__p0009_bits/layout_stride.hpp
-- Installing: /var/jenkins/workspace/ArborX_nightly/install-kokkos/include/experimental/__p0009_bits/macros.hpp
-- Installing: /var/jenkins/workspace/ArborX_nightly/install-kokkos/include/experimental/__p0009_bits/type_list.hpp
-- Installing: /var/jenkins/workspace/ArborX_nightly/install-kokkos/include/experimental/__p0009_bits/mdspan.hpp
-- Installing: /var/jenkins/workspace/ArborX_nightly/install-kokkos/include/experimental/__p2642_bits
-- Installing: /var/jenkins/workspace/ArborX_nightly/install-kokkos/include/experimental/__p2642_bits/layout_padded_fwd.hpp
-- Installing: /var/jenkins/workspace/ArborX_nightly/install-kokkos/include/experimental/__p2642_bits/layout_padded.hpp
-- Installing: /var/jenkins/workspace/ArborX_nightly/install-kokkos/include/experimental/__p2630_bits
-- Installing: /var/jenkins/workspace/ArborX_nightly/install-kokkos/include/experimental/__p2630_bits/submdspan.hpp
-- Installing: /var/jenkins/workspace/ArborX_nightly/install-kokkos/include/experimental/__p2630_bits/submdspan_extents.hpp
-- Installing: /var/jenkins/workspace/ArborX_nightly/install-kokkos/include/experimental/__p2630_bits/submdspan_mapping.hpp
-- Installing: /var/jenkins/workspace/ArborX_nightly/install-kokkos/include/experimental/__p2630_bits/strided_slice.hpp
-- Installing: /var/jenkins/workspace/ArborX_nightly/install-kokkos/include/experimental/__p2630_bits/constant_wrapper.hpp
-- Installing: /var/jenkins/workspace/ArborX_nightly/install-kokkos/include/experimental/__p2630_bits/integral_constant_like.hpp
-- Installing: /var/jenkins/workspace/ArborX_nightly/install-kokkos/include/experimental/__p2630_bits/submdspan_canonicalize_slices.hpp
-- Up-to-date: /var/jenkins/workspace/ArborX_nightly/install-kokkos/include
-- Installing: /var/jenkins/workspace/ArborX_nightly/install-kokkos/include/Kokkos_Functional.hpp
-- Installing: /var/jenkins/workspace/ArborX_nightly/install-kokkos/include/Kokkos_DynRankView.hpp
-- Installing: /var/jenkins/workspace/ArborX_nightly/install-kokkos/include/Kokkos_DynamicView.hpp
-- Installing: /var/jenkins/workspace/ArborX_nightly/install-kokkos/include/Kokkos_ErrorReporter.hpp
-- Installing: /var/jenkins/workspace/ArborX_nightly/install-kokkos/include/Kokkos_Bitset.hpp
-- Installing: /var/jenkins/workspace/ArborX_nightly/install-kokkos/include/Kokkos_ScatterView.hpp
-- Installing: /var/jenkins/workspace/ArborX_nightly/install-kokkos/include/Kokkos_UnorderedMap.hpp
-- Installing: /var/jenkins/workspace/ArborX_nightly/install-kokkos/include/Kokkos_OffsetView.hpp
-- Up-to-date: /var/jenkins/workspace/ArborX_nightly/install-kokkos/include/impl
-- Installing: /var/jenkins/workspace/ArborX_nightly/install-kokkos/include/impl/Kokkos_Functional_impl.hpp
-- Installing: /var/jenkins/workspace/ArborX_nightly/install-kokkos/include/impl/Kokkos_Bitset_impl.hpp
-- Installing: /var/jenkins/workspace/ArborX_nightly/install-kokkos/include/impl/Kokkos_UnorderedMap_impl.hpp
-- Installing: /var/jenkins/workspace/ArborX_nightly/install-kokkos/include/Kokkos_DualView.hpp
-- Installing: /var/jenkins/workspace/ArborX_nightly/install-kokkos/lib/libkokkoscontainers.a
-- Up-to-date: /var/jenkins/workspace/ArborX_nightly/install-kokkos/include
-- Installing: /var/jenkins/workspace/ArborX_nightly/install-kokkos/include/Kokkos_StdAlgorithms.hpp
-- Installing: /var/jenkins/workspace/ArborX_nightly/install-kokkos/include/sorting
-- Installing: /var/jenkins/workspace/ArborX_nightly/install-kokkos/include/sorting/Kokkos_BinOpsPublicAPI.hpp
-- Installing: /var/jenkins/workspace/ArborX_nightly/install-kokkos/include/sorting/Kokkos_BinSortPublicAPI.hpp
-- Installing: /var/jenkins/workspace/ArborX_nightly/install-kokkos/include/sorting/Kokkos_SortPublicAPI.hpp
-- Installing: /var/jenkins/workspace/ArborX_nightly/install-kokkos/include/sorting/Kokkos_SortByKeyPublicAPI.hpp
-- Installing: /var/jenkins/workspace/ArborX_nightly/install-kokkos/include/sorting/Kokkos_NestedSortPublicAPI.hpp
-- Installing: /var/jenkins/workspace/ArborX_nightly/install-kokkos/include/sorting/impl
-- Installing: /var/jenkins/workspace/ArborX_nightly/install-kokkos/include/sorting/impl/Kokkos_SortByKeyImpl.hpp
-- Installing: /var/jenkins/workspace/ArborX_nightly/install-kokkos/include/sorting/impl/Kokkos_NestedSortImpl.hpp
-- Installing: /var/jenkins/workspace/ArborX_nightly/install-kokkos/include/sorting/impl/Kokkos_CopyOpsForBinSortImpl.hpp
-- Installing: /var/jenkins/workspace/ArborX_nightly/install-kokkos/include/sorting/impl/Kokkos_SortImpl.hpp
-- Installing: /var/jenkins/workspace/ArborX_nightly/install-kokkos/include/Kokkos_Random.hpp
-- Installing: /var/jenkins/workspace/ArborX_nightly/install-kokkos/include/Kokkos_Sort.hpp
-- Installing: /var/jenkins/workspace/ArborX_nightly/install-kokkos/include/std_algorithms
-- Installing: /var/jenkins/workspace/ArborX_nightly/install-kokkos/include/std_algorithms/Kokkos_RotateCopy.hpp
-- Installing: /var/jenkins/workspace/ArborX_nightly/install-kokkos/include/std_algorithms/Kokkos_TransformReduce.hpp
-- Installing: /var/jenkins/workspace/ArborX_nightly/install-kokkos/include/std_algorithms/Kokkos_Remove.hpp
-- Installing: /var/jenkins/workspace/ArborX_nightly/install-kokkos/include/std_algorithms/Kokkos_Copy.hpp
-- Installing: /var/jenkins/workspace/ArborX_nightly/install-kokkos/include/std_algorithms/Kokkos_FindIfNot.hpp
-- Installing: /var/jenkins/workspace/ArborX_nightly/install-kokkos/include/std_algorithms/Kokkos_ReplaceCopy.hpp
-- Installing: /var/jenkins/workspace/ArborX_nightly/install-kokkos/include/std_algorithms/Kokkos_CountIf.hpp
-- Installing: /var/jenkins/workspace/ArborX_nightly/install-kokkos/include/std_algorithms/Kokkos_ForEachN.hpp
-- Installing: /var/jenkins/workspace/ArborX_nightly/install-kokkos/include/std_algorithms/Kokkos_NoneOf.hpp
-- Installing: /var/jenkins/workspace/ArborX_nightly/install-kokkos/include/std_algorithms/Kokkos_Find.hpp
-- Installing: /var/jenkins/workspace/ArborX_nightly/install-kokkos/include/std_algorithms/Kokkos_IsPartitioned.hpp
-- Installing: /var/jenkins/workspace/ArborX_nightly/install-kokkos/include/std_algorithms/Kokkos_PartitionCopy.hpp
-- Installing: /var/jenkins/workspace/ArborX_nightly/install-kokkos/include/std_algorithms/Kokkos_CopyBackward.hpp
-- Installing: /var/jenkins/workspace/ArborX_nightly/install-kokkos/include/std_algorithms/Kokkos_SearchN.hpp
-- Installing: /var/jenkins/workspace/ArborX_nightly/install-kokkos/include/std_algorithms/Kokkos_ShiftRight.hpp
-- Installing: /var/jenkins/workspace/ArborX_nightly/install-kokkos/include/std_algorithms/Kokkos_Mismatch.hpp
-- Installing: /var/jenkins/workspace/ArborX_nightly/install-kokkos/include/std_algorithms/Kokkos_IterSwap.hpp
-- Installing: /var/jenkins/workspace/ArborX_nightly/install-kokkos/include/std_algorithms/Kokkos_AnyOf.hpp
-- Installing: /var/jenkins/workspace/ArborX_nightly/install-kokkos/include/std_algorithms/Kokkos_UniqueCopy.hpp
-- Installing: /var/jenkins/workspace/ArborX_nightly/install-kokkos/include/std_algorithms/Kokkos_FindIf.hpp
-- Installing: /var/jenkins/workspace/ArborX_nightly/install-kokkos/include/std_algorithms/Kokkos_ReplaceCopyIf.hpp
-- Installing: /var/jenkins/workspace/ArborX_nightly/install-kokkos/include/std_algorithms/Kokkos_IsSorted.hpp
-- Installing: /var/jenkins/workspace/ArborX_nightly/install-kokkos/include/std_algorithms/Kokkos_MinElement.hpp
-- Installing: /var/jenkins/workspace/ArborX_nightly/install-kokkos/include/std_algorithms/Kokkos_AdjacentFind.hpp
-- Installing: /var/jenkins/workspace/ArborX_nightly/install-kokkos/include/std_algorithms/Kokkos_MoveBackward.hpp
-- Installing: /var/jenkins/workspace/ArborX_nightly/install-kokkos/include/std_algorithms/Kokkos_Reverse.hpp
-- Installing: /var/jenkins/workspace/ArborX_nightly/install-kokkos/include/std_algorithms/Kokkos_LexicographicalCompare.hpp
-- Installing: /var/jenkins/workspace/ArborX_nightly/install-kokkos/include/std_algorithms/Kokkos_IsSortedUntil.hpp
-- Installing: /var/jenkins/workspace/ArborX_nightly/install-kokkos/include/std_algorithms/Kokkos_CopyN.hpp
-- Installing: /var/jenkins/workspace/ArborX_nightly/install-kokkos/include/std_algorithms/Kokkos_SwapRanges.hpp
-- Installing: /var/jenkins/workspace/ArborX_nightly/install-kokkos/include/std_algorithms/Kokkos_Reduce.hpp
-- Installing: /var/jenkins/workspace/ArborX_nightly/install-kokkos/include/std_algorithms/Kokkos_ReverseCopy.hpp
-- Installing: /var/jenkins/workspace/ArborX_nightly/install-kokkos/include/std_algorithms/Kokkos_ExclusiveScan.hpp
-- Installing: /var/jenkins/workspace/ArborX_nightly/install-kokkos/include/std_algorithms/Kokkos_PartitionPoint.hpp
-- Installing: /var/jenkins/workspace/ArborX_nightly/install-kokkos/include/std_algorithms/Kokkos_Equal.hpp
-- Installing: /var/jenkins/workspace/ArborX_nightly/install-kokkos/include/std_algorithms/Kokkos_Count.hpp
-- Installing: /var/jenkins/workspace/ArborX_nightly/install-kokkos/include/std_algorithms/Kokkos_TransformInclusiveScan.hpp
-- Installing: /var/jenkins/workspace/ArborX_nightly/install-kokkos/include/std_algorithms/Kokkos_AllOf.hpp
-- Installing: /var/jenkins/workspace/ArborX_nightly/install-kokkos/include/std_algorithms/Kokkos_FillN.hpp
-- Installing: /var/jenkins/workspace/ArborX_nightly/install-kokkos/include/std_algorithms/Kokkos_Transform.hpp
-- Installing: /var/jenkins/workspace/ArborX_nightly/install-kokkos/include/std_algorithms/Kokkos_CopyIf.hpp
-- Installing: /var/jenkins/workspace/ArborX_nightly/install-kokkos/include/std_algorithms/Kokkos_Rotate.hpp
-- Installing: /var/jenkins/workspace/ArborX_nightly/install-kokkos/include/std_algorithms/Kokkos_MaxElement.hpp
-- Installing: /var/jenkins/workspace/ArborX_nightly/install-kokkos/include/std_algorithms/Kokkos_InclusiveScan.hpp
-- Installing: /var/jenkins/workspace/ArborX_nightly/install-kokkos/include/std_algorithms/Kokkos_GenerateN.hpp
-- Installing: /var/jenkins/workspace/ArborX_nightly/install-kokkos/include/std_algorithms/Kokkos_Search.hpp
-- Installing: /var/jenkins/workspace/ArborX_nightly/install-kokkos/include/std_algorithms/Kokkos_ForEach.hpp
-- Installing: /var/jenkins/workspace/ArborX_nightly/install-kokkos/include/std_algorithms/Kokkos_Replace.hpp
-- Installing: /var/jenkins/workspace/ArborX_nightly/install-kokkos/include/std_algorithms/Kokkos_ReplaceIf.hpp
-- Installing: /var/jenkins/workspace/ArborX_nightly/install-kokkos/include/std_algorithms/Kokkos_RemoveCopyIf.hpp
-- Installing: /var/jenkins/workspace/ArborX_nightly/install-kokkos/include/std_algorithms/Kokkos_ShiftLeft.hpp
-- Installing: /var/jenkins/workspace/ArborX_nightly/install-kokkos/include/std_algorithms/Kokkos_FindFirstOf.hpp
-- Installing: /var/jenkins/workspace/ArborX_nightly/install-kokkos/include/std_algorithms/Kokkos_MinMaxElement.hpp
-- Installing: /var/jenkins/workspace/ArborX_nightly/install-kokkos/include/std_algorithms/Kokkos_Unique.hpp
-- Installing: /var/jenkins/workspace/ArborX_nightly/install-kokkos/include/std_algorithms/Kokkos_AdjacentDifference.hpp
-- Installing: /var/jenkins/workspace/ArborX_nightly/install-kokkos/include/std_algorithms/impl
-- Installing: /var/jenkins/workspace/ArborX_nightly/install-kokkos/include/std_algorithms/impl/Kokkos_RotateCopy.hpp
-- Installing: /var/jenkins/workspace/ArborX_nightly/install-kokkos/include/std_algorithms/impl/Kokkos_TransformReduce.hpp
-- Installing: /var/jenkins/workspace/ArborX_nightly/install-kokkos/include/std_algorithms/impl/Kokkos_ReplaceCopy.hpp
-- Installing: /var/jenkins/workspace/ArborX_nightly/install-kokkos/include/std_algorithms/impl/Kokkos_HelperPredicates.hpp
-- Installing: /var/jenkins/workspace/ArborX_nightly/install-kokkos/include/std_algorithms/impl/Kokkos_ForEachForEachN.hpp
-- Installing: /var/jenkins/workspace/ArborX_nightly/install-kokkos/include/std_algorithms/impl/Kokkos_CopyCopyN.hpp
-- Installing: /var/jenkins/workspace/ArborX_nightly/install-kokkos/include/std_algorithms/impl/Kokkos_IsPartitioned.hpp
-- Installing: /var/jenkins/workspace/ArborX_nightly/install-kokkos/include/std_algorithms/impl/Kokkos_PartitionCopy.hpp
-- Installing: /var/jenkins/workspace/ArborX_nightly/install-kokkos/include/std_algorithms/impl/Kokkos_CopyBackward.hpp
-- Installing: /var/jenkins/workspace/ArborX_nightly/install-kokkos/include/std_algorithms/impl/Kokkos_GenerateGenerateN.hpp
-- Installing: /var/jenkins/workspace/ArborX_nightly/install-kokkos/include/std_algorithms/impl/Kokkos_SearchN.hpp
-- Installing: /var/jenkins/workspace/ArborX_nightly/install-kokkos/include/std_algorithms/impl/Kokkos_ShiftRight.hpp
-- Installing: /var/jenkins/workspace/ArborX_nightly/install-kokkos/include/std_algorithms/impl/Kokkos_Mismatch.hpp
-- Installing: /var/jenkins/workspace/ArborX_nightly/install-kokkos/include/std_algorithms/impl/Kokkos_ValueWrapperForNoNeutralElement.hpp
-- Installing: /var/jenkins/workspace/ArborX_nightly/install-kokkos/include/std_algorithms/impl/Kokkos_UniqueCopy.hpp
-- Installing: /var/jenkins/workspace/ArborX_nightly/install-kokkos/include/std_algorithms/impl/Kokkos_ReplaceCopyIf.hpp
-- Installing: /var/jenkins/workspace/ArborX_nightly/install-kokkos/include/std_algorithms/impl/Kokkos_IsSorted.hpp
-- Installing: /var/jenkins/workspace/ArborX_nightly/install-kokkos/include/std_algorithms/impl/Kokkos_FindIfOrNot.hpp
-- Installing: /var/jenkins/workspace/ArborX_nightly/install-kokkos/include/std_algorithms/impl/Kokkos_AdjacentFind.hpp
-- Installing: /var/jenkins/workspace/ArborX_nightly/install-kokkos/include/std_algorithms/impl/Kokkos_MoveBackward.hpp
-- Installing: /var/jenkins/workspace/ArborX_nightly/install-kokkos/include/std_algorithms/impl/Kokkos_Constraints.hpp
-- Installing: /var/jenkins/workspace/ArborX_nightly/install-kokkos/include/std_algorithms/impl/Kokkos_Reverse.hpp
-- Installing: /var/jenkins/workspace/ArborX_nightly/install-kokkos/include/std_algorithms/impl/Kokkos_LexicographicalCompare.hpp
-- Installing: /var/jenkins/workspace/ArborX_nightly/install-kokkos/include/std_algorithms/impl/Kokkos_IsSortedUntil.hpp
-- Installing: /var/jenkins/workspace/ArborX_nightly/install-kokkos/include/std_algorithms/impl/Kokkos_SwapRanges.hpp
-- Installing: /var/jenkins/workspace/ArborX_nightly/install-kokkos/include/std_algorithms/impl/Kokkos_Reduce.hpp
-- Installing: /var/jenkins/workspace/ArborX_nightly/install-kokkos/include/std_algorithms/impl/Kokkos_ReverseCopy.hpp
-- Installing: /var/jenkins/workspace/ArborX_nightly/install-kokkos/include/std_algorithms/impl/Kokkos_ExclusiveScan.hpp
-- Installing: /var/jenkins/workspace/ArborX_nightly/install-kokkos/include/std_algorithms/impl/Kokkos_PartitionPoint.hpp
-- Installing: /var/jenkins/workspace/ArborX_nightly/install-kokkos/include/std_algorithms/impl/Kokkos_Equal.hpp
-- Installing: /var/jenkins/workspace/ArborX_nightly/install-kokkos/include/std_algorithms/impl/Kokkos_TransformInclusiveScan.hpp
-- Installing: /var/jenkins/workspace/ArborX_nightly/install-kokkos/include/std_algorithms/impl/Kokkos_ReducerWithArbitraryJoinerNoNeutralElement.hpp
-- Installing: /var/jenkins/workspace/ArborX_nightly/install-kokkos/include/std_algorithms/impl/Kokkos_RemoveAllVariants.hpp
-- Installing: /var/jenkins/workspace/ArborX_nightly/install-kokkos/include/std_algorithms/impl/Kokkos_MinMaxMinmaxElement.hpp
-- Installing: /var/jenkins/workspace/ArborX_nightly/install-kokkos/include/std_algorithms/impl/Kokkos_Transform.hpp
-- Installing: /var/jenkins/workspace/ArborX_nightly/install-kokkos/include/std_algorithms/impl/Kokkos_CopyIf.hpp
-- Installing: /var/jenkins/workspace/ArborX_nightly/install-kokkos/include/std_algorithms/impl/Kokkos_Rotate.hpp
-- Installing: /var/jenkins/workspace/ArborX_nightly/install-kokkos/include/std_algorithms/impl/Kokkos_InclusiveScan.hpp
-- Installing: /var/jenkins/workspace/ArborX_nightly/install-kokkos/include/std_algorithms/impl/Kokkos_IdentityReferenceUnaryFunctor.hpp
-- Installing: /var/jenkins/workspace/ArborX_nightly/install-kokkos/include/std_algorithms/impl/Kokkos_Search.hpp
-- Installing: /var/jenkins/workspace/ArborX_nightly/install-kokkos/include/std_algorithms/impl/Kokkos_Replace.hpp
-- Installing: /var/jenkins/workspace/ArborX_nightly/install-kokkos/include/std_algorithms/impl/Kokkos_ReplaceIf.hpp
-- Installing: /var/jenkins/workspace/ArborX_nightly/install-kokkos/include/std_algorithms/impl/Kokkos_ShiftLeft.hpp
-- Installing: /var/jenkins/workspace/ArborX_nightly/install-kokkos/include/std_algorithms/impl/Kokkos_FunctorsForExclusiveScan.hpp
-- Installing: /var/jenkins/workspace/ArborX_nightly/install-kokkos/include/std_algorithms/impl/Kokkos_FindFirstOf.hpp
-- Installing: /var/jenkins/workspace/ArborX_nightly/install-kokkos/include/std_algorithms/impl/Kokkos_Unique.hpp
-- Installing: /var/jenkins/workspace/ArborX_nightly/install-kokkos/include/std_algorithms/impl/Kokkos_CountCountIf.hpp
-- Installing: /var/jenkins/workspace/ArborX_nightly/install-kokkos/include/std_algorithms/impl/Kokkos_AdjacentDifference.hpp
-- Installing: /var/jenkins/workspace/ArborX_nightly/install-kokkos/include/std_algorithms/impl/Kokkos_AllOfAnyOfNoneOf.hpp
-- Installing: /var/jenkins/workspace/ArborX_nightly/install-kokkos/include/std_algorithms/impl/Kokkos_FillFillN.hpp
-- Installing: /var/jenkins/workspace/ArborX_nightly/install-kokkos/include/std_algorithms/impl/Kokkos_Move.hpp
-- Installing: /var/jenkins/workspace/ArborX_nightly/install-kokkos/include/std_algorithms/impl/Kokkos_MustUseKokkosSingleInTeam.hpp
-- Installing: /var/jenkins/workspace/ArborX_nightly/install-kokkos/include/std_algorithms/impl/Kokkos_TransformExclusiveScan.hpp
-- Installing: /var/jenkins/workspace/ArborX_nightly/install-kokkos/include/std_algorithms/impl/Kokkos_FindEnd.hpp
-- Installing: /var/jenkins/workspace/ArborX_nightly/install-kokkos/include/std_algorithms/Kokkos_Move.hpp
-- Installing: /var/jenkins/workspace/ArborX_nightly/install-kokkos/include/std_algorithms/Kokkos_RemoveIf.hpp
-- Installing: /var/jenkins/workspace/ArborX_nightly/install-kokkos/include/std_algorithms/Kokkos_Fill.hpp
-- Installing: /var/jenkins/workspace/ArborX_nightly/install-kokkos/include/std_algorithms/Kokkos_TransformExclusiveScan.hpp
-- Installing: /var/jenkins/workspace/ArborX_nightly/install-kokkos/include/std_algorithms/Kokkos_FindEnd.hpp
-- Installing: /var/jenkins/workspace/ArborX_nightly/install-kokkos/include/std_algorithms/Kokkos_RemoveCopy.hpp
-- Installing: /var/jenkins/workspace/ArborX_nightly/install-kokkos/include/std_algorithms/Kokkos_Generate.hpp
-- Installing: /var/jenkins/workspace/ArborX_nightly/install-kokkos/include/Kokkos_NestedSort.hpp
-- Installing: /var/jenkins/workspace/ArborX_nightly/install-kokkos/lib/libkokkosalgorithms.a
-- Up-to-date: /var/jenkins/workspace/ArborX_nightly/install-kokkos/include
-- Installing: /var/jenkins/workspace/ArborX_nightly/install-kokkos/include/Kokkos_SIMD_AVX512.hpp
-- Installing: /var/jenkins/workspace/ArborX_nightly/install-kokkos/include/Kokkos_SIMD_SVE.hpp
-- Installing: /var/jenkins/workspace/ArborX_nightly/install-kokkos/include/Kokkos_SIMD_Base.hpp
-- Installing: /var/jenkins/workspace/ArborX_nightly/install-kokkos/include/Kokkos_SIMD_Common_Math.hpp
-- Installing: /var/jenkins/workspace/ArborX_nightly/install-kokkos/include/Kokkos_SIMD_NEON.hpp
-- Installing: /var/jenkins/workspace/ArborX_nightly/install-kokkos/include/Kokkos_SIMD_AVX2.hpp
-- Up-to-date: /var/jenkins/workspace/ArborX_nightly/install-kokkos/include/impl
-- Installing: /var/jenkins/workspace/ArborX_nightly/install-kokkos/include/impl/Kokkos_SIMD_RangesCtorSupport.hpp
-- Installing: /var/jenkins/workspace/ArborX_nightly/install-kokkos/include/impl/Kokkos_Neon_SVE_bridge.hpp
-- Installing: /var/jenkins/workspace/ArborX_nightly/install-kokkos/include/impl/Kokkos_SIMD_Impl_AVX2.hpp
-- Installing: /var/jenkins/workspace/ArborX_nightly/install-kokkos/include/impl/Kokkos_SIMD_Impl_Macros.hpp
-- Installing: /var/jenkins/workspace/ArborX_nightly/install-kokkos/include/Kokkos_SIMD_Scalar.hpp
-- Installing: /var/jenkins/workspace/ArborX_nightly/install-kokkos/include/Kokkos_SIMD_Common.hpp
-- Installing: /var/jenkins/workspace/ArborX_nightly/install-kokkos/include/Kokkos_SIMD.hpp
-- Installing: /var/jenkins/workspace/ArborX_nightly/install-kokkos/include/Kokkos_SIMD_undef.hpp
-- Installing: /var/jenkins/workspace/ArborX_nightly/install-kokkos/lib/libkokkossimd.a
-- Installing: /var/jenkins/workspace/ArborX_nightly/install-kokkos/lib/cmake/Kokkos/KokkosConfig.cmake
-- Installing: /var/jenkins/workspace/ArborX_nightly/install-kokkos/lib/cmake/Kokkos/KokkosConfigCommon.cmake
-- Installing: /var/jenkins/workspace/ArborX_nightly/install-kokkos/lib/cmake/Kokkos/KokkosConfigVersion.cmake
-- Installing: /var/jenkins/workspace/ArborX_nightly/install-kokkos/lib/cmake/Kokkos/KokkosTargets.cmake
-- Installing: /var/jenkins/workspace/ArborX_nightly/install-kokkos/lib/cmake/Kokkos/KokkosTargets-release.cmake
-- Installing: /var/jenkins/workspace/ArborX_nightly/install-kokkos/include/KokkosCore_config.h
-- Installing: /var/jenkins/workspace/ArborX_nightly/install-kokkos/bin/nvcc_wrapper
-- Installing: /var/jenkins/workspace/ArborX_nightly/install-kokkos/bin/hpcbind
-- Installing: /var/jenkins/workspace/ArborX_nightly/install-kokkos/bin/kokkos_launch_compiler
-- Up-to-date: /var/jenkins/workspace/ArborX_nightly/install-kokkos/include/KokkosCore_config.h
-- Installing: /var/jenkins/workspace/ArborX_nightly/install-kokkos/include/KokkosCore_Config_FwdBackend.hpp
-- Installing: /var/jenkins/workspace/ArborX_nightly/install-kokkos/include/KokkosCore_Config_SetupBackend.hpp
-- Installing: /var/jenkins/workspace/ArborX_nightly/install-kokkos/include/KokkosCore_Config_DeclareBackend.hpp
[Pipeline] sh
+ cmake -B build-arborx -D CMAKE_INSTALL_PREFIX=/var/jenkins/workspace/ArborX_nightly/install-arborx -D Kokkos_ROOT=/var/jenkins/workspace/ArborX_nightly/install-kokkos -D CMAKE_BUILD_TYPE=Release -D CMAKE_CXX_STANDARD=23 -D CMAKE_CXX_EXTENSIONS=OFF -D ARBORX_ENABLE_BENCHMARKS=ON -D ARBORX_ENABLE_TESTS=ON -D ARBORX_ENABLE_EXAMPLES=ON
-- The CXX compiler identification is GNU 14.2.0
-- Detecting CXX compiler ABI info
-- Detecting CXX compiler ABI info - done
-- Check for working CXX compiler: /usr/local/bin/c++ - skipped
-- Detecting CXX compile features
-- Detecting CXX compile features - done
-- Enabled Kokkos devices: SERIAL
-- Found Kokkos: /var/jenkins/workspace/ArborX_nightly/install-kokkos/lib/cmake/Kokkos (version "5.2.99")
-- ArborX version: 2.1.99
-- ArborX hash = 'e84afd28'
-- Found Boost: /usr/lib/x86_64-linux-gnu/cmake/Boost-1.74.0/BoostConfig.cmake (found suitable version "1.74.0", minimum required is "1.67.0") found components: unit_test_framework
-- Found Boost: /usr/lib/x86_64-linux-gnu/cmake/Boost-1.74.0/BoostConfig.cmake (found version "1.74.0") found components: program_options
-- Found Boost: /usr/lib/x86_64-linux-gnu/cmake/Boost-1.74.0/BoostConfig.cmake (found suitable version "1.74.0", minimum required is "1.56.0") found components: program_options
-- Found benchmark: /usr/lib/x86_64-linux-gnu/cmake/benchmark (version "1.7.1")
-- Configuring done
-- Generating done
-- Build files have been written to: /var/jenkins/workspace/ArborX_nightly/build-arborx
[Pipeline] sh
+ cmake --build build-arborx --parallel 4
-- ArborX hash = 'e84afd28'
[ 0%] Built target ArborX_record_hash
[ 0%] Building CXX object test/CMakeFiles/ArborX_Test_KokkosExt.exe.dir/tstDetailsKokkosExtStdAlgorithms.cpp.o
[ 0%] Building CXX object test/CMakeFiles/ArborX_Test_CompileOnly.exe.dir/tstCompileOnlyAccessTraits.cpp.o
[ 0%] Building CXX object test/CMakeFiles/ArborX_Test_DetailsUtils.exe.dir/tstAttachIndices.cpp.o
[ 0%] Building CXX object test/CMakeFiles/ArborX_Test_Geometry.exe.dir/tstGeometryBarycentricCoordinates.cpp.o
[ 0%] Building CXX object test/CMakeFiles/ArborX_Test_CompileOnly.exe.dir/tstCompileOnlyCallbacks.cpp.o
[ 1%] Building CXX object test/CMakeFiles/ArborX_Test_Geometry.exe.dir/tstGeometryCentroid.cpp.o
[ 2%] Building CXX object test/CMakeFiles/ArborX_Test_DetailsUtils.exe.dir/tstDetailsVector.cpp.o
[ 3%] Building CXX object test/CMakeFiles/ArborX_Test_CompileOnly.exe.dir/tstCompileOnlyTypeRequirements.cpp.o
[ 3%] Building CXX object test/CMakeFiles/ArborX_Test_KokkosExt.exe.dir/tstDetailsKokkosExtKernelStdAlgorithms.cpp.o
[ 3%] Building CXX object test/CMakeFiles/ArborX_Test_DetailsUtils.exe.dir/tstDetailsUtils.cpp.o
[ 3%] Building CXX object test/CMakeFiles/ArborX_Test_Geometry.exe.dir/tstGeometryClosestPoint.cpp.o
[ 3%] Building CXX object test/CMakeFiles/ArborX_Test_Geometry.exe.dir/tstGeometryDistance.cpp.o
[ 4%] Building CXX object test/CMakeFiles/ArborX_Test_KokkosExt.exe.dir/tstDetailsKokkosExtUninitializedMemoryAlgorithms.cpp.o
[ 4%] Building CXX object test/CMakeFiles/ArborX_Test_DetailsUtils.exe.dir/tstDetailsSVD.cpp.o
[ 4%] Building CXX object test/CMakeFiles/ArborX_Test_KokkosExt.exe.dir/tstDetailsKokkosExtMinMaxReduce.cpp.o
[ 5%] Building CXX object test/CMakeFiles/ArborX_Test_Geometry.exe.dir/tstGeometryExpand.cpp.o
[ 5%] Building CXX object test/CMakeFiles/ArborX_Test_CompileOnly.exe.dir/tstCompileOnlyWeightedEdges.cpp.o
[ 5%] Building CXX object test/CMakeFiles/ArborX_Test_CompileOnly.exe.dir/tstCompileOnlyVersionMacros.cpp.o
[ 6%] Building CXX object test/CMakeFiles/ArborX_Test_CompileOnly.exe.dir/tstCompileOnlyMain.cpp.o
[ 6%] Linking CXX executable ArborX_Test_CompileOnly.exe
[ 6%] Built target ArborX_Test_CompileOnly.exe
[ 6%] Building CXX object test/CMakeFiles/ArborX_Test_QueryTree.exe.dir/tstQueryTreeCallbacks_BVH_float.cpp.o
[ 6%] Building CXX object test/CMakeFiles/ArborX_Test_Geometry.exe.dir/tstGeometryIntersects.cpp.o
[ 6%] Building CXX object test/CMakeFiles/ArborX_Test_DetailsUtils.exe.dir/tstDetailsGeometryReducer.cpp.o
[ 6%] Building CXX object test/CMakeFiles/ArborX_Test_KokkosExt.exe.dir/tstDetailsKokkosExtViewHelpers.cpp.o
[ 7%] Building CXX object test/CMakeFiles/ArborX_Test_DetailsUtils.exe.dir/utf_main.cpp.o
[ 8%] Building CXX object test/CMakeFiles/ArborX_Test_KokkosExt.exe.dir/utf_main.cpp.o
[ 8%] Linking CXX executable ArborX_Test_DetailsUtils.exe
[ 8%] Built target ArborX_Test_DetailsUtils.exe
[ 9%] Building CXX object test/CMakeFiles/ArborX_Test_DetailsTreeConstruction.exe.dir/tstDetailsMortonCodes.cpp.o
[ 9%] Linking CXX executable ArborX_Test_KokkosExt.exe
[ 9%] Building CXX object test/CMakeFiles/ArborX_Test_DetailsTreeConstruction.exe.dir/tstDetailsTreeConstruction.cpp.o
[ 9%] Built target ArborX_Test_KokkosExt.exe
[ 9%] Building CXX object test/CMakeFiles/ArborX_Test_DetailsContainers.exe.dir/tstSequenceContainers.cpp.o
[ 10%] Building CXX object test/CMakeFiles/ArborX_Test_DetailsContainers.exe.dir/tstContainerAdaptors.cpp.o
[ 10%] Building CXX object test/CMakeFiles/ArborX_Test_DetailsContainers.exe.dir/tstHeapOperations.cpp.o
[ 10%] Building CXX object test/CMakeFiles/ArborX_Test_Geometry.exe.dir/tstGeometryMisc.cpp.o
[ 10%] Building CXX object test/CMakeFiles/ArborX_Test_Geometry.exe.dir/tstCompileOnlyGeometry.cpp.o
[ 11%] Building CXX object test/CMakeFiles/ArborX_Test_Geometry.exe.dir/tstRay.cpp.o
[ 11%] Building CXX object test/CMakeFiles/ArborX_Test_DetailsContainers.exe.dir/tstPriorityQueueMiscellaneous.cpp.o
[ 11%] Building CXX object test/CMakeFiles/ArborX_Test_DetailsTreeConstruction.exe.dir/tstIndexableGetter.cpp.o
[ 12%] Linking CXX executable ArborX_Test_DetailsContainers.exe
[ 12%] Built target ArborX_Test_DetailsContainers.exe
[ 12%] Building CXX object test/CMakeFiles/ArborX_Test_DetailsCrsGraphWrapperImpl.exe.dir/tstDetailsCrsGraphWrapperImpl.cpp.o
[ 12%] Linking CXX executable ArborX_Test_Geometry.exe
[ 12%] Built target ArborX_Test_Geometry.exe
[ 12%] Building CXX object test/CMakeFiles/ArborX_Test_Clustering.exe.dir/tstDBSCAN.cpp.o
[ 12%] Building CXX object test/CMakeFiles/ArborX_Test_DetailsCrsGraphWrapperImpl.exe.dir/utf_main.cpp.o
[ 12%] Linking CXX executable ArborX_Test_DetailsCrsGraphWrapperImpl.exe
[ 12%] Built target ArborX_Test_DetailsCrsGraphWrapperImpl.exe
[ 12%] Building CXX object test/CMakeFiles/ArborX_Test_DetailsClusteringHelpers.exe.dir/tstDetailsTreeNodeLabeling.cpp.o
[ 13%] Building CXX object test/CMakeFiles/ArborX_Test_DetailsClusteringHelpers.exe.dir/tstDetailsMutualReachabilityDistance.cpp.o
[ 14%] Building CXX object test/CMakeFiles/ArborX_Test_DetailsTreeConstruction.exe.dir/utf_main.cpp.o
[ 14%] Linking CXX executable ArborX_Test_DetailsTreeConstruction.exe
[ 14%] Built target ArborX_Test_DetailsTreeConstruction.exe
[ 14%] Building CXX object test/CMakeFiles/ArborX_Test_SpecializedTraversals.exe.dir/tstDetailsHalfTraversal.cpp.o
[ 15%] Building CXX object test/CMakeFiles/ArborX_Test_SpecializedTraversals.exe.dir/tstDetailsExpandHalfToFull.cpp.o
[ 15%] Building CXX object test/CMakeFiles/ArborX_Test_DetailsClusteringHelpers.exe.dir/tstMinimumSpanningTree.cpp.o
[ 15%] Building CXX object test/CMakeFiles/ArborX_Test_SpecializedTraversals.exe.dir/tstNeighborList.cpp.o
[ 15%] Building CXX object test/CMakeFiles/ArborX_Test_DetailsClusteringHelpers.exe.dir/tstMinimumSpanningTreeGoldenTest.cpp.o
[ 15%] Building CXX object test/CMakeFiles/ArborX_Test_QueryTree.exe.dir/tstQueryTreeCallbacks_BF_float.cpp.o
[ 15%] Building CXX object test/CMakeFiles/ArborX_Test_SpecializedTraversals.exe.dir/utf_main.cpp.o
[ 16%] Linking CXX executable ArborX_Test_SpecializedTraversals.exe
[ 16%] Built target ArborX_Test_SpecializedTraversals.exe
[ 17%] Building CXX object test/CMakeFiles/ArborX_Test_BoostAdapters.exe.dir/tstBoostGeometryAdapters.cpp.o
[ 17%] Building CXX object test/CMakeFiles/ArborX_Test_DetailsClusteringHelpers.exe.dir/tstUnionFind.cpp.o
In file included from /usr/include/boost/math/tools/cxx03_warn.hpp:9,
from /usr/include/boost/math/constants/constants.hpp:11,
from /usr/include/boost/geometry/util/math.hpp:29,
from /usr/include/boost/geometry/core/radian_access.hpp:33,
from /usr/include/boost/geometry/geometry.hpp:51,
from /usr/include/boost/geometry.hpp:17,
from /var/jenkins/workspace/ArborX_nightly/test/ArborX_BoostGeometryAdapters.hpp:18,
from /var/jenkins/workspace/ArborX_nightly/test/tstBoostGeometryAdapters.cpp:12:
/usr/include/boost/detail/no_exceptions_support.hpp:17:1: note: '#pragma message: This header is deprecated. Use <boost/core/no_exceptions_support.hpp> instead.'
17 | BOOST_HEADER_DEPRECATED("<boost/core/no_exceptions_support.hpp>")
| ^~~~~~~~~~~~~~~~~~~~~~~
[ 17%] Building CXX object test/CMakeFiles/ArborX_Test_BoostAdapters.exe.dir/tstBoostRangeAdapters.cpp.o
[ 18%] Building CXX object test/CMakeFiles/ArborX_Test_DetailsClusteringHelpers.exe.dir/utf_main.cpp.o
[ 18%] Building CXX object test/CMakeFiles/ArborX_Test_BoostAdapters.exe.dir/utf_main.cpp.o
[ 18%] Linking CXX executable ArborX_Test_DetailsClusteringHelpers.exe
[ 18%] Built target ArborX_Test_DetailsClusteringHelpers.exe
[ 18%] Building CXX object test/CMakeFiles/ArborX_Test_InterpMovingLeastSquares.exe.dir/tstInterpDetailsCompactRadialBasisFunction.cpp.o
[ 19%] Linking CXX executable ArborX_Test_BoostAdapters.exe
[ 19%] Built target ArborX_Test_BoostAdapters.exe
[ 19%] Building CXX object test/headers_self_contained/CMakeFiles/ArborX_HeaderSelfContained_ArborX_hpp.dir/tstHeader.cpp.o
[ 19%] Linking CXX executable ArborX_HeaderSelfContained_ArborX_hpp
[ 19%] Built target ArborX_HeaderSelfContained_ArborX_hpp
[ 19%] Building CXX object test/headers_self_contained/CMakeFiles/ArborX_HeaderSelfContained_cluster_ArborX_DBSCAN_hpp.dir/tstHeader.cpp.o
[ 20%] Linking CXX executable ArborX_HeaderSelfContained_cluster_ArborX_DBSCAN_hpp
[ 20%] Built target ArborX_HeaderSelfContained_cluster_ArborX_DBSCAN_hpp
[ 20%] Building CXX object test/headers_self_contained/CMakeFiles/ArborX_HeaderSelfContained_cluster_ArborX_Dendrogram_hpp.dir/tstHeader.cpp.o
[ 21%] Building CXX object test/CMakeFiles/ArborX_Test_InterpMovingLeastSquares.exe.dir/tstInterpDetailsPolyBasis.cpp.o
[ 21%] Linking CXX executable ArborX_HeaderSelfContained_cluster_ArborX_Dendrogram_hpp
[ 21%] Built target ArborX_HeaderSelfContained_cluster_ArborX_Dendrogram_hpp
[ 22%] Building CXX object test/headers_self_contained/CMakeFiles/ArborX_HeaderSelfContained_cluster_ArborX_HDBSCAN_hpp.dir/tstHeader.cpp.o
[ 23%] Building CXX object test/CMakeFiles/ArborX_Test_QueryTree.exe.dir/tstQueryTreeCallbacks_BVH_KDOP14_float.cpp.o
[ 23%] Linking CXX executable ArborX_HeaderSelfContained_cluster_ArborX_HDBSCAN_hpp
[ 23%] Built target ArborX_HeaderSelfContained_cluster_ArborX_HDBSCAN_hpp
[ 23%] Building CXX object test/headers_self_contained/CMakeFiles/ArborX_HeaderSelfContained_cluster_ArborX_MinimumSpanningTree_hpp.dir/tstHeader.cpp.o
[ 23%] Building CXX object test/CMakeFiles/ArborX_Test_InterpMovingLeastSquares.exe.dir/tstInterpDetailsMLSCoefficients.cpp.o
[ 24%] Linking CXX executable ArborX_HeaderSelfContained_cluster_ArborX_MinimumSpanningTree_hpp
[ 24%] Built target ArborX_HeaderSelfContained_cluster_ArborX_MinimumSpanningTree_hpp
[ 24%] Building CXX object test/headers_self_contained/CMakeFiles/ArborX_HeaderSelfContained_cluster_detail_ArborX_BoruvkaHelpers_hpp.dir/tstHeader.cpp.o
[ 24%] Linking CXX executable ArborX_HeaderSelfContained_cluster_detail_ArborX_BoruvkaHelpers_hpp
[ 24%] Built target ArborX_HeaderSelfContained_cluster_detail_ArborX_BoruvkaHelpers_hpp
[ 24%] Building CXX object test/headers_self_contained/CMakeFiles/ArborX_HeaderSelfContained_cluster_detail_ArborX_CartesianGrid_hpp.dir/tstHeader.cpp.o
[ 25%] Linking CXX executable ArborX_HeaderSelfContained_cluster_detail_ArborX_CartesianGrid_hpp
[ 25%] Built target ArborX_HeaderSelfContained_cluster_detail_ArborX_CartesianGrid_hpp
[ 25%] Building CXX object test/headers_self_contained/CMakeFiles/ArborX_HeaderSelfContained_cluster_detail_ArborX_DendrogramHelpers_hpp.dir/tstHeader.cpp.o
[ 25%] Linking CXX executable ArborX_HeaderSelfContained_cluster_detail_ArborX_DendrogramHelpers_hpp
[ 25%] Built target ArborX_HeaderSelfContained_cluster_detail_ArborX_DendrogramHelpers_hpp
[ 25%] Building CXX object test/headers_self_contained/CMakeFiles/ArborX_HeaderSelfContained_cluster_detail_ArborX_FDBSCAN_hpp.dir/tstHeader.cpp.o
[ 25%] Building CXX object test/CMakeFiles/ArborX_Test_InterpMovingLeastSquares.exe.dir/tstInterpMovingLeastSquares.cpp.o
[ 26%] Linking CXX executable ArborX_HeaderSelfContained_cluster_detail_ArborX_FDBSCAN_hpp
[ 26%] Built target ArborX_HeaderSelfContained_cluster_detail_ArborX_FDBSCAN_hpp
[ 27%] Building CXX object test/headers_self_contained/CMakeFiles/ArborX_HeaderSelfContained_cluster_detail_ArborX_FDBSCANDenseBox_hpp.dir/tstHeader.cpp.o
[ 27%] Building CXX object test/CMakeFiles/ArborX_Test_Clustering.exe.dir/tstDendrogram.cpp.o
[ 27%] Linking CXX executable ArborX_HeaderSelfContained_cluster_detail_ArborX_FDBSCANDenseBox_hpp
[ 27%] Built target ArborX_HeaderSelfContained_cluster_detail_ArborX_FDBSCANDenseBox_hpp
[ 27%] Building CXX object test/headers_self_contained/CMakeFiles/ArborX_HeaderSelfContained_cluster_detail_ArborX_MutualReachabilityDistance_hpp.dir/tstHeader.cpp.o
[ 27%] Linking CXX executable ArborX_HeaderSelfContained_cluster_detail_ArborX_MutualReachabilityDistance_hpp
[ 27%] Built target ArborX_HeaderSelfContained_cluster_detail_ArborX_MutualReachabilityDistance_hpp
[ 27%] Building CXX object test/headers_self_contained/CMakeFiles/ArborX_HeaderSelfContained_cluster_detail_ArborX_UnionFind_hpp.dir/tstHeader.cpp.o
[ 28%] Linking CXX executable ArborX_HeaderSelfContained_cluster_detail_ArborX_UnionFind_hpp
[ 28%] Built target ArborX_HeaderSelfContained_cluster_detail_ArborX_UnionFind_hpp
[ 28%] Building CXX object test/headers_self_contained/CMakeFiles/ArborX_HeaderSelfContained_cluster_detail_ArborX_WeightedEdge_hpp.dir/tstHeader.cpp.o
[ 28%] Linking CXX executable ArborX_HeaderSelfContained_cluster_detail_ArborX_WeightedEdge_hpp
[ 28%] Built target ArborX_HeaderSelfContained_cluster_detail_ArborX_WeightedEdge_hpp
[ 29%] Building CXX object test/headers_self_contained/CMakeFiles/ArborX_HeaderSelfContained_distributed_detail_ArborX_DistributedTreeNearestHelpers_hpp.dir/tstHeader.cpp.o
[ 29%] Linking CXX executable ArborX_HeaderSelfContained_distributed_detail_ArborX_DistributedTreeNearestHelpers_hpp
[ 29%] Built target ArborX_HeaderSelfContained_distributed_detail_ArborX_DistributedTreeNearestHelpers_hpp
[ 29%] Building CXX object test/headers_self_contained/CMakeFiles/ArborX_HeaderSelfContained_distributed_detail_ArborX_DistributedUtils_hpp.dir/tstHeader.cpp.o
[ 29%] Linking CXX executable ArborX_HeaderSelfContained_distributed_detail_ArborX_DistributedUtils_hpp
[ 29%] Built target ArborX_HeaderSelfContained_distributed_detail_ArborX_DistributedUtils_hpp
[ 30%] Building CXX object test/headers_self_contained/CMakeFiles/ArborX_HeaderSelfContained_geometry_ArborX_Box_hpp.dir/tstHeader.cpp.o
[ 30%] Linking CXX executable ArborX_HeaderSelfContained_geometry_ArborX_Box_hpp
[ 30%] Built target ArborX_HeaderSelfContained_geometry_ArborX_Box_hpp
[ 30%] Building CXX object test/headers_self_contained/CMakeFiles/ArborX_HeaderSelfContained_geometry_ArborX_Ellipsoid_hpp.dir/tstHeader.cpp.o
[ 31%] Linking CXX executable ArborX_HeaderSelfContained_geometry_ArborX_Ellipsoid_hpp
[ 31%] Built target ArborX_HeaderSelfContained_geometry_ArborX_Ellipsoid_hpp
[ 31%] Building CXX object test/headers_self_contained/CMakeFiles/ArborX_HeaderSelfContained_geometry_ArborX_GeometryTraits_hpp.dir/tstHeader.cpp.o
[ 31%] Linking CXX executable ArborX_HeaderSelfContained_geometry_ArborX_GeometryTraits_hpp
[ 31%] Built target ArborX_HeaderSelfContained_geometry_ArborX_GeometryTraits_hpp
[ 32%] Building CXX object test/headers_self_contained/CMakeFiles/ArborX_HeaderSelfContained_geometry_ArborX_KDOP_hpp.dir/tstHeader.cpp.o
[ 32%] Linking CXX executable ArborX_HeaderSelfContained_geometry_ArborX_KDOP_hpp
[ 32%] Built target ArborX_HeaderSelfContained_geometry_ArborX_KDOP_hpp
[ 32%] Building CXX object test/headers_self_contained/CMakeFiles/ArborX_HeaderSelfContained_geometry_ArborX_Point_hpp.dir/tstHeader.cpp.o
[ 32%] Linking CXX executable ArborX_HeaderSelfContained_geometry_ArborX_Point_hpp
[ 32%] Built target ArborX_HeaderSelfContained_geometry_ArborX_Point_hpp
[ 33%] Building CXX object test/headers_self_contained/CMakeFiles/ArborX_HeaderSelfContained_geometry_ArborX_Ray_hpp.dir/tstHeader.cpp.o
[ 33%] Linking CXX executable ArborX_HeaderSelfContained_geometry_ArborX_Ray_hpp
[ 33%] Built target ArborX_HeaderSelfContained_geometry_ArborX_Ray_hpp
[ 33%] Building CXX object test/headers_self_contained/CMakeFiles/ArborX_HeaderSelfContained_geometry_ArborX_Segment_hpp.dir/tstHeader.cpp.o
[ 34%] Linking CXX executable ArborX_HeaderSelfContained_geometry_ArborX_Segment_hpp
[ 34%] Built target ArborX_HeaderSelfContained_geometry_ArborX_Segment_hpp
[ 34%] Building CXX object test/headers_self_contained/CMakeFiles/ArborX_HeaderSelfContained_geometry_ArborX_Sphere_hpp.dir/tstHeader.cpp.o
[ 34%] Linking CXX executable ArborX_HeaderSelfContained_geometry_ArborX_Sphere_hpp
[ 34%] Built target ArborX_HeaderSelfContained_geometry_ArborX_Sphere_hpp
[ 35%] Building CXX object test/headers_self_contained/CMakeFiles/ArborX_HeaderSelfContained_geometry_ArborX_Tetrahedron_hpp.dir/tstHeader.cpp.o
[ 35%] Linking CXX executable ArborX_HeaderSelfContained_geometry_ArborX_Tetrahedron_hpp
[ 35%] Built target ArborX_HeaderSelfContained_geometry_ArborX_Tetrahedron_hpp
[ 35%] Building CXX object test/headers_self_contained/CMakeFiles/ArborX_HeaderSelfContained_geometry_ArborX_Triangle_hpp.dir/tstHeader.cpp.o
[ 35%] Linking CXX executable ArborX_HeaderSelfContained_geometry_ArborX_Triangle_hpp
[ 35%] Built target ArborX_HeaderSelfContained_geometry_ArborX_Triangle_hpp
[ 36%] Building CXX object test/headers_self_contained/CMakeFiles/ArborX_HeaderSelfContained_geometry_algorithms_ArborX_BarycentricCoordinates_hpp.dir/tstHeader.cpp.o
[ 36%] Linking CXX executable ArborX_HeaderSelfContained_geometry_algorithms_ArborX_BarycentricCoordinates_hpp
[ 36%] Building CXX object test/CMakeFiles/ArborX_Test_InterpMovingLeastSquares.exe.dir/utf_main.cpp.o
[ 36%] Built target ArborX_HeaderSelfContained_geometry_algorithms_ArborX_BarycentricCoordinates_hpp
[ 36%] Building CXX object test/headers_self_contained/CMakeFiles/ArborX_HeaderSelfContained_geometry_algorithms_ArborX_Centroid_hpp.dir/tstHeader.cpp.o
[ 37%] Linking CXX executable ArborX_HeaderSelfContained_geometry_algorithms_ArborX_Centroid_hpp
[ 37%] Built target ArborX_HeaderSelfContained_geometry_algorithms_ArborX_Centroid_hpp
[ 37%] Building CXX object test/headers_self_contained/CMakeFiles/ArborX_HeaderSelfContained_geometry_algorithms_ArborX_ClosestPoint_hpp.dir/tstHeader.cpp.o
[ 37%] Linking CXX executable ArborX_HeaderSelfContained_geometry_algorithms_ArborX_ClosestPoint_hpp
[ 37%] Built target ArborX_HeaderSelfContained_geometry_algorithms_ArborX_ClosestPoint_hpp
[ 38%] Building CXX object test/headers_self_contained/CMakeFiles/ArborX_HeaderSelfContained_geometry_algorithms_ArborX_Convert_hpp.dir/tstHeader.cpp.o
[ 38%] Linking CXX executable ArborX_HeaderSelfContained_geometry_algorithms_ArborX_Convert_hpp
[ 38%] Built target ArborX_HeaderSelfContained_geometry_algorithms_ArborX_Convert_hpp
[ 38%] Building CXX object test/headers_self_contained/CMakeFiles/ArborX_HeaderSelfContained_geometry_algorithms_ArborX_Distance_hpp.dir/tstHeader.cpp.o
[ 38%] Linking CXX executable ArborX_HeaderSelfContained_geometry_algorithms_ArborX_Distance_hpp
[ 38%] Built target ArborX_HeaderSelfContained_geometry_algorithms_ArborX_Distance_hpp
[ 39%] Building CXX object test/headers_self_contained/CMakeFiles/ArborX_HeaderSelfContained_geometry_algorithms_ArborX_Equals_hpp.dir/tstHeader.cpp.o
[ 39%] Linking CXX executable ArborX_HeaderSelfContained_geometry_algorithms_ArborX_Equals_hpp
[ 39%] Built target ArborX_HeaderSelfContained_geometry_algorithms_ArborX_Equals_hpp
[ 39%] Building CXX object test/headers_self_contained/CMakeFiles/ArborX_HeaderSelfContained_geometry_algorithms_ArborX_Expand_hpp.dir/tstHeader.cpp.o
[ 40%] Linking CXX executable ArborX_Test_InterpMovingLeastSquares.exe
[ 41%] Linking CXX executable ArborX_HeaderSelfContained_geometry_algorithms_ArborX_Expand_hpp
[ 41%] Built target ArborX_Test_InterpMovingLeastSquares.exe
[ 41%] Building CXX object test/headers_self_contained/CMakeFiles/ArborX_HeaderSelfContained_geometry_algorithms_ArborX_Intersects_hpp.dir/tstHeader.cpp.o
[ 41%] Built target ArborX_HeaderSelfContained_geometry_algorithms_ArborX_Expand_hpp
[ 42%] Building CXX object test/headers_self_contained/CMakeFiles/ArborX_HeaderSelfContained_geometry_algorithms_ArborX_Reducer_hpp.dir/tstHeader.cpp.o
[ 42%] Linking CXX executable ArborX_HeaderSelfContained_geometry_algorithms_ArborX_Intersects_hpp
[ 42%] Built target ArborX_HeaderSelfContained_geometry_algorithms_ArborX_Intersects_hpp
[ 42%] Building CXX object test/headers_self_contained/CMakeFiles/ArborX_HeaderSelfContained_geometry_algorithms_ArborX_ReverseDispatch_hpp.dir/tstHeader.cpp.o
[ 42%] Linking CXX executable ArborX_HeaderSelfContained_geometry_algorithms_ArborX_ReverseDispatch_hpp
[ 42%] Built target ArborX_HeaderSelfContained_geometry_algorithms_ArborX_ReverseDispatch_hpp
[ 43%] Building CXX object test/headers_self_contained/CMakeFiles/ArborX_HeaderSelfContained_geometry_algorithms_ArborX_TranslateAndScale_hpp.dir/tstHeader.cpp.o
[ 43%] Linking CXX executable ArborX_HeaderSelfContained_geometry_algorithms_ArborX_TranslateAndScale_hpp
[ 43%] Built target ArborX_HeaderSelfContained_geometry_algorithms_ArborX_TranslateAndScale_hpp
[ 43%] Building CXX object test/headers_self_contained/CMakeFiles/ArborX_HeaderSelfContained_geometry_algorithms_ArborX_Valid_hpp.dir/tstHeader.cpp.o
[ 44%] Linking CXX executable ArborX_HeaderSelfContained_geometry_algorithms_ArborX_Valid_hpp
[ 44%] Built target ArborX_HeaderSelfContained_geometry_algorithms_ArborX_Valid_hpp
[ 44%] Building CXX object test/headers_self_contained/CMakeFiles/ArborX_HeaderSelfContained_interpolation_ArborX_InterpMovingLeastSquares_hpp.dir/tstHeader.cpp.o
[ 44%] Linking CXX executable ArborX_HeaderSelfContained_geometry_algorithms_ArborX_Reducer_hpp
[ 44%] Built target ArborX_HeaderSelfContained_geometry_algorithms_ArborX_Reducer_hpp
[ 45%] Building CXX object test/headers_self_contained/CMakeFiles/ArborX_HeaderSelfContained_interpolation_detail_ArborX_InterpDetailsCompactRadialBasisFunction_hpp.dir/tstHeader.cpp.o
[ 45%] Linking CXX executable ArborX_HeaderSelfContained_interpolation_ArborX_InterpMovingLeastSquares_hpp
[ 45%] Built target ArborX_HeaderSelfContained_interpolation_ArborX_InterpMovingLeastSquares_hpp
[ 45%] Building CXX object test/headers_self_contained/CMakeFiles/ArborX_HeaderSelfContained_interpolation_detail_ArborX_InterpDetailsMovingLeastSquaresCoefficients_hpp.dir/tstHeader.cpp.o
[ 45%] Linking CXX executable ArborX_HeaderSelfContained_interpolation_detail_ArborX_InterpDetailsCompactRadialBasisFunction_hpp
[ 45%] Built target ArborX_HeaderSelfContained_interpolation_detail_ArborX_InterpDetailsCompactRadialBasisFunction_hpp
[ 46%] Building CXX object test/headers_self_contained/CMakeFiles/ArborX_HeaderSelfContained_interpolation_detail_ArborX_InterpDetailsPolynomialBasis_hpp.dir/tstHeader.cpp.o
[ 46%] Linking CXX executable ArborX_HeaderSelfContained_interpolation_detail_ArborX_InterpDetailsMovingLeastSquaresCoefficients_hpp
[ 46%] Built target ArborX_HeaderSelfContained_interpolation_detail_ArborX_InterpDetailsMovingLeastSquaresCoefficients_hpp
[ 46%] Building CXX object test/headers_self_contained/CMakeFiles/ArborX_HeaderSelfContained_kokkos_ext_ArborX_KokkosExtAccessibilityTraits_hpp.dir/tstHeader.cpp.o
[ 46%] Linking CXX executable ArborX_HeaderSelfContained_interpolation_detail_ArborX_InterpDetailsPolynomialBasis_hpp
[ 46%] Built target ArborX_HeaderSelfContained_interpolation_detail_ArborX_InterpDetailsPolynomialBasis_hpp
[ 46%] Building CXX object test/headers_self_contained/CMakeFiles/ArborX_HeaderSelfContained_kokkos_ext_ArborX_KokkosExtArithmeticTraits_hpp.dir/tstHeader.cpp.o
[ 46%] Linking CXX executable ArborX_HeaderSelfContained_kokkos_ext_ArborX_KokkosExtArithmeticTraits_hpp
[ 46%] Built target ArborX_HeaderSelfContained_kokkos_ext_ArborX_KokkosExtArithmeticTraits_hpp
[ 47%] Building CXX object test/headers_self_contained/CMakeFiles/ArborX_HeaderSelfContained_kokkos_ext_ArborX_KokkosExtKernelStdAlgorithms_hpp.dir/tstHeader.cpp.o
[ 47%] Linking CXX executable ArborX_HeaderSelfContained_kokkos_ext_ArborX_KokkosExtKernelStdAlgorithms_hpp
[ 47%] Built target ArborX_HeaderSelfContained_kokkos_ext_ArborX_KokkosExtKernelStdAlgorithms_hpp
[ 47%] Building CXX object test/headers_self_contained/CMakeFiles/ArborX_HeaderSelfContained_kokkos_ext_ArborX_KokkosExtMinMaxReduce_hpp.dir/tstHeader.cpp.o
[ 48%] Linking CXX executable ArborX_HeaderSelfContained_kokkos_ext_ArborX_KokkosExtAccessibilityTraits_hpp
[ 48%] Built target ArborX_HeaderSelfContained_kokkos_ext_ArborX_KokkosExtAccessibilityTraits_hpp
[ 49%] Building CXX object test/headers_self_contained/CMakeFiles/ArborX_HeaderSelfContained_kokkos_ext_ArborX_KokkosExtSort_hpp.dir/tstHeader.cpp.o
[ 49%] Linking CXX executable ArborX_HeaderSelfContained_kokkos_ext_ArborX_KokkosExtMinMaxReduce_hpp
[ 49%] Built target ArborX_HeaderSelfContained_kokkos_ext_ArborX_KokkosExtMinMaxReduce_hpp
[ 49%] Building CXX object test/headers_self_contained/CMakeFiles/ArborX_HeaderSelfContained_kokkos_ext_ArborX_KokkosExtStdAlgorithms_hpp.dir/tstHeader.cpp.o
[ 50%] Building CXX object test/CMakeFiles/ArborX_Test_Clustering.exe.dir/utf_main.cpp.o
[ 50%] Linking CXX executable ArborX_HeaderSelfContained_kokkos_ext_ArborX_KokkosExtSort_hpp
[ 50%] Built target ArborX_HeaderSelfContained_kokkos_ext_ArborX_KokkosExtSort_hpp
[ 50%] Building CXX object test/headers_self_contained/CMakeFiles/ArborX_HeaderSelfContained_kokkos_ext_ArborX_KokkosExtUninitializedMemoryAlgorithms_hpp.dir/tstHeader.cpp.o
[ 50%] Linking CXX executable ArborX_HeaderSelfContained_kokkos_ext_ArborX_KokkosExtUninitializedMemoryAlgorithms_hpp
[ 50%] Built target ArborX_HeaderSelfContained_kokkos_ext_ArborX_KokkosExtUninitializedMemoryAlgorithms_hpp
[ 50%] Building CXX object test/headers_self_contained/CMakeFiles/ArborX_HeaderSelfContained_kokkos_ext_ArborX_KokkosExtVersion_hpp.dir/tstHeader.cpp.o
[ 51%] Linking CXX executable ArborX_HeaderSelfContained_kokkos_ext_ArborX_KokkosExtStdAlgorithms_hpp
[ 52%] Linking CXX executable ArborX_HeaderSelfContained_kokkos_ext_ArborX_KokkosExtVersion_hpp
[ 52%] Built target ArborX_HeaderSelfContained_kokkos_ext_ArborX_KokkosExtStdAlgorithms_hpp
[ 52%] Building CXX object test/headers_self_contained/CMakeFiles/ArborX_HeaderSelfContained_kokkos_ext_ArborX_KokkosExtViewHelpers_hpp.dir/tstHeader.cpp.o
[ 52%] Built target ArborX_HeaderSelfContained_kokkos_ext_ArborX_KokkosExtVersion_hpp
[ 53%] Building CXX object test/headers_self_contained/CMakeFiles/ArborX_HeaderSelfContained_misc_ArborX_Containers_hpp.dir/tstHeader.cpp.o
[ 53%] Linking CXX executable ArborX_HeaderSelfContained_misc_ArborX_Containers_hpp
[ 53%] Built target ArborX_HeaderSelfContained_misc_ArborX_Containers_hpp
[ 53%] Building CXX object test/headers_self_contained/CMakeFiles/ArborX_HeaderSelfContained_misc_ArborX_Exception_hpp.dir/tstHeader.cpp.o
[ 54%] Linking CXX executable ArborX_HeaderSelfContained_misc_ArborX_Exception_hpp
[ 54%] Built target ArborX_HeaderSelfContained_misc_ArborX_Exception_hpp
[ 54%] Building CXX object test/headers_self_contained/CMakeFiles/ArborX_HeaderSelfContained_misc_ArborX_Heap_hpp.dir/tstHeader.cpp.o
[ 54%] Linking CXX executable ArborX_Test_Clustering.exe
[ 54%] Built target ArborX_Test_Clustering.exe
[ 54%] Building CXX object test/headers_self_contained/CMakeFiles/ArborX_HeaderSelfContained_misc_ArborX_OperatorFunctionObjects_hpp.dir/tstHeader.cpp.o
[ 54%] Linking CXX executable ArborX_HeaderSelfContained_misc_ArborX_Heap_hpp
[ 55%] Linking CXX executable ArborX_HeaderSelfContained_misc_ArborX_OperatorFunctionObjects_hpp
[ 55%] Built target ArborX_HeaderSelfContained_misc_ArborX_Heap_hpp
[ 55%] Building CXX object test/headers_self_contained/CMakeFiles/ArborX_HeaderSelfContained_misc_ArborX_PriorityQueue_hpp.dir/tstHeader.cpp.o
[ 55%] Built target ArborX_HeaderSelfContained_misc_ArborX_OperatorFunctionObjects_hpp
[ 56%] Building CXX object test/headers_self_contained/CMakeFiles/ArborX_HeaderSelfContained_misc_ArborX_SortUtils_hpp.dir/tstHeader.cpp.o
[ 56%] Linking CXX executable ArborX_HeaderSelfContained_misc_ArborX_PriorityQueue_hpp
[ 56%] Built target ArborX_HeaderSelfContained_misc_ArborX_PriorityQueue_hpp
[ 56%] Building CXX object test/headers_self_contained/CMakeFiles/ArborX_HeaderSelfContained_misc_ArborX_Stack_hpp.dir/tstHeader.cpp.o
[ 57%] Linking CXX executable ArborX_HeaderSelfContained_misc_ArborX_Stack_hpp
[ 57%] Built target ArborX_HeaderSelfContained_misc_ArborX_Stack_hpp
[ 57%] Building CXX object test/headers_self_contained/CMakeFiles/ArborX_HeaderSelfContained_misc_ArborX_SymmetricSVD_hpp.dir/tstHeader.cpp.o
[ 57%] Linking CXX executable ArborX_HeaderSelfContained_kokkos_ext_ArborX_KokkosExtViewHelpers_hpp
[ 57%] Built target ArborX_HeaderSelfContained_kokkos_ext_ArborX_KokkosExtViewHelpers_hpp
[ 57%] Building CXX object test/headers_self_contained/CMakeFiles/ArborX_HeaderSelfContained_misc_ArborX_Utils_hpp.dir/tstHeader.cpp.o
[ 57%] Building CXX object test/CMakeFiles/ArborX_Test_QueryTree.exe.dir/tstQueryTreeCallbacks_BVH_KDOP18_float.cpp.o
[ 57%] Linking CXX executable ArborX_HeaderSelfContained_misc_ArborX_SortUtils_hpp
[ 57%] Built target ArborX_HeaderSelfContained_misc_ArborX_SortUtils_hpp
[ 57%] Building CXX object test/headers_self_contained/CMakeFiles/ArborX_HeaderSelfContained_misc_ArborX_Vector_hpp.dir/tstHeader.cpp.o
[ 57%] Linking CXX executable ArborX_HeaderSelfContained_misc_ArborX_Vector_hpp
[ 57%] Linking CXX executable ArborX_HeaderSelfContained_misc_ArborX_SymmetricSVD_hpp
[ 57%] Built target ArborX_HeaderSelfContained_misc_ArborX_Vector_hpp
[ 58%] Building CXX object test/headers_self_contained/CMakeFiles/ArborX_HeaderSelfContained_spatial_ArborX_BruteForce_hpp.dir/tstHeader.cpp.o
[ 58%] Built target ArborX_HeaderSelfContained_misc_ArborX_SymmetricSVD_hpp
[ 58%] Building CXX object test/headers_self_contained/CMakeFiles/ArborX_HeaderSelfContained_spatial_ArborX_CrsGraphWrapper_hpp.dir/tstHeader.cpp.o
[ 59%] Linking CXX executable ArborX_HeaderSelfContained_misc_ArborX_Utils_hpp
[ 59%] Built target ArborX_HeaderSelfContained_misc_ArborX_Utils_hpp
[ 59%] Building CXX object test/headers_self_contained/CMakeFiles/ArborX_HeaderSelfContained_spatial_ArborX_LinearBVH_hpp.dir/tstHeader.cpp.o
[ 60%] Linking CXX executable ArborX_HeaderSelfContained_spatial_ArborX_CrsGraphWrapper_hpp
[ 60%] Built target ArborX_HeaderSelfContained_spatial_ArborX_CrsGraphWrapper_hpp
[ 60%] Building CXX object test/headers_self_contained/CMakeFiles/ArborX_HeaderSelfContained_spatial_detail_ArborX_AccessTraits_hpp.dir/tstHeader.cpp.o
[ 60%] Linking CXX executable ArborX_HeaderSelfContained_spatial_ArborX_BruteForce_hpp
[ 60%] Built target ArborX_HeaderSelfContained_spatial_ArborX_BruteForce_hpp
[ 60%] Building CXX object test/headers_self_contained/CMakeFiles/ArborX_HeaderSelfContained_spatial_detail_ArborX_AttachIndices_hpp.dir/tstHeader.cpp.o
[ 60%] Linking CXX executable ArborX_HeaderSelfContained_spatial_ArborX_LinearBVH_hpp
[ 60%] Built target ArborX_HeaderSelfContained_spatial_ArborX_LinearBVH_hpp
[ 61%] Building CXX object test/headers_self_contained/CMakeFiles/ArborX_HeaderSelfContained_spatial_detail_ArborX_BruteForceImpl_hpp.dir/tstHeader.cpp.o
[ 62%] Linking CXX executable ArborX_HeaderSelfContained_spatial_detail_ArborX_AccessTraits_hpp
[ 62%] Built target ArborX_HeaderSelfContained_spatial_detail_ArborX_AccessTraits_hpp
[ 62%] Building CXX object test/headers_self_contained/CMakeFiles/ArborX_HeaderSelfContained_spatial_detail_ArborX_Callbacks_hpp.dir/tstHeader.cpp.o
[ 62%] Linking CXX executable ArborX_HeaderSelfContained_spatial_detail_ArborX_AttachIndices_hpp
[ 62%] Built target ArborX_HeaderSelfContained_spatial_detail_ArborX_AttachIndices_hpp
[ 62%] Building CXX object test/headers_self_contained/CMakeFiles/ArborX_HeaderSelfContained_spatial_detail_ArborX_CrsGraphWrapperImpl_hpp.dir/tstHeader.cpp.o
[ 62%] Linking CXX executable ArborX_HeaderSelfContained_spatial_detail_ArborX_BruteForceImpl_hpp
[ 62%] Built target ArborX_HeaderSelfContained_spatial_detail_ArborX_BruteForceImpl_hpp
[ 62%] Building CXX object test/headers_self_contained/CMakeFiles/ArborX_HeaderSelfContained_spatial_detail_ArborX_ExpandHalfToFull_hpp.dir/tstHeader.cpp.o
[ 63%] Linking CXX executable ArborX_HeaderSelfContained_spatial_detail_ArborX_Callbacks_hpp
[ 63%] Built target ArborX_HeaderSelfContained_spatial_detail_ArborX_Callbacks_hpp
[ 63%] Building CXX object test/headers_self_contained/CMakeFiles/ArborX_HeaderSelfContained_spatial_detail_ArborX_HalfTraversal_hpp.dir/tstHeader.cpp.o
[ 63%] Linking CXX executable ArborX_HeaderSelfContained_spatial_detail_ArborX_CrsGraphWrapperImpl_hpp
[ 63%] Built target ArborX_HeaderSelfContained_spatial_detail_ArborX_CrsGraphWrapperImpl_hpp
[ 64%] Building CXX object test/headers_self_contained/CMakeFiles/ArborX_HeaderSelfContained_spatial_detail_ArborX_HappyTreeFriends_hpp.dir/tstHeader.cpp.o
[ 64%] Linking CXX executable ArborX_HeaderSelfContained_spatial_detail_ArborX_HappyTreeFriends_hpp
[ 64%] Built target ArborX_HeaderSelfContained_spatial_detail_ArborX_HappyTreeFriends_hpp
[ 64%] Building CXX object test/headers_self_contained/CMakeFiles/ArborX_HeaderSelfContained_spatial_detail_ArborX_IndexableGetter_hpp.dir/tstHeader.cpp.o
[ 65%] Linking CXX executable ArborX_HeaderSelfContained_spatial_detail_ArborX_ExpandHalfToFull_hpp
[ 65%] Built target ArborX_HeaderSelfContained_spatial_detail_ArborX_ExpandHalfToFull_hpp
[ 65%] Building CXX object test/headers_self_contained/CMakeFiles/ArborX_HeaderSelfContained_spatial_detail_ArborX_Iota_hpp.dir/tstHeader.cpp.o
[ 65%] Linking CXX executable ArborX_HeaderSelfContained_spatial_detail_ArborX_HalfTraversal_hpp
[ 65%] Built target ArborX_HeaderSelfContained_spatial_detail_ArborX_HalfTraversal_hpp
[ 65%] Building CXX object test/headers_self_contained/CMakeFiles/ArborX_HeaderSelfContained_spatial_detail_ArborX_MortonCode_hpp.dir/tstHeader.cpp.o
[ 66%] Linking CXX executable ArborX_HeaderSelfContained_spatial_detail_ArborX_IndexableGetter_hpp
[ 66%] Built target ArborX_HeaderSelfContained_spatial_detail_ArborX_IndexableGetter_hpp
[ 66%] Building CXX object test/headers_self_contained/CMakeFiles/ArborX_HeaderSelfContained_spatial_detail_ArborX_NearestBufferProvider_hpp.dir/tstHeader.cpp.o
[ 67%] Linking CXX executable ArborX_HeaderSelfContained_spatial_detail_ArborX_MortonCode_hpp
[ 67%] Built target ArborX_HeaderSelfContained_spatial_detail_ArborX_MortonCode_hpp
[ 68%] Building CXX object test/headers_self_contained/CMakeFiles/ArborX_HeaderSelfContained_spatial_detail_ArborX_NeighborList_hpp.dir/tstHeader.cpp.o
[ 68%] Linking CXX executable ArborX_HeaderSelfContained_spatial_detail_ArborX_Iota_hpp
[ 68%] Built target ArborX_HeaderSelfContained_spatial_detail_ArborX_Iota_hpp
[ 68%] Building CXX object test/headers_self_contained/CMakeFiles/ArborX_HeaderSelfContained_spatial_detail_ArborX_Node_hpp.dir/tstHeader.cpp.o
[ 69%] Linking CXX executable ArborX_HeaderSelfContained_spatial_detail_ArborX_Node_hpp
[ 69%] Built target ArborX_HeaderSelfContained_spatial_detail_ArborX_Node_hpp
[ 69%] Building CXX object test/headers_self_contained/CMakeFiles/ArborX_HeaderSelfContained_spatial_detail_ArborX_PairValueIndex_hpp.dir/tstHeader.cpp.o
[ 69%] Linking CXX executable ArborX_HeaderSelfContained_spatial_detail_ArborX_PairValueIndex_hpp
[ 69%] Built target ArborX_HeaderSelfContained_spatial_detail_ArborX_PairValueIndex_hpp
[ 69%] Building CXX object test/headers_self_contained/CMakeFiles/ArborX_HeaderSelfContained_spatial_detail_ArborX_PermutedData_hpp.dir/tstHeader.cpp.o
[ 69%] Linking CXX executable ArborX_HeaderSelfContained_spatial_detail_ArborX_NearestBufferProvider_hpp
[ 69%] Built target ArborX_HeaderSelfContained_spatial_detail_ArborX_NearestBufferProvider_hpp
[ 69%] Building CXX object test/headers_self_contained/CMakeFiles/ArborX_HeaderSelfContained_spatial_detail_ArborX_PredicateHelpers_hpp.dir/tstHeader.cpp.o
[ 69%] Linking CXX executable ArborX_HeaderSelfContained_spatial_detail_ArborX_NeighborList_hpp
[ 69%] Built target ArborX_HeaderSelfContained_spatial_detail_ArborX_NeighborList_hpp
[ 70%] Building CXX object test/headers_self_contained/CMakeFiles/ArborX_HeaderSelfContained_spatial_detail_ArborX_Predicates_hpp.dir/tstHeader.cpp.o
[ 71%] Linking CXX executable ArborX_HeaderSelfContained_spatial_detail_ArborX_PermutedData_hpp
[ 71%] Built target ArborX_HeaderSelfContained_spatial_detail_ArborX_PermutedData_hpp
[ 71%] Building CXX object test/headers_self_contained/CMakeFiles/ArborX_HeaderSelfContained_spatial_detail_ArborX_SpaceFillingCurves_hpp.dir/tstHeader.cpp.o
[ 71%] Linking CXX executable ArborX_HeaderSelfContained_spatial_detail_ArborX_Predicates_hpp
[ 71%] Built target ArborX_HeaderSelfContained_spatial_detail_ArborX_Predicates_hpp
[ 72%] Building CXX object test/headers_self_contained/CMakeFiles/ArborX_HeaderSelfContained_spatial_detail_ArborX_TraversalPolicy_hpp.dir/tstHeader.cpp.o
[ 72%] Linking CXX executable ArborX_HeaderSelfContained_spatial_detail_ArborX_TraversalPolicy_hpp
[ 72%] Built target ArborX_HeaderSelfContained_spatial_detail_ArborX_TraversalPolicy_hpp
[ 72%] Building CXX object test/headers_self_contained/CMakeFiles/ArborX_HeaderSelfContained_spatial_detail_ArborX_TreeConstruction_hpp.dir/tstHeader.cpp.o
[ 72%] Linking CXX executable ArborX_HeaderSelfContained_spatial_detail_ArborX_PredicateHelpers_hpp
[ 72%] Built target ArborX_HeaderSelfContained_spatial_detail_ArborX_PredicateHelpers_hpp
[ 72%] Building CXX object test/headers_self_contained/CMakeFiles/ArborX_HeaderSelfContained_spatial_detail_ArborX_TreeNodeLabeling_hpp.dir/tstHeader.cpp.o
[ 72%] Linking CXX executable ArborX_HeaderSelfContained_spatial_detail_ArborX_SpaceFillingCurves_hpp
[ 72%] Built target ArborX_HeaderSelfContained_spatial_detail_ArborX_SpaceFillingCurves_hpp
[ 73%] Building CXX object test/headers_self_contained/CMakeFiles/ArborX_HeaderSelfContained_spatial_detail_ArborX_TreeTraversal_hpp.dir/tstHeader.cpp.o
[ 74%] Linking CXX executable ArborX_HeaderSelfContained_spatial_detail_ArborX_TreeConstruction_hpp
[ 74%] Built target ArborX_HeaderSelfContained_spatial_detail_ArborX_TreeConstruction_hpp
[ 74%] Building CXX object test/headers_self_contained/CMakeFiles/ArborX_HeaderSelfContained_spatial_detail_ArborX_TreeVisualization_hpp.dir/tstHeader.cpp.o
[ 74%] Linking CXX executable ArborX_HeaderSelfContained_spatial_detail_ArborX_TreeNodeLabeling_hpp
[ 74%] Built target ArborX_HeaderSelfContained_spatial_detail_ArborX_TreeNodeLabeling_hpp
[ 75%] Building CXX object examples/access_traits/CMakeFiles/ArborX_Example_HostAccessTraits.exe.dir/example_host_access_traits.cpp.o
[ 75%] Linking CXX executable ArborX_HeaderSelfContained_spatial_detail_ArborX_TreeTraversal_hpp
[ 75%] Built target ArborX_HeaderSelfContained_spatial_detail_ArborX_TreeTraversal_hpp
[ 76%] Building CXX object examples/brute_force/CMakeFiles/ArborX_Example_BruteForce.exe.dir/example_brute_force.cpp.o
[ 76%] Linking CXX executable ArborX_HeaderSelfContained_spatial_detail_ArborX_TreeVisualization_hpp
[ 76%] Built target ArborX_HeaderSelfContained_spatial_detail_ArborX_TreeVisualization_hpp
[ 76%] Building CXX object examples/callback/CMakeFiles/ArborX_Example_Callback.exe.dir/example_callback.cpp.o
[ 76%] Linking CXX executable ArborX_Example_HostAccessTraits.exe
[ 76%] Built target ArborX_Example_HostAccessTraits.exe
[ 76%] Building CXX object examples/custom_distance/CMakeFiles/ArborX_Example_CustomDistance.exe.dir/example_custom_distance.cpp.o
[ 76%] Linking CXX executable ArborX_Example_BruteForce.exe
[ 76%] Built target ArborX_Example_BruteForce.exe
[ 76%] Building CXX object examples/dbscan/CMakeFiles/ArborX_Example_DBSCAN.exe.dir/example_dbscan.cpp.o
[ 76%] Linking CXX executable ArborX_Example_CustomDistance.exe
[ 76%] Built target ArborX_Example_CustomDistance.exe
[ 76%] Building CXX object examples/emst/CMakeFiles/ArborX_Example_EMST.exe.dir/example_emst.cpp.o
[ 76%] Building CXX object test/CMakeFiles/ArborX_Test_QueryTree.exe.dir/tstQueryTreeCallbacks_BVH_double.cpp.o
[ 77%] Linking CXX executable ArborX_Example_Callback.exe
[ 77%] Built target ArborX_Example_Callback.exe
[ 77%] Building CXX object examples/molecular_dynamics/CMakeFiles/ArborX_Example_MolecularDynamics.exe.dir/example_molecular_dynamics.cpp.o
[ 77%] Linking CXX executable ArborX_Example_EMST.exe
[ 77%] Built target ArborX_Example_EMST.exe
[ 77%] Building CXX object examples/simple_intersection/CMakeFiles/ArborX_Example_Intersection.exe.dir/example_intersection.cpp.o
[ 78%] Linking CXX executable ArborX_Example_DBSCAN.exe
[ 78%] Built target ArborX_Example_DBSCAN.exe
[ 78%] Building CXX object examples/triangle_intersection/CMakeFiles/ArborX_Example_TriangleIntersection.exe.dir/triangle_intersection.cpp.o
[ 78%] Linking CXX executable ArborX_Example_MolecularDynamics.exe
[ 78%] Built target ArborX_Example_MolecularDynamics.exe
[ 78%] Building CXX object examples/moving_least_squares/CMakeFiles/ArborX_Example_MovingLeastSquares.exe.dir/moving_least_squares.cpp.o
[ 79%] Linking CXX executable ArborX_Example_Intersection.exe
[ 79%] Built target ArborX_Example_Intersection.exe
[ 79%] Building CXX object examples/raytracing/CMakeFiles/ArborX_Example_RayTracing.exe.dir/example_raytracing.cpp.o
[ 80%] Linking CXX executable ArborX_Example_TriangleIntersection.exe
[ 80%] Built target ArborX_Example_TriangleIntersection.exe
[ 81%] Building CXX object examples/viz/CMakeFiles/ArborX_Example_TreeViz.exe.dir/tree_visualization.cpp.o
[ 82%] Linking CXX executable ArborX_Example_MovingLeastSquares.exe
[ 82%] Built target ArborX_Example_MovingLeastSquares.exe
[ 82%] Building CXX object benchmarks/brute_force_vs_bvh/CMakeFiles/ArborX_Benchmark_BruteForceVsBVH.exe.dir/brute_force_vs_bvh_2.cpp.o
[ 82%] Linking CXX executable ArborX_Example_TreeViz.exe
[ 82%] Built target ArborX_Example_TreeViz.exe
[ 82%] Building CXX object benchmarks/cluster/CMakeFiles/cluster_benchmark_helpers.dir/data.cpp.o
[ 82%] Linking CXX executable ArborX_Example_RayTracing.exe
[ 82%] Built target ArborX_Example_RayTracing.exe
[ 83%] Building CXX object benchmarks/execution_space_instances/CMakeFiles/ArborX_Benchmark_ExecutionSpaces.exe.dir/execution_space_instances_driver.cpp.o
[ 83%] Building CXX object benchmarks/cluster/CMakeFiles/cluster_benchmark_helpers.dir/print_timers.cpp.o
[ 84%] Linking CXX static library libcluster_benchmark_helpers.a
[ 84%] Built target cluster_benchmark_helpers
[ 84%] Building CXX object benchmarks/bvh_driver/CMakeFiles/ArborX_Benchmark_BoundingVolumeHierarchy.exe.dir/bvh_driver.cpp.o
In file included from /usr/include/boost/math/tools/cxx03_warn.hpp:9,
from /usr/include/boost/math/constants/constants.hpp:11,
from /usr/include/boost/geometry/util/math.hpp:29,
from /usr/include/boost/geometry/core/radian_access.hpp:33,
from /usr/include/boost/geometry/geometry.hpp:51,
from /usr/include/boost/geometry.hpp:17,
from /var/jenkins/workspace/ArborX_nightly/test/ArborX_BoostGeometryAdapters.hpp:18,
from /var/jenkins/workspace/ArborX_nightly/test/ArborX_BoostRTreeHelpers.hpp:17,
from /var/jenkins/workspace/ArborX_nightly/benchmarks/bvh_driver/bvh_driver.cpp:13:
/usr/include/boost/detail/no_exceptions_support.hpp:17:1: note: '#pragma message: This header is deprecated. Use <boost/core/no_exceptions_support.hpp> instead.'
17 | BOOST_HEADER_DEPRECATED("<boost/core/no_exceptions_support.hpp>")
| ^~~~~~~~~~~~~~~~~~~~~~~
[ 84%] Linking CXX executable ArborX_Benchmark_ExecutionSpaces.exe
[ 84%] Built target ArborX_Benchmark_ExecutionSpaces.exe
[ 84%] Building CXX object benchmarks/develop/CMakeFiles/ArborX_Benchmark_Develop.exe.dir/develop.cpp.o
[ 85%] Building CXX object benchmarks/brute_force_vs_bvh/CMakeFiles/ArborX_Benchmark_BruteForceVsBVH.exe.dir/brute_force_vs_bvh_3.cpp.o
[ 85%] Linking CXX executable ArborX_Benchmark_Develop.exe
[ 85%] Built target ArborX_Benchmark_Develop.exe
[ 85%] Building CXX object benchmarks/union_find/CMakeFiles/ArborX_Benchmark_UnionFind.exe.dir/union_find.cpp.o
[ 85%] Linking CXX executable ArborX_Benchmark_UnionFind.exe
[ 86%] Building CXX object test/CMakeFiles/ArborX_Test_QueryTree.exe.dir/tstQueryTreeCallbacks_BF_double.cpp.o
[ 86%] Built target ArborX_Benchmark_UnionFind.exe
[ 86%] Building CXX object benchmarks/triangulated_surface_distance/CMakeFiles/ArborX_Benchmark_TriangulatedSurfaceDistance.exe.dir/triangulated_surface_distance.cpp.o
[ 86%] Linking CXX executable ArborX_Benchmark_BoundingVolumeHierarchy.exe
[ 86%] Built target ArborX_Benchmark_BoundingVolumeHierarchy.exe
[ 86%] Building CXX object test/CMakeFiles/ArborX_Test_QueryTree.exe.dir/tstQueryTreeCallbacks_BVH_KDOP14_double.cpp.o
[ 86%] Building CXX object benchmarks/brute_force_vs_bvh/CMakeFiles/ArborX_Benchmark_BruteForceVsBVH.exe.dir/brute_force_vs_bvh_4.cpp.o
[ 87%] Linking CXX executable ArborX_Benchmark_TriangulatedSurfaceDistance.exe
[ 87%] Built target ArborX_Benchmark_TriangulatedSurfaceDistance.exe
[ 87%] Building CXX object benchmarks/cluster/CMakeFiles/ArborX_Benchmark_DBSCAN.exe.dir/dbscan.cpp.o
[ 87%] Building CXX object test/CMakeFiles/ArborX_Test_QueryTree.exe.dir/tstQueryTreeCallbacks_BVH_KDOP18_double.cpp.o
[ 87%] Building CXX object benchmarks/brute_force_vs_bvh/CMakeFiles/ArborX_Benchmark_BruteForceVsBVH.exe.dir/brute_force_vs_bvh_5.cpp.o
[ 88%] Building CXX object test/CMakeFiles/ArborX_Test_QueryTree.exe.dir/tstQueryTreeDegenerate_BVH_float.cpp.o
[ 89%] Building CXX object benchmarks/brute_force_vs_bvh/CMakeFiles/ArborX_Benchmark_BruteForceVsBVH.exe.dir/brute_force_vs_bvh_6.cpp.o
[ 89%] Building CXX object test/CMakeFiles/ArborX_Test_QueryTree.exe.dir/tstQueryTreeDegenerate_BF_float.cpp.o
[ 89%] Building CXX object test/CMakeFiles/ArborX_Test_QueryTree.exe.dir/tstQueryTreeDegenerate_BVH_KDOP14_float.cpp.o
[ 89%] Building CXX object benchmarks/brute_force_vs_bvh/CMakeFiles/ArborX_Benchmark_BruteForceVsBVH.exe.dir/brute_force_vs_bvh.cpp.o
[ 89%] Building CXX object test/CMakeFiles/ArborX_Test_QueryTree.exe.dir/tstQueryTreeDegenerate_BVH_KDOP18_float.cpp.o
[ 89%] Linking CXX executable ArborX_Benchmark_BruteForceVsBVH.exe
[ 89%] Built target ArborX_Benchmark_BruteForceVsBVH.exe
[ 89%] Building CXX object benchmarks/cluster/CMakeFiles/ArborX_Benchmark_MST.exe.dir/mst.cpp.o
[ 90%] Building CXX object test/CMakeFiles/ArborX_Test_QueryTree.exe.dir/tstQueryTreeDegenerate_BVH_double.cpp.o
[ 90%] Building CXX object test/CMakeFiles/ArborX_Test_QueryTree.exe.dir/tstQueryTreeDegenerate_BF_double.cpp.o
[ 90%] Linking CXX executable ArborX_Benchmark_MST.exe
[ 90%] Built target ArborX_Benchmark_MST.exe
[ 90%] Building CXX object benchmarks/cluster/CMakeFiles/ArborX_Benchmark_HDBSCAN.exe.dir/hdbscan.cpp.o
[ 90%] Building CXX object test/CMakeFiles/ArborX_Test_QueryTree.exe.dir/tstQueryTreeDegenerate_BVH_KDOP14_double.cpp.o
CPU_Node_06 seems to be removed or offline (java.lang.InterruptedException); will wait for 5 min 0 sec for it to come back online
CPU_Node_06 is back online
CPU_Node_06 seems to be removed or offline (java.lang.InterruptedException); will wait for 5 min 0 sec for it to come back online
CPU_Node_06 is back online
CPU_Node_06 seems to be removed or offline (java.lang.InterruptedException); will wait for 5 min 0 sec for it to come back online
CPU_Node_06 is back online
CPU_Node_06 seems to be removed or offline (java.lang.InterruptedException); will wait for 5 min 0 sec for it to come back online
CPU_Node_06 is back online
CPU_Node_06 seems to be removed or offline (java.lang.InterruptedException); will wait for 5 min 0 sec for it to come back online
CPU_Node_06 is back online
CPU_Node_06 seems to be removed or offline (java.lang.InterruptedException); will wait for 5 min 0 sec for it to come back online
CPU_Node_06 is back online
CPU_Node_06 seems to be removed or offline (java.lang.InterruptedException); will wait for 5 min 0 sec for it to come back online
CPU_Node_06 is back online
CPU_Node_06 seems to be removed or offline (java.lang.InterruptedException); will wait for 5 min 0 sec for it to come back online
CPU_Node_06 is back online
CPU_Node_06 seems to be removed or offline (java.lang.InterruptedException); will wait for 5 min 0 sec for it to come back online
CPU_Node_06 is back online
CPU_Node_06 seems to be removed or offline (java.lang.InterruptedException); will wait for 5 min 0 sec for it to come back online
CPU_Node_06 is back online
CPU_Node_06 seems to be removed or offline (java.lang.InterruptedException); will wait for 5 min 0 sec for it to come back online
CPU_Node_06 is back online
CPU_Node_06 seems to be removed or offline (java.lang.InterruptedException); will wait for 5 min 0 sec for it to come back online
CPU_Node_06 is back online
CPU_Node_06 seems to be removed or offline (java.lang.InterruptedException); will wait for 5 min 0 sec for it to come back online
CPU_Node_06 is back online
CPU_Node_06 seems to be removed or offline (java.lang.InterruptedException); will wait for 5 min 0 sec for it to come back online
CPU_Node_06 is back online
CPU_Node_06 seems to be removed or offline (java.lang.InterruptedException); will wait for 5 min 0 sec for it to come back online
CPU_Node_06 is back online
CPU_Node_06 seems to be removed or offline (java.lang.InterruptedException); will wait for 5 min 0 sec for it to come back online
CPU_Node_06 is back online
CPU_Node_06 seems to be removed or offline (java.lang.InterruptedException); will wait for 5 min 0 sec for it to come back online
CPU_Node_06 is back online
CPU_Node_06 seems to be removed or offline (java.lang.InterruptedException); will wait for 5 min 0 sec for it to come back online
CPU_Node_06 is back online
CPU_Node_06 seems to be removed or offline (java.lang.InterruptedException); will wait for 5 min 0 sec for it to come back online
CPU_Node_06 is back online
CPU_Node_06 seems to be removed or offline (java.lang.InterruptedException); will wait for 5 min 0 sec for it to come back online
CPU_Node_06 is back online
CPU_Node_06 seems to be removed or offline (java.lang.InterruptedException); will wait for 5 min 0 sec for it to come back online
CPU_Node_06 is back online
c++: fatal error: Killed signal terminated program cc1plus
compilation terminated.
gmake[2]: *** [benchmarks/cluster/CMakeFiles/ArborX_Benchmark_DBSCAN.exe.dir/build.make:76: benchmarks/cluster/CMakeFiles/ArborX_Benchmark_DBSCAN.exe.dir/dbscan.cpp.o] Error 1
gmake[1]: *** [CMakeFiles/Makefile2:3682: benchmarks/cluster/CMakeFiles/ArborX_Benchmark_DBSCAN.exe.dir/all] Error 2
gmake[1]: *** Waiting for unfinished jobs....
[ 91%] Building CXX object test/CMakeFiles/ArborX_Test_QueryTree.exe.dir/tstQueryTreeDegenerate_BVH_KDOP18_double.cpp.o
[ 91%] Building CXX object test/CMakeFiles/ArborX_Test_QueryTree.exe.dir/tstQueryTreeManufacturedSolution_BVH_float.cpp.o
[ 92%] Linking CXX executable ArborX_Benchmark_HDBSCAN.exe
[ 92%] Built target ArborX_Benchmark_HDBSCAN.exe
[ 92%] Building CXX object test/CMakeFiles/ArborX_Test_QueryTree.exe.dir/tstQueryTreeManufacturedSolution_BF_float.cpp.o
[ 93%] Building CXX object test/CMakeFiles/ArborX_Test_QueryTree.exe.dir/tstQueryTreeManufacturedSolution_BVH_KDOP14_float.cpp.o
[ 93%] Building CXX object test/CMakeFiles/ArborX_Test_QueryTree.exe.dir/tstQueryTreeManufacturedSolution_BVH_KDOP18_float.cpp.o
[ 93%] Building CXX object test/CMakeFiles/ArborX_Test_QueryTree.exe.dir/tstQueryTreeManufacturedSolution_BVH_double.cpp.o
[ 93%] Building CXX object test/CMakeFiles/ArborX_Test_QueryTree.exe.dir/tstQueryTreeManufacturedSolution_BF_double.cpp.o
[ 94%] Building CXX object test/CMakeFiles/ArborX_Test_QueryTree.exe.dir/tstQueryTreeManufacturedSolution_BVH_KDOP14_double.cpp.o
[ 94%] Building CXX object test/CMakeFiles/ArborX_Test_QueryTree.exe.dir/tstQueryTreeManufacturedSolution_BVH_KDOP18_double.cpp.o
[ 94%] Building CXX object test/CMakeFiles/ArborX_Test_QueryTree.exe.dir/tstQueryTreeComparisonWithBoost_BVH_float.cpp.o
[ 95%] Building CXX object test/CMakeFiles/ArborX_Test_QueryTree.exe.dir/tstQueryTreeComparisonWithBoost_BF_float.cpp.o
In file included from /usr/include/boost/math/tools/cxx03_warn.hpp:9,
from /usr/include/boost/math/constants/constants.hpp:11,
from /usr/include/boost/geometry/util/math.hpp:29,
from /usr/include/boost/geometry/core/radian_access.hpp:33,
from /usr/include/boost/geometry/geometry.hpp:51,
from /usr/include/boost/geometry.hpp:17,
from /var/jenkins/workspace/ArborX_nightly/test/ArborX_BoostGeometryAdapters.hpp:18,
from /var/jenkins/workspace/ArborX_nightly/test/ArborX_BoostRTreeHelpers.hpp:17,
from /var/jenkins/workspace/ArborX_nightly/test/tstQueryTreeComparisonWithBoost.cpp:13,
from /var/jenkins/workspace/ArborX_nightly/build-arborx/test/tstQueryTreeComparisonWithBoost_BVH_float.cpp:11:
/usr/include/boost/detail/no_exceptions_support.hpp:17:1: note: '#pragma message: This header is deprecated. Use <boost/core/no_exceptions_support.hpp> instead.'
17 | BOOST_HEADER_DEPRECATED("<boost/core/no_exceptions_support.hpp>")
| ^~~~~~~~~~~~~~~~~~~~~~~
In file included from /usr/include/boost/math/tools/cxx03_warn.hpp:9,
from /usr/include/boost/math/constants/constants.hpp:11,
from /usr/include/boost/geometry/util/math.hpp:29,
from /usr/include/boost/geometry/core/radian_access.hpp:33,
from /usr/include/boost/geometry/geometry.hpp:51,
from /usr/include/boost/geometry.hpp:17,
from /var/jenkins/workspace/ArborX_nightly/test/ArborX_BoostGeometryAdapters.hpp:18,
from /var/jenkins/workspace/ArborX_nightly/test/ArborX_BoostRTreeHelpers.hpp:17,
from /var/jenkins/workspace/ArborX_nightly/test/tstQueryTreeComparisonWithBoost.cpp:13,
from /var/jenkins/workspace/ArborX_nightly/build-arborx/test/tstQueryTreeComparisonWithBoost_BF_float.cpp:12:
/usr/include/boost/detail/no_exceptions_support.hpp:17:1: note: '#pragma message: This header is deprecated. Use <boost/core/no_exceptions_support.hpp> instead.'
17 | BOOST_HEADER_DEPRECATED("<boost/core/no_exceptions_support.hpp>")
| ^~~~~~~~~~~~~~~~~~~~~~~
[ 95%] Building CXX object test/CMakeFiles/ArborX_Test_QueryTree.exe.dir/tstQueryTreeComparisonWithBoost_BVH_KDOP14_float.cpp.o
In file included from /usr/include/boost/math/tools/cxx03_warn.hpp:9,
from /usr/include/boost/math/constants/constants.hpp:11,
from /usr/include/boost/geometry/util/math.hpp:29,
from /usr/include/boost/geometry/core/radian_access.hpp:33,
from /usr/include/boost/geometry/geometry.hpp:51,
from /usr/include/boost/geometry.hpp:17,
from /var/jenkins/workspace/ArborX_nightly/test/ArborX_BoostGeometryAdapters.hpp:18,
from /var/jenkins/workspace/ArborX_nightly/test/ArborX_BoostRTreeHelpers.hpp:17,
from /var/jenkins/workspace/ArborX_nightly/test/tstQueryTreeComparisonWithBoost.cpp:13,
from /var/jenkins/workspace/ArborX_nightly/build-arborx/test/tstQueryTreeComparisonWithBoost_BVH_KDOP14_float.cpp:17:
/usr/include/boost/detail/no_exceptions_support.hpp:17:1: note: '#pragma message: This header is deprecated. Use <boost/core/no_exceptions_support.hpp> instead.'
17 | BOOST_HEADER_DEPRECATED("<boost/core/no_exceptions_support.hpp>")
| ^~~~~~~~~~~~~~~~~~~~~~~
[ 95%] Building CXX object test/CMakeFiles/ArborX_Test_QueryTree.exe.dir/tstQueryTreeComparisonWithBoost_BVH_KDOP18_float.cpp.o
In file included from /usr/include/boost/math/tools/cxx03_warn.hpp:9,
from /usr/include/boost/math/constants/constants.hpp:11,
from /usr/include/boost/geometry/util/math.hpp:29,
from /usr/include/boost/geometry/core/radian_access.hpp:33,
from /usr/include/boost/geometry/geometry.hpp:51,
from /usr/include/boost/geometry.hpp:17,
from /var/jenkins/workspace/ArborX_nightly/test/ArborX_BoostGeometryAdapters.hpp:18,
from /var/jenkins/workspace/ArborX_nightly/test/ArborX_BoostRTreeHelpers.hpp:17,
from /var/jenkins/workspace/ArborX_nightly/test/tstQueryTreeComparisonWithBoost.cpp:13,
from /var/jenkins/workspace/ArborX_nightly/build-arborx/test/tstQueryTreeComparisonWithBoost_BVH_KDOP18_float.cpp:17:
/usr/include/boost/detail/no_exceptions_support.hpp:17:1: note: '#pragma message: This header is deprecated. Use <boost/core/no_exceptions_support.hpp> instead.'
17 | BOOST_HEADER_DEPRECATED("<boost/core/no_exceptions_support.hpp>")
| ^~~~~~~~~~~~~~~~~~~~~~~
[ 96%] Building CXX object test/CMakeFiles/ArborX_Test_QueryTree.exe.dir/tstQueryTreeComparisonWithBoost_BVH_double.cpp.o
In file included from /usr/include/boost/math/tools/cxx03_warn.hpp:9,
from /usr/include/boost/math/constants/constants.hpp:11,
from /usr/include/boost/geometry/util/math.hpp:29,
from /usr/include/boost/geometry/core/radian_access.hpp:33,
from /usr/include/boost/geometry/geometry.hpp:51,
from /usr/include/boost/geometry.hpp:17,
from /var/jenkins/workspace/ArborX_nightly/test/ArborX_BoostGeometryAdapters.hpp:18,
from /var/jenkins/workspace/ArborX_nightly/test/ArborX_BoostRTreeHelpers.hpp:17,
from /var/jenkins/workspace/ArborX_nightly/test/tstQueryTreeComparisonWithBoost.cpp:13,
from /var/jenkins/workspace/ArborX_nightly/build-arborx/test/tstQueryTreeComparisonWithBoost_BVH_double.cpp:11:
/usr/include/boost/detail/no_exceptions_support.hpp:17:1: note: '#pragma message: This header is deprecated. Use <boost/core/no_exceptions_support.hpp> instead.'
17 | BOOST_HEADER_DEPRECATED("<boost/core/no_exceptions_support.hpp>")
| ^~~~~~~~~~~~~~~~~~~~~~~
[ 96%] Building CXX object test/CMakeFiles/ArborX_Test_QueryTree.exe.dir/tstQueryTreeComparisonWithBoost_BF_double.cpp.o
In file included from /usr/include/boost/math/tools/cxx03_warn.hpp:9,
from /usr/include/boost/math/constants/constants.hpp:11,
from /usr/include/boost/geometry/util/math.hpp:29,
from /usr/include/boost/geometry/core/radian_access.hpp:33,
from /usr/include/boost/geometry/geometry.hpp:51,
from /usr/include/boost/geometry.hpp:17,
from /var/jenkins/workspace/ArborX_nightly/test/ArborX_BoostGeometryAdapters.hpp:18,
from /var/jenkins/workspace/ArborX_nightly/test/ArborX_BoostRTreeHelpers.hpp:17,
from /var/jenkins/workspace/ArborX_nightly/test/tstQueryTreeComparisonWithBoost.cpp:13,
from /var/jenkins/workspace/ArborX_nightly/build-arborx/test/tstQueryTreeComparisonWithBoost_BF_double.cpp:12:
/usr/include/boost/detail/no_exceptions_support.hpp:17:1: note: '#pragma message: This header is deprecated. Use <boost/core/no_exceptions_support.hpp> instead.'
17 | BOOST_HEADER_DEPRECATED("<boost/core/no_exceptions_support.hpp>")
| ^~~~~~~~~~~~~~~~~~~~~~~
[ 96%] Building CXX object test/CMakeFiles/ArborX_Test_QueryTree.exe.dir/tstQueryTreeComparisonWithBoost_BVH_KDOP14_double.cpp.o
[ 96%] Building CXX object test/CMakeFiles/ArborX_Test_QueryTree.exe.dir/tstQueryTreeComparisonWithBoost_BVH_KDOP18_double.cpp.o
In file included from /usr/include/boost/math/tools/cxx03_warn.hpp:9,
from /usr/include/boost/math/constants/constants.hpp:11,
from /usr/include/boost/geometry/util/math.hpp:29,
from /usr/include/boost/geometry/core/radian_access.hpp:33,
from /usr/include/boost/geometry/geometry.hpp:51,
from /usr/include/boost/geometry.hpp:17,
from /var/jenkins/workspace/ArborX_nightly/test/ArborX_BoostGeometryAdapters.hpp:18,
from /var/jenkins/workspace/ArborX_nightly/test/ArborX_BoostRTreeHelpers.hpp:17,
from /var/jenkins/workspace/ArborX_nightly/test/tstQueryTreeComparisonWithBoost.cpp:13,
from /var/jenkins/workspace/ArborX_nightly/build-arborx/test/tstQueryTreeComparisonWithBoost_BVH_KDOP14_double.cpp:17:
/usr/include/boost/detail/no_exceptions_support.hpp:17:1: note: '#pragma message: This header is deprecated. Use <boost/core/no_exceptions_support.hpp> instead.'
17 | BOOST_HEADER_DEPRECATED("<boost/core/no_exceptions_support.hpp>")
| ^~~~~~~~~~~~~~~~~~~~~~~
In file included from /usr/include/boost/math/tools/cxx03_warn.hpp:9,
from /usr/include/boost/math/constants/constants.hpp:11,
from /usr/include/boost/geometry/util/math.hpp:29,
from /usr/include/boost/geometry/core/radian_access.hpp:33,
from /usr/include/boost/geometry/geometry.hpp:51,
from /usr/include/boost/geometry.hpp:17,
from /var/jenkins/workspace/ArborX_nightly/test/ArborX_BoostGeometryAdapters.hpp:18,
from /var/jenkins/workspace/ArborX_nightly/test/ArborX_BoostRTreeHelpers.hpp:17,
from /var/jenkins/workspace/ArborX_nightly/test/tstQueryTreeComparisonWithBoost.cpp:13,
from /var/jenkins/workspace/ArborX_nightly/build-arborx/test/tstQueryTreeComparisonWithBoost_BVH_KDOP18_double.cpp:17:
/usr/include/boost/detail/no_exceptions_support.hpp:17:1: note: '#pragma message: This header is deprecated. Use <boost/core/no_exceptions_support.hpp> instead.'
17 | BOOST_HEADER_DEPRECATED("<boost/core/no_exceptions_support.hpp>")
| ^~~~~~~~~~~~~~~~~~~~~~~
[ 97%] Building CXX object test/CMakeFiles/ArborX_Test_QueryTree.exe.dir/tstQueryTreeCallbackQueryPerThread.cpp.o
[ 97%] Building CXX object test/CMakeFiles/ArborX_Test_QueryTree.exe.dir/tstQueryTreeRay.cpp.o
[ 97%] Building CXX object test/CMakeFiles/ArborX_Test_QueryTree.exe.dir/tstQueryTreeTraversalPolicy.cpp.o
[ 98%] Building CXX object test/CMakeFiles/ArborX_Test_QueryTree.exe.dir/tstQueryTreeIntersectsKDOP.cpp.o
[ 98%] Building CXX object test/CMakeFiles/ArborX_Test_QueryTree.exe.dir/tstPredicateHelpers.cpp.o
[ 98%] Building CXX object test/CMakeFiles/ArborX_Test_QueryTree.exe.dir/tstKokkosToolsAnnotations.cpp.o
[ 99%] Building CXX object test/CMakeFiles/ArborX_Test_QueryTree.exe.dir/tstKokkosToolsExecutionSpaceInstances.cpp.o
[ 99%] Building CXX object test/CMakeFiles/ArborX_Test_QueryTree.exe.dir/utf_main.cpp.o
[ 99%] Linking CXX executable ArborX_Test_QueryTree.exe
[ 99%] Built target ArborX_Test_QueryTree.exe
gmake: *** [Makefile:146: all] Error 2
[Pipeline] }
[Pipeline] // withEnv
[Pipeline] }
$ docker stop --time=1 b6e49adb51b41636c54b76a5ae775801b9df621e7235b9199588e5e408c45518
$ docker rm -f --volumes b6e49adb51b41636c54b76a5ae775801b9df621e7235b9199588e5e408c45518
[Pipeline] // withDockerContainer
[Pipeline] }
[Pipeline] // withDockerRegistry
[Pipeline] }
[Pipeline] // withEnv
[Pipeline] }
[Pipeline] // withEnv
[Pipeline] }
[Pipeline] // node
[Pipeline] }
[Pipeline] // stage
[Pipeline] }
Failed in branch GCC-14
[Pipeline] // parallel
[Pipeline] }
[Pipeline] // stage
[Pipeline] stage
[Pipeline] { (Declarative: Post Actions)
[Pipeline] node
Running on CPU_Node_06 in /var/jenkins/workspace/ArborX_nightly
[Pipeline] {
[Pipeline] recordIssues
[CMake] Parsing console log (workspace: '/var/jenkins/workspace/ArborX_nightly')
[CMake] -> found 1 issue (skipped 0 duplicates)
[CMake] Parsing console log (workspace: '/var/jenkins/workspace/ArborX_nightly')
[CMake] Post processing issues on 'CPU_Node_06' with source code encoding 'UTF-8'
[CMake] Creating SCM blamer to obtain author and commit information for affected files
[CMake] -> No blamer installed yet. You need to install the 'git-forensics' plugin to enable blaming for Git.
[CMake] Resolving file names for all issues in workspace '/var/jenkins/workspace/ArborX_nightly'
[CMake] -> none of the issues requires resolving of paths
[CMake] Resolving module names from module definitions (build.xml, pom.xml, or Manifest.mf files)
[CMake] -> resolved module names for 1 issues
[CMake] Resolving package names (or namespaces) by parsing the affected files
[CMake] -> resolved package names of 1 affected files
[CMake] Applying 2 filters on the set of 1 issues (0 issues have been removed, 1 issues will be published)
[CMake] Creating fingerprints for all affected code blocks to track issues over different builds
[CMake] -> created fingerprints for 0 issues (skipped 1 issues)
[CMake] Copying affected files to Jenkins' build folder '/var/jenkins_home/jobs/ArborX_nightly/builds/972/files-with-issues'
[CMake] -> 0 copied, 0 not in workspace, 1 not-found, 0 with I/O error
[CMake] Skipping cleaning of source code files in old builds
[CMake] Repository miner is not configured, skipping repository mining
[CMake] Reference build recorder is not configured
[CMake] No valid reference build found
[CMake] All reported issues will be considered outstanding
[CMake] Evaluating quality gates
[CMake] -> Some quality gates have been missed: overall result is UNSTABLE
[CMake] -> Details for each quality gate:
[CMake] - [Total (any severity)]: ≪Unstable≫ - (Actual value: 1, Quality gate: 1.00)
[CMake] Health report is disabled - skipping
[CMake] Created analysis result for 1 issues (found 0 new issues, fixed 0 issues)
[CMake] Attaching ResultAction with ID 'cmake' to build 'ArborX_nightly #972'.
[Checks API] No suitable checks publisher found.
[GNU C Compiler (GCC)] Parsing console log (workspace: '/var/jenkins/workspace/ArborX_nightly')
[GNU C Compiler (GCC)] Successfully parsed console log
[GNU C Compiler (GCC)] -> found 0 issues (skipped 0 duplicates)
[GNU C Compiler (GCC)] Skipping post processing
[GNU C Compiler (GCC)] Applying 2 filters on the set of 0 issues (0 issues have been removed, 0 issues will be published)
[GNU C Compiler (GCC)] Repository miner is not configured, skipping repository mining
[GNU C Compiler (GCC)] Reference build recorder is not configured
[GNU C Compiler (GCC)] No valid reference build found
[GNU C Compiler (GCC)] All reported issues will be considered outstanding
[GNU C Compiler (GCC)] Evaluating quality gates
[GNU C Compiler (GCC)] -> All quality gates have been passed
[GNU C Compiler (GCC)] -> Details for each quality gate:
[GNU C Compiler (GCC)] - [Total (any severity)]: ≪Success≫ - (Actual value: 0, Quality gate: 1.00)
[GNU C Compiler (GCC)] Health report is disabled - skipping
[GNU C Compiler (GCC)] Created analysis result for 0 issues (found 0 new issues, fixed 0 issues)
[GNU C Compiler (GCC)] Attaching ResultAction with ID 'gcc' to build 'ArborX_nightly #972'.
[Checks API] No suitable checks publisher found.
[Clang (LLVM based)] Parsing console log (workspace: '/var/jenkins/workspace/ArborX_nightly')
[Clang (LLVM based)] Successfully parsed console log
[Clang (LLVM based)] -> found 0 issues (skipped 0 duplicates)
[Clang (LLVM based)] Skipping post processing
[Clang (LLVM based)] Applying 2 filters on the set of 0 issues (0 issues have been removed, 0 issues will be published)
[Clang (LLVM based)] Repository miner is not configured, skipping repository mining
[Clang (LLVM based)] Reference build recorder is not configured
[Clang (LLVM based)] No valid reference build found
[Clang (LLVM based)] All reported issues will be considered outstanding
[Clang (LLVM based)] Evaluating quality gates
[Clang (LLVM based)] -> All quality gates have been passed
[Clang (LLVM based)] -> Details for each quality gate:
[Clang (LLVM based)] - [Total (any severity)]: ≪Success≫ - (Actual value: 0, Quality gate: 1.00)
[Clang (LLVM based)] Health report is disabled - skipping
[Clang (LLVM based)] Created analysis result for 0 issues (found 0 new issues, fixed 0 issues)
[Clang (LLVM based)] Attaching ResultAction with ID 'clang' to build 'ArborX_nightly #972'.
[Checks API] No suitable checks publisher found.
[Clang-Tidy] Parsing console log (workspace: '/var/jenkins/workspace/ArborX_nightly')
[Clang-Tidy] -> found 0 issues (skipped 0 duplicates)
[Clang-Tidy] Parsing console log (workspace: '/var/jenkins/workspace/ArborX_nightly')
[Clang-Tidy] Skipping post processing
[Clang-Tidy] Applying 2 filters on the set of 0 issues (0 issues have been removed, 0 issues will be published)
[Clang-Tidy] Repository miner is not configured, skipping repository mining
[Clang-Tidy] Reference build recorder is not configured
[Clang-Tidy] No valid reference build found
[Clang-Tidy] All reported issues will be considered outstanding
[Clang-Tidy] Evaluating quality gates
[Clang-Tidy] -> All quality gates have been passed
[Clang-Tidy] -> Details for each quality gate:
[Clang-Tidy] - [Total (any severity)]: ≪Success≫ - (Actual value: 0, Quality gate: 1.00)
[Clang-Tidy] Health report is disabled - skipping
[Clang-Tidy] Created analysis result for 0 issues (found 0 new issues, fixed 0 issues)
[Clang-Tidy] Attaching ResultAction with ID 'clang-tidy' to build 'ArborX_nightly #972'.
[Checks API] No suitable checks publisher found.
[Pipeline] }
[Pipeline] // node
[Pipeline] }
[Pipeline] // stage
[Pipeline] }
[Pipeline] // timeout
[Pipeline] }
[Pipeline] // withEnv
[Pipeline] End of Pipeline
ERROR: script returned exit code 2
Finished: FAILURE