Skip to content
Skipping 6,272 KB.. Full Log
[CUDA-11.8-Clang-15] 45: [       OK ] cuda.SortByKeyWithStrides (6 ms)
[CUDA-11.8-Clang-15] 45: [ RUN      ] cuda.BinSort_issue_7221
[CUDA-11.8-Clang-15] 45: [       OK ] cuda.BinSort_issue_7221 (0 ms)
[CUDA-11.8-Clang-15] 45: [ RUN      ] cuda.SortByKey
[CUDA-11.8-Clang-15] 45: [       OK ] cuda.SortByKey (0 ms)
[CUDA-11.8-Clang-15] 45: [ RUN      ] cuda.BinSortGenericTests
[CUDA-11.8-Clang-15] 45: [       OK ] cuda.BinSortGenericTests (24 ms)
[CUDA-11.8-Clang-15] 45: [ RUN      ] cuda.SortEmptyView
[CUDA-11.8-Clang-15] 45: [       OK ] cuda.SortEmptyView (0 ms)
[CUDA-11.8-Clang-15] 45: [ RUN      ] cuda.SortByKeyEmptyView
[CUDA-11.8-Clang-15] 45: [       OK ] cuda.SortByKeyEmptyView (0 ms)
[CUDA-11.8-Clang-15] 45: [ RUN      ] cuda.SortCustomTypeSubrange
[CUDA-11.8-Clang-15] 45: [       OK ] cuda.SortCustomTypeSubrange (1 ms)
[CUDA-11.8-Clang-15] 45: [ RUN      ] cuda.NestedSort
[CUDA-11.8-Clang-15] 45: [       OK ] cuda.NestedSort (33 ms)
[CUDA-11.8-Clang-15] 45: [ RUN      ] cuda.SortByKeyEmptyViewHost
[CUDA-11.8-Clang-15] 45: [       OK ] cuda.SortByKeyEmptyViewHost (0 ms)
[CUDA-11.8-Clang-15] 45: [ RUN      ] cuda.SortByKeyWithComparator
[CUDA-11.8-Clang-15] 45: [       OK ] cuda.SortByKeyWithComparator (0 ms)
[CUDA-11.8-Clang-15] 45: [ RUN      ] cuda.SortCustomType
[CUDA-11.8-Clang-15] 45: [       OK ] cuda.SortCustomType (0 ms)
[CUDA-11.8-Clang-15] 45: [ RUN      ] cuda.SortWithCustomComparator
[CUDA-11.8-Clang-15] 45: [       OK ] cuda.SortWithCustomComparator (92 ms)
[CUDA-11.8-Clang-15] 45: [ RUN      ] cuda.BinSortEmptyView
[CUDA-11.8-Clang-15] 45: [       OK ] cuda.BinSortEmptyView (0 ms)
[CUDA-11.8-Clang-15] 45: [ RUN      ] cuda.SortUnsignedValueType
[CUDA-11.8-Clang-15] 45: [       OK ] cuda.SortUnsignedValueType (8 ms)
[CUDA-11.8-Clang-15] 45: [ RUN      ] cuda.SortByKeyStaticExtents
[CUDA-11.8-Clang-15] 45: [       OK ] cuda.SortByKeyStaticExtents (0 ms)
[CUDA-11.8-Clang-15] 45: [----------] 18 tests from cuda (11587 ms total)
[CUDA-11.8-Clang-15] 45: 
[CUDA-11.8-Clang-15] 45: [----------] Global test environment tear-down
[CUDA-11.8-Clang-15] 45: [==========] 19 tests from 2 test suites ran. (12054 ms total)
[CUDA-11.8-Clang-15] 45: [  PASSED  ] 19 tests.
[CUDA-11.8-Clang-15] 45/65 Test #45: Kokkos_UnitTest_Sort .......................................   Passed   12.23 sec
[CUDA-11.8-Clang-15] test 46
[CUDA-11.8-Clang-15]       Start 46: Kokkos_UnitTest_Random
[CUDA-11.8-Clang-15] 
[CUDA-11.8-Clang-15] 46: Test command: /var/jenkins/workspace/Kokkos_PR-9650/build/algorithms/unit_tests/Kokkos_UnitTest_Random
[CUDA-11.8-Clang-15] 46: Test timeout computed to be: 1500
[CUDA-11.8-Clang-15] 46: Note: Randomizing tests' orders with a seed of 88948 .
[CUDA-11.8-Clang-15] 46: [==========] Running 8 tests from 1 test suite.
[CUDA-11.8-Clang-15] 46: [----------] Global test environment set-up.
[CUDA-11.8-Clang-15] 46: [----------] 8 tests from cuda
[CUDA-11.8-Clang-15] 46: [ RUN      ] cuda.Random_XorShift64
[CUDA-11.8-Clang-15] 46: Test Seed:1792027441120766841
[CUDA-11.8-Clang-15] 46: Test Scalar=int
[CUDA-11.8-Clang-15] 46:  -- Testing randomness properties
[CUDA-11.8-Clang-15] 46:  -- Testing 1-D histogram
[CUDA-11.8-Clang-15] 46: Density 1D: 6.43252e-07 0.0140373 0.0234434 || 0.051031 28068 29336 || 28277.4 28674.4 || 324.082 -2.0744
[CUDA-11.8-Clang-15] 46:  -- Testing 3-D histogram
[CUDA-11.8-Clang-15] 46: Density 3D: 6.43252e-07 0.00502213 0.00148747 || 0.051031 1e+64 -1e+64
[CUDA-11.8-Clang-15] 46: Test Scalar=unsigned int
[CUDA-11.8-Clang-15] 46:  -- Testing randomness properties
[CUDA-11.8-Clang-15] 46:  -- Testing 1-D histogram
[CUDA-11.8-Clang-15] 46: Density 1D: 6.43252e-07 -0.0140371 -0.036145 || 0.051031 28008 29321 || 29082.6 28674.4 || -499.669 -2.0744
[CUDA-11.8-Clang-15] 46:  -- Testing 3-D histogram
[CUDA-11.8-Clang-15] 46: Density 3D: 6.43252e-07 -0.0169478 -0.00203487 || 0.051031 1e+64 -1e+64
[CUDA-11.8-Clang-15] 46: Test Scalar=int64_t
[CUDA-11.8-Clang-15] 46:  -- Testing randomness properties
[CUDA-11.8-Clang-15] 46:  -- Testing 1-D histogram
[CUDA-11.8-Clang-15] 46: Density 1D: 6.43252e-07 -0.00134571 0.000568791 || 0.051031 27964 29370 || 28713 28674.4 || 7.86297 -2.0744
[CUDA-11.8-Clang-15] 46:  -- Testing 3-D histogram
[CUDA-11.8-Clang-15] 46: Density 3D: 6.43252e-07 0.0107765 -0.00213758 || 0.051031 1e+64 -1e+64
[CUDA-11.8-Clang-15] 46: Test Scalar=uint64_t
[CUDA-11.8-Clang-15] 46:  -- Testing randomness properties
[CUDA-11.8-Clang-15] 46:  -- Testing 1-D histogram
[CUDA-11.8-Clang-15] 46: Density 1D: 6.43252e-07 0.0025099 -0.0351522 || 0.051031 28042 29350 || 28602.6 28674.4 || -485.943 -2.0744
[CUDA-11.8-Clang-15] 46:  -- Testing 3-D histogram
[CUDA-11.8-Clang-15] 46: Density 3D: 6.43252e-07 -0.00732524 -0.00512265 || 0.051031 1e+64 -1e+64
[CUDA-11.8-Clang-15] 46: Test Scalar=half
[CUDA-11.8-Clang-15] 46:  -- Testing randomness properties
[CUDA-11.8-Clang-15] 46:  -- Testing 1-D histogram
[CUDA-11.8-Clang-15] 46: Density 1D: 0.000243948 -0.99999 -48244.5 || 0.051031 0 195105 || 2.9284e+09 28674.4 || -6.66932e+08 -2.0744
[CUDA-11.8-Clang-15] 46:  -- Testing 3-D histogram
[CUDA-11.8-Clang-15] 46: Density 3D: 0.000730738 -0.304259 0.159602 || 0.051031 1e+64 -1e+64
[CUDA-11.8-Clang-15] 46: Test Scalar=bhalf
[CUDA-11.8-Clang-15] 46:  -- Testing randomness properties
[CUDA-11.8-Clang-15] 46:  -- Testing 1-D histogram
[CUDA-11.8-Clang-15] 46: Density 1D: 0.00195803 -0.999999 -57856.4 || 0.051031 0 1.5516e+06 || 2.86889e+10 28674.4 || -7.99807e+08 -2.0744
[CUDA-11.8-Clang-15] 46:  -- Testing 3-D histogram
[CUDA-11.8-Clang-15] 46: Density 3D: 0.00588427 -0.967814 10.241 || 0.051031 1e+64 -1e+64
[CUDA-11.8-Clang-15] 46: Test Scalar=float
[CUDA-11.8-Clang-15] 46:  -- Testing randomness properties
[CUDA-11.8-Clang-15] 46:  -- Testing 1-D histogram
[CUDA-11.8-Clang-15] 46: Density 1D: 6.78568e-07 -0.0281228 -0.017518 || 0.051031 28053 29378 || 29504.1 28674.4 || -242.168 -2.0744
[CUDA-11.8-Clang-15] 46:  -- Testing 3-D histogram
[CUDA-11.8-Clang-15] 46: Density 3D: 7.49199e-07 -0.000434977 -0.00231541 || 0.051031 1e+64 -1e+64
[CUDA-11.8-Clang-15] 46: Test Scalar=double
[CUDA-11.8-Clang-15] 46:  -- Testing randomness properties
[CUDA-11.8-Clang-15] 46:  -- Testing 1-D histogram
[CUDA-11.8-Clang-15] 46: Density 1D: 6.43252e-07 -0.01569 -0.0092364 || 0.051031 28061 29384 || 29131.5 28674.4 || -127.684 -2.0744
[CUDA-11.8-Clang-15] 46:  -- Testing 3-D histogram
[CUDA-11.8-Clang-15] 46: Density 3D: 6.43252e-07 -0.00189198 -0.00403256 || 0.051031 1e+64 -1e+64
[CUDA-11.8-Clang-15] 46: Test Seed:1792027441263223994
[CUDA-11.8-Clang-15] 46: Test Scalar=int
[CUDA-11.8-Clang-15] 46:  -- Testing randomness properties
[CUDA-11.8-Clang-15] 46:  -- Testing 1-D histogram
[CUDA-11.8-Clang-15] 46: Density 1D: 6.43252e-07 -0.00367059 0.0143505 || 0.051031 28041 29342 || 28780 28674.4 || 198.381 -2.0744
[CUDA-11.8-Clang-15] 46:  -- Testing 3-D histogram
[CUDA-11.8-Clang-15] 46: Density 3D: 6.43252e-07 0.0048307 0.00354676 || 0.051031 1e+64 -1e+64
[CUDA-11.8-Clang-15] 46: Test Scalar=unsigned int
[CUDA-11.8-Clang-15] 46:  -- Testing randomness properties
[CUDA-11.8-Clang-15] 46:  -- Testing 1-D histogram
[CUDA-11.8-Clang-15] 46: Density 1D: 6.43252e-07 -0.00365174 0.00759194 || 0.051031 28049 29295 || 28779.5 28674.4 || 104.951 -2.0744
[CUDA-11.8-Clang-15] 46:  -- Testing 3-D histogram
[CUDA-11.8-Clang-15] 46: Density 3D: 6.43252e-07 0.00548547 -0.00969225 || 0.051031 1e+64 -1e+64
[CUDA-11.8-Clang-15] 46: Test Scalar=int64_t
[CUDA-11.8-Clang-15] 46:  -- Testing randomness properties
[CUDA-11.8-Clang-15] 46:  -- Testing 1-D histogram
[CUDA-11.8-Clang-15] 46: Density 1D: 6.43252e-07 -0.0152877 0.019695 || 0.051031 28035 29324 || 29119.6 28674.4 || 272.263 -2.0744
[CUDA-11.8-Clang-15] 46:  -- Testing 3-D histogram
[CUDA-11.8-Clang-15] 46: Density 3D: 6.43252e-07 0.0175727 -0.00983482 || 0.051031 1e+64 -1e+64
[CUDA-11.8-Clang-15] 46: Test Scalar=uint64_t
[CUDA-11.8-Clang-15] 46:  -- Testing randomness properties
[CUDA-11.8-Clang-15] 46:  -- Testing 1-D histogram
[CUDA-11.8-Clang-15] 46: Density 1D: 6.43252e-07 -0.00660412 -0.014694 || 0.051031 28046 29345 || 28865 28674.4 || -203.13 -2.0744
[CUDA-11.8-Clang-15] 46:  -- Testing 3-D histogram
[CUDA-11.8-Clang-15] 46: Density 3D: 6.43252e-07 -0.014845 -2.43309e-05 || 0.051031 1e+64 -1e+64
[CUDA-11.8-Clang-15] 46: Test Scalar=half
[CUDA-11.8-Clang-15] 46:  -- Testing randomness properties
[CUDA-11.8-Clang-15] 46:  -- Testing 1-D histogram
[CUDA-11.8-Clang-15] 46: Density 1D: 0.000245308 -0.99999 -48246.2 || 0.051031 0 194872 || 2.92873e+09 28674.4 || -6.66955e+08 -2.0744
[CUDA-11.8-Clang-15] 46:  -- Testing 3-D histogram
[CUDA-11.8-Clang-15] 46: Density 3D: 0.000734838 -0.315432 0.14666 || 0.051031 1e+64 -1e+64
[CUDA-11.8-Clang-15] 46: Test Scalar=bhalf
[CUDA-11.8-Clang-15] 46:  -- Testing randomness properties
[CUDA-11.8-Clang-15] 46:  -- Testing 1-D histogram
[CUDA-11.8-Clang-15] 46: Density 1D: 0.00195604 -0.999999 -57857.2 || 0.051031 0 1.55128e+06 || 2.86904e+10 28674.4 || -7.99818e+08 -2.0744
[CUDA-11.8-Clang-15] 46:  -- Testing 3-D histogram
[CUDA-11.8-Clang-15] 46: Density 3D: 0.00587814 -0.967834 10.2747 || 0.051031 1e+64 -1e+64
[CUDA-11.8-Clang-15] 46: Test Scalar=float
[CUDA-11.8-Clang-15] 46:  -- Testing randomness properties
[CUDA-11.8-Clang-15] 46:  -- Testing 1-D histogram
[CUDA-11.8-Clang-15] 46: Density 1D: 6.8109e-07 0.00832298 -0.00117513 || 0.051031 28076 29292 || 28437.7 28674.4 || -16.245 -2.0744
[CUDA-11.8-Clang-15] 46:  -- Testing 3-D histogram
[CUDA-11.8-Clang-15] 46: Density 3D: 7.56767e-07 -0.00406646 -4.7899e-06 || 0.051031 1e+64 -1e+64
[CUDA-11.8-Clang-15] 46: Test Scalar=double
[CUDA-11.8-Clang-15] 46:  -- Testing randomness properties
[CUDA-11.8-Clang-15] 46:  -- Testing 1-D histogram
[CUDA-11.8-Clang-15] 46: Density 1D: 6.43252e-07 -0.013628 0.0176338 || 0.051031 27967 29426 || 29070.6 28674.4 || 243.769 -2.0744
[CUDA-11.8-Clang-15] 46:  -- Testing 3-D histogram
[CUDA-11.8-Clang-15] 46: Density 3D: 6.43252e-07 -0.0330194 0.00276276 || 0.051031 1e+64 -1e+64
[CUDA-11.8-Clang-15] 46: [       OK ] cuda.Random_XorShift64 (264 ms)
[CUDA-11.8-Clang-15] 46: [ RUN      ] cuda.Multi_streams
[CUDA-11.8-Clang-15] 46: [       OK ] cuda.Multi_streams (517 ms)
[CUDA-11.8-Clang-15] 46: [ RUN      ] cuda.Random_SFC64
[CUDA-11.8-Clang-15] 46: Test Seed:1792027441902696847
[CUDA-11.8-Clang-15] 46: Test Scalar=int
[CUDA-11.8-Clang-15] 46:  -- Testing randomness properties
[CUDA-11.8-Clang-15] 46:  -- Testing 1-D histogram
[CUDA-11.8-Clang-15] 46: Density 1D: 6.45775e-07 0.0180501 0.013549 || 0.051031 28031 29325 || 28166 28674.4 || 187.302 -2.0744
[CUDA-11.8-Clang-15] 46:  -- Testing 3-D histogram
[CUDA-11.8-Clang-15] 46: Density 3D: 6.5082e-07 0.0134765 0.0011359 || 0.051031 1e+64 -1e+64
[CUDA-11.8-Clang-15] 46: Test Scalar=unsigned int
[CUDA-11.8-Clang-15] 46:  -- Testing randomness properties
[CUDA-11.8-Clang-15] 46:  -- Testing 1-D histogram
[CUDA-11.8-Clang-15] 46: Density 1D: 6.45775e-07 0.00478867 0.0153723 || 0.051031 28049 29326 || 28537.7 28674.4 || 212.507 -2.0744
[CUDA-11.8-Clang-15] 46:  -- Testing 3-D histogram
[CUDA-11.8-Clang-15] 46: Density 3D: 6.5082e-07 0.000639537 -0.00426002 || 0.051031 1e+64 -1e+64
[CUDA-11.8-Clang-15] 46: Test Scalar=int64_t
[CUDA-11.8-Clang-15] 46:  -- Testing randomness properties
[CUDA-11.8-Clang-15] 46:  -- Testing 1-D histogram
[CUDA-11.8-Clang-15] 46: Density 1D: 6.43252e-07 -0.0177887 -0.00399227 || 0.051031 28050 29358 || 29193.7 28674.4 || -55.1891 -2.0744
[CUDA-11.8-Clang-15] 46:  -- Testing 3-D histogram
[CUDA-11.8-Clang-15] 46: Density 3D: 6.43252e-07 -0.00803434 0.00169008 || 0.051031 1e+64 -1e+64
[CUDA-11.8-Clang-15] 46: Test Scalar=uint64_t
[CUDA-11.8-Clang-15] 46:  -- Testing randomness properties
[CUDA-11.8-Clang-15] 46:  -- Testing 1-D histogram
[CUDA-11.8-Clang-15] 46: Density 1D: 6.43252e-07 -0.00575682 -0.0331057 || 0.051031 27923 29326 || 28840.4 28674.4 || -457.653 -2.0744
[CUDA-11.8-Clang-15] 46:  -- Testing 3-D histogram
[CUDA-11.8-Clang-15] 46: Density 3D: 6.43252e-07 0.02115 0.00189546 || 0.051031 1e+64 -1e+64
[CUDA-11.8-Clang-15] 46: Test Scalar=half
[CUDA-11.8-Clang-15] 46:  -- Testing randomness properties
[CUDA-11.8-Clang-15] 46:  -- Testing 1-D histogram
[CUDA-11.8-Clang-15] 46: Density 1D: 0.00024477 -0.99999 -48248.6 || 0.051031 0 195378 || 2.92883e+09 28674.4 || -6.66988e+08 -2.0744
[CUDA-11.8-Clang-15] 46:  -- Testing 3-D histogram
[CUDA-11.8-Clang-15] 46: Density 3D: 0.000733125 -0.307414 0.157411 || 0.051031 1e+64 -1e+64
[CUDA-11.8-Clang-15] 46: Test Scalar=bhalf
[CUDA-11.8-Clang-15] 46:  -- Testing randomness properties
[CUDA-11.8-Clang-15] 46:  -- Testing 1-D histogram
[CUDA-11.8-Clang-15] 46: Density 1D: 0.00195881 -0.999999 -57857 || 0.051031 0 1.55227e+06 || 2.86901e+10 28674.4 || -7.99814e+08 -2.0744
[CUDA-11.8-Clang-15] 46:  -- Testing 3-D histogram
[CUDA-11.8-Clang-15] 46: Density 3D: 0.00588673 -0.967749 10.2538 || 0.051031 1e+64 -1e+64
[CUDA-11.8-Clang-15] 46: Test Scalar=float
[CUDA-11.8-Clang-15] 46:  -- Testing randomness properties
[CUDA-11.8-Clang-15] 46:  -- Testing 1-D histogram
[CUDA-11.8-Clang-15] 46: Density 1D: 6.73523e-07 -0.00825571 0.012159 || 0.051031 28024 29294 || 28913.1 28674.4 || 168.086 -2.0744
[CUDA-11.8-Clang-15] 46:  -- Testing 3-D histogram
[CUDA-11.8-Clang-15] 46: Density 3D: 7.34064e-07 -0.0100498 0.00130052 || 0.051031 1e+64 -1e+64
[CUDA-11.8-Clang-15] 46: Test Scalar=double
[CUDA-11.8-Clang-15] 46:  -- Testing randomness properties
[CUDA-11.8-Clang-15] 46:  -- Testing 1-D histogram
[CUDA-11.8-Clang-15] 46: Density 1D: 6.43252e-07 -0.0109085 0.0114339 || 0.051031 27983 29455 || 28990.6 28674.4 || 158.062 -2.0744
[CUDA-11.8-Clang-15] 46:  -- Testing 3-D histogram
[CUDA-11.8-Clang-15] 46: Density 3D: 6.43252e-07 0.00543635 0.00544604 || 0.051031 1e+64 -1e+64
[CUDA-11.8-Clang-15] 46: Test Seed:1792027442095687852
[CUDA-11.8-Clang-15] 46: Test Scalar=int
[CUDA-11.8-Clang-15] 46:  -- Testing randomness properties
[CUDA-11.8-Clang-15] 46:  -- Testing 1-D histogram
[CUDA-11.8-Clang-15] 46: Density 1D: 6.43252e-07 0.00571456 -0.0334755 || 0.051031 27971 29314 || 28511.5 28674.4 || -462.766 -2.0744
[CUDA-11.8-Clang-15] 46:  -- Testing 3-D histogram
[CUDA-11.8-Clang-15] 46: Density 3D: 6.43252e-07 -0.0101832 0.0035936 || 0.051031 1e+64 -1e+64
[CUDA-11.8-Clang-15] 46: Test Scalar=unsigned int
[CUDA-11.8-Clang-15] 46:  -- Testing randomness properties
[CUDA-11.8-Clang-15] 46:  -- Testing 1-D histogram
[CUDA-11.8-Clang-15] 46: Density 1D: 6.43252e-07 -0.0104972 0.0118637 || 0.051031 28081 29338 || 28978.6 28674.4 || 164.004 -2.0744
[CUDA-11.8-Clang-15] 46:  -- Testing 3-D histogram
[CUDA-11.8-Clang-15] 46: Density 3D: 6.43252e-07 0.00415621 -0.00748274 || 0.051031 1e+64 -1e+64
[CUDA-11.8-Clang-15] 46: Test Scalar=int64_t
[CUDA-11.8-Clang-15] 46:  -- Testing randomness properties
[CUDA-11.8-Clang-15] 46:  -- Testing 1-D histogram
[CUDA-11.8-Clang-15] 46: Density 1D: 6.43252e-07 0.0288586 0.00121388 || 0.051031 28089 29354 || 27870.1 28674.4 || 16.7806 -2.0744
[CUDA-11.8-Clang-15] 46:  -- Testing 3-D histogram
[CUDA-11.8-Clang-15] 46: Density 3D: 6.43252e-07 0.00966164 0.00185964 || 0.051031 1e+64 -1e+64
[CUDA-11.8-Clang-15] 46: Test Scalar=uint64_t
[CUDA-11.8-Clang-15] 46:  -- Testing randomness properties
[CUDA-11.8-Clang-15] 46:  -- Testing 1-D histogram
[CUDA-11.8-Clang-15] 46: Density 1D: 6.43252e-07 -0.00783691 -0.00647997 || 0.051031 28030 29320 || 28900.9 28674.4 || -89.5792 -2.0744
[CUDA-11.8-Clang-15] 46:  -- Testing 3-D histogram
[CUDA-11.8-Clang-15] 46: Density 3D: 6.43252e-07 5.94574e-05 0.00739018 || 0.051031 1e+64 -1e+64
[CUDA-11.8-Clang-15] 46: Test Scalar=half
[CUDA-11.8-Clang-15] 46:  -- Testing randomness properties
[CUDA-11.8-Clang-15] 46:  -- Testing 1-D histogram
[CUDA-11.8-Clang-15] 46: Density 1D: 0.000245136 -0.99999 -48246.2 || 0.051031 0 195171 || 2.92875e+09 28674.4 || -6.66955e+08 -2.0744
[CUDA-11.8-Clang-15] 46:  -- Testing 3-D histogram
[CUDA-11.8-Clang-15] 46: Density 3D: 0.000734338 -0.311192 0.147864 || 0.051031 1e+64 -1e+64
[CUDA-11.8-Clang-15] 46: Test Scalar=bhalf
[CUDA-11.8-Clang-15] 46:  -- Testing randomness properties
[CUDA-11.8-Clang-15] 46:  -- Testing 1-D histogram
[CUDA-11.8-Clang-15] 46: Density 1D: 0.00195761 -0.999999 -57855.8 || 0.051031 0 1.55246e+06 || 2.86895e+10 28674.4 || -7.99799e+08 -2.0744
[CUDA-11.8-Clang-15] 46:  -- Testing 3-D histogram
[CUDA-11.8-Clang-15] 46: Density 3D: 0.00588323 -0.967723 10.2745 || 0.051031 1e+64 -1e+64
[CUDA-11.8-Clang-15] 46: Test Scalar=float
[CUDA-11.8-Clang-15] 46:  -- Testing randomness properties
[CUDA-11.8-Clang-15] 46:  -- Testing 1-D histogram
[CUDA-11.8-Clang-15] 46: Density 1D: 6.78568e-07 -0.00181576 -0.0180852 || 0.051031 28000 29337 || 28726.5 28674.4 || -250.01 -2.0744
[CUDA-11.8-Clang-15] 46:  -- Testing 3-D histogram
[CUDA-11.8-Clang-15] 46: Density 3D: 7.49199e-07 -0.00357819 0.00605889 || 0.051031 1e+64 -1e+64
[CUDA-11.8-Clang-15] 46: Test Scalar=double
[CUDA-11.8-Clang-15] 46:  -- Testing randomness properties
[CUDA-11.8-Clang-15] 46:  -- Testing 1-D histogram
[CUDA-11.8-Clang-15] 46: Density 1D: 6.43252e-07 0.0108929 -0.00607025 || 0.051031 27946 29339 || 28365.4 28674.4 || -83.9151 -2.0744
[CUDA-11.8-Clang-15] 46:  -- Testing 3-D histogram
[CUDA-11.8-Clang-15] 46: Density 3D: 6.43252e-07 0.00739931 -0.00846561 || 0.051031 1e+64 -1e+64
[CUDA-11.8-Clang-15] 46: [       OK ] cuda.Random_SFC64 (386 ms)
[CUDA-11.8-Clang-15] 46: [ RUN      ] cuda.Random_XorShift1024_0
[CUDA-11.8-Clang-15] 46: Test Seed:1792027442289313609
[CUDA-11.8-Clang-15] 46: Test Scalar=int
[CUDA-11.8-Clang-15] 46:  -- Testing randomness properties
[CUDA-11.8-Clang-15] 46:  -- Testing 1-D histogram
[CUDA-11.8-Clang-15] 46: Density 1D: 2.47955e-07 0.00936179 -0.00132095 || 0.051031 10985 11762 || 11271.4 11377 || -18.2608 -0.823045
[CUDA-11.8-Clang-15] 46:  -- Testing 3-D histogram
[CUDA-11.8-Clang-15] 46: Density 3D: 2.47955e-07 -0.00528101 0.000312683 || 0.051031 1e+64 -1e+64
[CUDA-11.8-Clang-15] 46: Test Scalar=unsigned int
[CUDA-11.8-Clang-15] 46:  -- Testing randomness properties
[CUDA-11.8-Clang-15] 46:  -- Testing 1-D histogram
[CUDA-11.8-Clang-15] 46: Density 1D: 2.47955e-07 0.00225531 0.00279918 || 0.051031 10955 11829 || 11351.4 11377 || 38.6959 -0.823045
[CUDA-11.8-Clang-15] 46:  -- Testing 3-D histogram
[CUDA-11.8-Clang-15] 46: Density 3D: 2.47955e-07 0.00426603 -0.0016591 || 0.051031 1e+64 -1e+64
[CUDA-11.8-Clang-15] 46: Test Scalar=int64_t
[CUDA-11.8-Clang-15] 46:  -- Testing randomness properties
[CUDA-11.8-Clang-15] 46:  -- Testing 1-D histogram
[CUDA-11.8-Clang-15] 46: Density 1D: 2.47955e-07 0.012717 -0.0022143 || 0.051031 10986 11840 || 11234.1 11377 || -30.6105 -0.823045
[CUDA-11.8-Clang-15] 46:  -- Testing 3-D histogram
[CUDA-11.8-Clang-15] 46: Density 3D: 2.47955e-07 0.000590733 -0.000609597 || 0.051031 1e+64 -1e+64
[CUDA-11.8-Clang-15] 46: Test Scalar=uint64_t
[CUDA-11.8-Clang-15] 46:  -- Testing randomness properties
[CUDA-11.8-Clang-15] 46:  -- Testing 1-D histogram
[CUDA-11.8-Clang-15] 46: Density 1D: 2.47955e-07 0.0101797 -0.00367189 || 0.051031 10935 11772 || 11262.3 11377 || -50.7602 -0.823045
[CUDA-11.8-Clang-15] 46:  -- Testing 3-D histogram
[CUDA-11.8-Clang-15] 46: Density 3D: 2.47955e-07 0.013503 -0.00245599 || 0.051031 1e+64 -1e+64
[CUDA-11.8-Clang-15] 46: Test Scalar=half
[CUDA-11.8-Clang-15] 46:  -- Testing randomness properties
[CUDA-11.8-Clang-15] 46:  -- Testing 1-D histogram
[CUDA-11.8-Clang-15] 46: Density 1D: 0.000243831 -0.999975 -7593.92 || 0.051031 0 77682 || 4.60945e+08 11377 || -1.04978e+08 -0.823045
[CUDA-11.8-Clang-15] 46:  -- Testing 3-D histogram
[CUDA-11.8-Clang-15] 46: Density 3D: 0.000731163 -0.141764 0.0237274 || 0.051031 1e+64 -1e+64
[CUDA-11.8-Clang-15] 46: Test Scalar=bhalf
[CUDA-11.8-Clang-15] 46:  -- Testing randomness properties
[CUDA-11.8-Clang-15] 46:  -- Testing 1-D histogram
[CUDA-11.8-Clang-15] 46: Density 1D: 0.00195564 -0.999997 -9108.12 || 0.051031 0 615911 || 4.51586e+09 11377 || -1.25911e+08 -0.823045
[CUDA-11.8-Clang-15] 46:  -- Testing 3-D histogram
[CUDA-11.8-Clang-15] 46: Density 3D: 0.00587741 -0.922349 1.59233 || 0.051031 1e+64 -1e+64
[CUDA-11.8-Clang-15] 46: Test Scalar=float
[CUDA-11.8-Clang-15] 46:  -- Testing randomness properties
[CUDA-11.8-Clang-15] 46:  -- Testing 1-D histogram
[CUDA-11.8-Clang-15] 46: Density 1D: 2.79744e-07 -0.00331251 -0.00615797 || 0.051031 10990 11824 || 11414.8 11377 || -85.1277 -0.823045
[CUDA-11.8-Clang-15] 46:  -- Testing 3-D histogram
[CUDA-11.8-Clang-15] 46: Density 3D: 3.43323e-07 -0.00829731 0.00104638 || 0.051031 1e+64 -1e+64
[CUDA-11.8-Clang-15] 46: Test Scalar=double
[CUDA-11.8-Clang-15] 46:  -- Testing randomness properties
[CUDA-11.8-Clang-15] 46:  -- Testing 1-D histogram
[CUDA-11.8-Clang-15] 46: Density 1D: 2.47955e-07 0.0138304 -0.00636707 || 0.051031 10978 11769 || 11221.8 11377 || -88.0184 -0.823045
[CUDA-11.8-Clang-15] 46:  -- Testing 3-D histogram
[CUDA-11.8-Clang-15] 46: Density 3D: 2.47955e-07 -0.0245481 -0.00267823 || 0.051031 1e+64 -1e+64
[CUDA-11.8-Clang-15] 46: Test Seed:1792027442374000208
[CUDA-11.8-Clang-15] 46: Test Scalar=int
[CUDA-11.8-Clang-15] 46:  -- Testing randomness properties
[CUDA-11.8-Clang-15] 46:  -- Testing 1-D histogram
[CUDA-11.8-Clang-15] 46: Density 1D: 2.47955e-07 -0.00737121 -0.00357241 || 0.051031 10994 11757 || 11461.4 11377 || -49.3849 -0.823045
[CUDA-11.8-Clang-15] 46:  -- Testing 3-D histogram
[CUDA-11.8-Clang-15] 46: Density 3D: 2.47955e-07 0.00827547 0.00457737 || 0.051031 1e+64 -1e+64
[CUDA-11.8-Clang-15] 46: Test Scalar=unsigned int
[CUDA-11.8-Clang-15] 46:  -- Testing randomness properties
[CUDA-11.8-Clang-15] 46:  -- Testing 1-D histogram
[CUDA-11.8-Clang-15] 46: Density 1D: 2.47955e-07 -0.0113577 -0.00728246 || 0.051031 10962 11820 || 11507.7 11377 || -100.673 -0.823045
[CUDA-11.8-Clang-15] 46:  -- Testing 3-D histogram
[CUDA-11.8-Clang-15] 46: Density 3D: 2.47955e-07 0.00253564 -0.00137617 || 0.051031 1e+64 -1e+64
[CUDA-11.8-Clang-15] 46: Test Scalar=int64_t
[CUDA-11.8-Clang-15] 46:  -- Testing randomness properties
[CUDA-11.8-Clang-15] 46:  -- Testing 1-D histogram
[CUDA-11.8-Clang-15] 46: Density 1D: 2.47955e-07 0.0133957 -0.00675385 || 0.051031 10977 11772 || 11226.6 11377 || -93.3653 -0.823045
[CUDA-11.8-Clang-15] 46:  -- Testing 3-D histogram
[CUDA-11.8-Clang-15] 46: Density 3D: 2.47955e-07 -8.76048e-05 -1.01536e-05 || 0.051031 1e+64 -1e+64
[CUDA-11.8-Clang-15] 46: Test Scalar=uint64_t
[CUDA-11.8-Clang-15] 46:  -- Testing randomness properties
[CUDA-11.8-Clang-15] 46:  -- Testing 1-D histogram
[CUDA-11.8-Clang-15] 46: Density 1D: 2.47955e-07 -0.0293209 0.0122737 || 0.051031 10931 11837 || 11720.6 11377 || 169.671 -0.823045
[CUDA-11.8-Clang-15] 46:  -- Testing 3-D histogram
[CUDA-11.8-Clang-15] 46: Density 3D: 2.47955e-07 0.00345719 -0.00275053 || 0.051031 1e+64 -1e+64
[CUDA-11.8-Clang-15] 46: Test Scalar=half
[CUDA-11.8-Clang-15] 46:  -- Testing randomness properties
[CUDA-11.8-Clang-15] 46:  -- Testing 1-D histogram
[CUDA-11.8-Clang-15] 46: Density 1D: 0.000243685 -0.999975 -7595.25 || 0.051031 0 77697 || 4.61021e+08 11377 || -1.04997e+08 -0.823045
[CUDA-11.8-Clang-15] 46:  -- Testing 3-D histogram
[CUDA-11.8-Clang-15] 46: Density 3D: 0.000730781 -0.157943 0.0251547 || 0.051031 1e+64 -1e+64
[CUDA-11.8-Clang-15] 46: Test Scalar=bhalf
[CUDA-11.8-Clang-15] 46:  -- Testing randomness properties
[CUDA-11.8-Clang-15] 46:  -- Testing 1-D histogram
[CUDA-11.8-Clang-15] 46: Density 1D: 0.00196297 -0.999997 -9107.87 || 0.051031 0 616316 || 4.51667e+09 11377 || -1.25907e+08 -0.823045
[CUDA-11.8-Clang-15] 46:  -- Testing 3-D histogram
[CUDA-11.8-Clang-15] 46: Density 3D: 0.00589979 -0.922619 1.62139 || 0.051031 1e+64 -1e+64
[CUDA-11.8-Clang-15] 46: Test Scalar=float
[CUDA-11.8-Clang-15] 46:  -- Testing randomness properties
[CUDA-11.8-Clang-15] 46:  -- Testing 1-D histogram
[CUDA-11.8-Clang-15] 46: Density 1D: 2.60671e-07 0.00253159 -0.0185279 || 0.051031 10964 11800 || 11348.2 11377 || -256.13 -0.823045
[CUDA-11.8-Clang-15] 46:  -- Testing 3-D histogram
[CUDA-11.8-Clang-15] 46: Density 3D: 2.86102e-07 0.0032362 -0.000717791 || 0.051031 1e+64 -1e+64
[CUDA-11.8-Clang-15] 46: Test Scalar=double
[CUDA-11.8-Clang-15] 46:  -- Testing randomness properties
[CUDA-11.8-Clang-15] 46:  -- Testing 1-D histogram
[CUDA-11.8-Clang-15] 46: Density 1D: 2.47955e-07 0.00673018 -0.00214767 || 0.051031 10992 11802 || 11300.9 11377 || -29.6894 -0.823045
[CUDA-11.8-Clang-15] 46:  -- Testing 3-D histogram
[CUDA-11.8-Clang-15] 46: Density 3D: 2.47955e-07 -0.00403964 -0.00195932 || 0.051031 1e+64 -1e+64
[CUDA-11.8-Clang-15] 46: [       OK ] cuda.Random_XorShift1024_0 (192 ms)
[CUDA-11.8-Clang-15] 46: [ RUN      ] cuda.Offset_streams
[CUDA-11.8-Clang-15] 46: [       OK ] cuda.Offset_streams (2 ms)
[CUDA-11.8-Clang-15] 46: [ RUN      ] cuda.Random_XorShift64_rand_range_overflow
[CUDA-11.8-Clang-15] 46: [       OK ] cuda.Random_XorShift64_rand_range_overflow (3 ms)
[CUDA-11.8-Clang-15] 46: [ RUN      ] cuda.Random_XorShift1024_rand_range_overflow
[CUDA-11.8-Clang-15] 46: [       OK ] cuda.Random_XorShift1024_rand_range_overflow (28 ms)
[CUDA-11.8-Clang-15] 46: [ RUN      ] cuda.Random_SFC64_rand_range_overflow
[CUDA-11.8-Clang-15] 46: [       OK ] cuda.Random_SFC64_rand_range_overflow (0 ms)
[CUDA-11.8-Clang-15] 46: [----------] 8 tests from cuda (1396 ms total)
[CUDA-11.8-Clang-15] 46: 
[CUDA-11.8-Clang-15] 46: [----------] Global test environment tear-down
[CUDA-11.8-Clang-15] 46: [==========] 8 tests from 1 test suite ran. (1396 ms total)
[CUDA-11.8-Clang-15] 46: [  PASSED  ] 8 tests.
[CUDA-11.8-Clang-15] 46/65 Test #46: Kokkos_UnitTest_Random .....................................   Passed    1.57 sec
[CUDA-11.8-Clang-15] test 47
[CUDA-11.8-Clang-15]       Start 47: Kokkos_AlgorithmsUnitTest_StdSet_A
[CUDA-11.8-Clang-15] 
[CUDA-11.8-Clang-15] 47: Test command: /var/jenkins/workspace/Kokkos_PR-9650/build/algorithms/unit_tests/Kokkos_AlgorithmsUnitTest_StdSet_A
[CUDA-11.8-Clang-15] 47: Test timeout computed to be: 1500
[CUDA-11.8-Clang-15] 47: Note: Randomizing tests' orders with a seed of 90523 .
[CUDA-11.8-Clang-15] 47: [==========] Running 16 tests from 4 test suites.
[CUDA-11.8-Clang-15] 47: [----------] Global test environment set-up.
[CUDA-11.8-Clang-15] 47: [----------] 1 test from std_algorithms_DeathTest
[CUDA-11.8-Clang-15] 47: [ RUN      ] std_algorithms_DeathTest.expect_no_overlap
[CUDA-11.8-Clang-15] 47: [       OK ] std_algorithms_DeathTest.expect_no_overlap (0 ms)
[CUDA-11.8-Clang-15] 47: [----------] 1 test from std_algorithms_DeathTest (0 ms total)
[CUDA-11.8-Clang-15] 47: 
[CUDA-11.8-Clang-15] 47: [----------] 3 tests from std_algorithms_reducers
[CUDA-11.8-Clang-15] 47: [ RUN      ] std_algorithms_reducers.min_max_first_last_loc
[CUDA-11.8-Clang-15] 47: [       OK ] std_algorithms_reducers.min_max_first_last_loc (0 ms)
[CUDA-11.8-Clang-15] 47: [ RUN      ] std_algorithms_reducers.min_first_loc
[CUDA-11.8-Clang-15] 47: [       OK ] std_algorithms_reducers.min_first_loc (0 ms)
[CUDA-11.8-Clang-15] 47: [ RUN      ] std_algorithms_reducers.max_first_loc
[CUDA-11.8-Clang-15] 47: [       OK ] std_algorithms_reducers.max_first_loc (0 ms)
[CUDA-11.8-Clang-15] 47: [----------] 3 tests from std_algorithms_reducers (0 ms total)
[CUDA-11.8-Clang-15] 47: 
[CUDA-11.8-Clang-15] 47: [----------] 11 tests from random_access_iterator_test
[CUDA-11.8-Clang-15] 47: [ RUN      ] random_access_iterator_test.constructor
[CUDA-11.8-Clang-15] 47: [       OK ] random_access_iterator_test.constructor (0 ms)
[CUDA-11.8-Clang-15] 47: [ RUN      ] random_access_iterator_test.operatorsSet1
[CUDA-11.8-Clang-15] 47: [       OK ] random_access_iterator_test.operatorsSet1 (0 ms)
[CUDA-11.8-Clang-15] 47: [ RUN      ] random_access_iterator_test.dereference
[CUDA-11.8-Clang-15] 47: [       OK ] random_access_iterator_test.dereference (0 ms)
[CUDA-11.8-Clang-15] 47: [ RUN      ] random_access_iterator_test.assignment_operator
[CUDA-11.8-Clang-15] 47: [       OK ] random_access_iterator_test.assignment_operator (0 ms)
[CUDA-11.8-Clang-15] 47: [ RUN      ] random_access_iterator_test.operatorsSet3
[CUDA-11.8-Clang-15] 47: [       OK ] random_access_iterator_test.operatorsSet3 (0 ms)
[CUDA-11.8-Clang-15] 47: [ RUN      ] random_access_iterator_test.operatorsSet4
[CUDA-11.8-Clang-15] 47: [       OK ] random_access_iterator_test.operatorsSet4 (0 ms)
[CUDA-11.8-Clang-15] 47: [ RUN      ] random_access_iterator_test.constructiblity
[CUDA-11.8-Clang-15] 47: [       OK ] random_access_iterator_test.constructiblity (0 ms)
[CUDA-11.8-Clang-15] 47: [ RUN      ] random_access_iterator_test.subscript_operator
[CUDA-11.8-Clang-15] 47: [       OK ] random_access_iterator_test.subscript_operator (0 ms)
[CUDA-11.8-Clang-15] 47: [ RUN      ] random_access_iterator_test.operatorsSet2
[CUDA-11.8-Clang-15] 47: [       OK ] random_access_iterator_test.operatorsSet2 (0 ms)
[CUDA-11.8-Clang-15] 47: [ RUN      ] random_access_iterator_test.distance
[CUDA-11.8-Clang-15] 47: [       OK ] random_access_iterator_test.distance (0 ms)
[CUDA-11.8-Clang-15] 47: [ RUN      ] random_access_iterator_test.traits_helpers
[CUDA-11.8-Clang-15] 47: [       OK ] random_access_iterator_test.traits_helpers (0 ms)
[CUDA-11.8-Clang-15] 47: [----------] 11 tests from random_access_iterator_test (3 ms total)
[CUDA-11.8-Clang-15] 47: 
[CUDA-11.8-Clang-15] 47: [----------] 1 test from std_algorithms
[CUDA-11.8-Clang-15] 47: [ RUN      ] std_algorithms.is_admissible_to_std_algorithms
[CUDA-11.8-Clang-15] 47: [       OK ] std_algorithms.is_admissible_to_std_algorithms (0 ms)
[CUDA-11.8-Clang-15] 47: [----------] 1 test from std_algorithms (0 ms total)
[CUDA-11.8-Clang-15] 47: 
[CUDA-11.8-Clang-15] 47: [----------] Global test environment tear-down
[CUDA-11.8-Clang-15] 47: [==========] 16 tests from 4 test suites ran. (3 ms total)
[CUDA-11.8-Clang-15] 47: [  PASSED  ] 16 tests.
[CUDA-11.8-Clang-15] 47/65 Test #47: Kokkos_AlgorithmsUnitTest_StdSet_A .........................   Passed    0.18 sec
[CUDA-11.8-Clang-15] test 48
[CUDA-11.8-Clang-15]       Start 48: Kokkos_AlgorithmsUnitTest_StdSet_B
[CUDA-11.8-Clang-15] 
[CUDA-11.8-Clang-15] 48: Test command: /var/jenkins/workspace/Kokkos_PR-9650/build/algorithms/unit_tests/Kokkos_AlgorithmsUnitTest_StdSet_B
[CUDA-11.8-Clang-15] 48: Test timeout computed to be: 1500
[CUDA-11.8-Clang-15] 48: Note: Randomizing tests' orders with a seed of 90698 .
[CUDA-11.8-Clang-15] 48: [==========] Running 9 tests from 1 test suite.
[CUDA-11.8-Clang-15] 48: [----------] Global test environment set-up.
[CUDA-11.8-Clang-15] 48: [----------] 9 tests from std_algorithms_min_max_element_test
[CUDA-11.8-Clang-15] 48: [ RUN      ] std_algorithms_min_max_element_test.max_element_empty_range
[CUDA-11.8-Clang-15] 48: [       OK ] std_algorithms_min_max_element_test.max_element_empty_range (0 ms)
[CUDA-11.8-Clang-15] 48: [ RUN      ] std_algorithms_min_max_element_test.min_element_non_trivial_data
[CUDA-11.8-Clang-15] 48: [       OK ] std_algorithms_min_max_element_test.min_element_non_trivial_data (9 ms)
[CUDA-11.8-Clang-15] 48: [ RUN      ] std_algorithms_min_max_element_test.minmax_element_empty_range
[CUDA-11.8-Clang-15] 48: [       OK ] std_algorithms_min_max_element_test.minmax_element_empty_range (0 ms)
[CUDA-11.8-Clang-15] 48: [ RUN      ] std_algorithms_min_max_element_test.max_element_non_trivial_data_custom_comp
[CUDA-11.8-Clang-15] 48: [       OK ] std_algorithms_min_max_element_test.max_element_non_trivial_data_custom_comp (5 ms)
[CUDA-11.8-Clang-15] 48: [ RUN      ] std_algorithms_min_max_element_test.min_element_non_trivial_data_custom_comp
[CUDA-11.8-Clang-15] 48: [       OK ] std_algorithms_min_max_element_test.min_element_non_trivial_data_custom_comp (5 ms)
[CUDA-11.8-Clang-15] 48: [ RUN      ] std_algorithms_min_max_element_test.minmax_element_non_trivial_data_custom_comp
[CUDA-11.8-Clang-15] 48: [       OK ] std_algorithms_min_max_element_test.minmax_element_non_trivial_data_custom_comp (8 ms)
[CUDA-11.8-Clang-15] 48: [ RUN      ] std_algorithms_min_max_element_test.max_element_non_trivial_data
[CUDA-11.8-Clang-15] 48: [       OK ] std_algorithms_min_max_element_test.max_element_non_trivial_data (5 ms)
[CUDA-11.8-Clang-15] 48: [ RUN      ] std_algorithms_min_max_element_test.min_element_empty_range
[CUDA-11.8-Clang-15] 48: [       OK ] std_algorithms_min_max_element_test.min_element_empty_range (0 ms)
[CUDA-11.8-Clang-15] 48: [ RUN      ] std_algorithms_min_max_element_test.minmax_element_non_trivial_data
[CUDA-11.8-Clang-15] 48: [       OK ] std_algorithms_min_max_element_test.minmax_element_non_trivial_data (8 ms)
[CUDA-11.8-Clang-15] 48: [----------] 9 tests from std_algorithms_min_max_element_test (42 ms total)
[CUDA-11.8-Clang-15] 48: 
[CUDA-11.8-Clang-15] 48: [----------] Global test environment tear-down
[CUDA-11.8-Clang-15] 48: [==========] 9 tests from 1 test suite ran. (43 ms total)
[CUDA-11.8-Clang-15] 48: [  PASSED  ] 9 tests.
[CUDA-11.8-Clang-15] 48/65 Test #48: Kokkos_AlgorithmsUnitTest_StdSet_B .........................   Passed    0.22 sec
[CUDA-11.8-Clang-15] test 49
[CUDA-11.8-Clang-15]       Start 49: Kokkos_AlgorithmsUnitTest_StdSet_C
[CUDA-11.8-Clang-15] 
[CUDA-11.8-Clang-15] 49: Test command: /var/jenkins/workspace/Kokkos_PR-9650/build/algorithms/unit_tests/Kokkos_AlgorithmsUnitTest_StdSet_C
[CUDA-11.8-Clang-15] 49: Test timeout computed to be: 1500
[CUDA-11.8-Clang-15] 49: Note: Randomizing tests' orders with a seed of 90912 .
[CUDA-11.8-Clang-15] 49: [==========] Running 17 tests from 10 test suites.
[CUDA-11.8-Clang-15] 49: [----------] Global test environment set-up.
[CUDA-11.8-Clang-15] 49: [----------] 2 tests from std_algorithms_count_test
[CUDA-11.8-Clang-15] 49: [ RUN      ] std_algorithms_count_test.test_extended_range
[CUDA-11.8-Clang-15] 49: /var/jenkins/workspace/Kokkos_PR-9650/algorithms/unit_tests/TestStdAlgorithmsCount.cpp:99: Skipped
[CUDA-11.8-Clang-15] 49: 
[CUDA-11.8-Clang-15] 49: 
[CUDA-11.8-Clang-15] 49: [  SKIPPED ] std_algorithms_count_test.test_extended_range (0 ms)
[CUDA-11.8-Clang-15] 49: [ RUN      ] std_algorithms_count_test.test
[CUDA-11.8-Clang-15] 49: [       OK ] std_algorithms_count_test.test (28 ms)
[CUDA-11.8-Clang-15] 49: [----------] 2 tests from std_algorithms_count_test (28 ms total)
[CUDA-11.8-Clang-15] 49: 
[CUDA-11.8-Clang-15] 49: [----------] 1 test from std_algorithms_mismatch_test
[CUDA-11.8-Clang-15] 49: [ RUN      ] std_algorithms_mismatch_test.test
[CUDA-11.8-Clang-15] 49: [       OK ] std_algorithms_mismatch_test.test (87 ms)
[CUDA-11.8-Clang-15] 49: [----------] 1 test from std_algorithms_mismatch_test (87 ms total)
[CUDA-11.8-Clang-15] 49: 
[CUDA-11.8-Clang-15] 49: [----------] 1 test from std_algorithms_all_any_none_of_test
[CUDA-11.8-Clang-15] 49: [ RUN      ] std_algorithms_all_any_none_of_test.test
[CUDA-11.8-Clang-15] 49: [       OK ] std_algorithms_all_any_none_of_test.test (31 ms)
[CUDA-11.8-Clang-15] 49: [----------] 1 test from std_algorithms_all_any_none_of_test (31 ms total)
[CUDA-11.8-Clang-15] 49: 
[CUDA-11.8-Clang-15] 49: [----------] 1 test from std_algorithms_equal_test
[CUDA-11.8-Clang-15] 49: [ RUN      ] std_algorithms_equal_test.test
[CUDA-11.8-Clang-15] 49: [       OK ] std_algorithms_equal_test.test (15 ms)
[CUDA-11.8-Clang-15] 49: [----------] 1 test from std_algorithms_equal_test (15 ms total)
[CUDA-11.8-Clang-15] 49: 
[CUDA-11.8-Clang-15] 49: [----------] 1 test from std_algorithms_lexicographical_compare_test
[CUDA-11.8-Clang-15] 49: [ RUN      ] std_algorithms_lexicographical_compare_test.test
[CUDA-11.8-Clang-15] 49: [       OK ] std_algorithms_lexicographical_compare_test.test (19 ms)
[CUDA-11.8-Clang-15] 49: [----------] 1 test from std_algorithms_lexicographical_compare_test (19 ms total)
[CUDA-11.8-Clang-15] 49: 
[CUDA-11.8-Clang-15] 49: [----------] 5 tests from std_algorithms_non_mod_seq_ops
[CUDA-11.8-Clang-15] 49: [ RUN      ] std_algorithms_non_mod_seq_ops.find_end
[CUDA-11.8-Clang-15] 49: [       OK ] std_algorithms_non_mod_seq_ops.find_end (381 ms)
[CUDA-11.8-Clang-15] 49: [ RUN      ] std_algorithms_non_mod_seq_ops.search
[CUDA-11.8-Clang-15] 49: [       OK ] std_algorithms_non_mod_seq_ops.search (379 ms)
[CUDA-11.8-Clang-15] 49: [ RUN      ] std_algorithms_non_mod_seq_ops.test_extended_range
[CUDA-11.8-Clang-15] 49: /var/jenkins/workspace/Kokkos_PR-9650/algorithms/unit_tests/TestStdAlgorithmsSearch.cpp:289: Skipped
[CUDA-11.8-Clang-15] 49: 
[CUDA-11.8-Clang-15] 49: 
[CUDA-11.8-Clang-15] 49: [  SKIPPED ] std_algorithms_non_mod_seq_ops.test_extended_range (0 ms)
[CUDA-11.8-Clang-15] 49: [ RUN      ] std_algorithms_non_mod_seq_ops.find_first_of
[CUDA-11.8-Clang-15] 49: [       OK ] std_algorithms_non_mod_seq_ops.find_first_of (380 ms)
[CUDA-11.8-Clang-15] 49: [ RUN      ] std_algorithms_non_mod_seq_ops.search_n
[CUDA-11.8-Clang-15] 49: [       OK ] std_algorithms_non_mod_seq_ops.search_n (269 ms)
[CUDA-11.8-Clang-15] 49: [----------] 5 tests from std_algorithms_non_mod_seq_ops (1410 ms total)
[CUDA-11.8-Clang-15] 49: 
[CUDA-11.8-Clang-15] 49: [----------] 2 tests from std_algorithms_find_test
[CUDA-11.8-Clang-15] 49: [ RUN      ] std_algorithms_find_test.test
[CUDA-11.8-Clang-15] 49: [       OK ] std_algorithms_find_test.test (30 ms)
[CUDA-11.8-Clang-15] 49: [ RUN      ] std_algorithms_find_test.test_extended_range
[CUDA-11.8-Clang-15] 49: /var/jenkins/workspace/Kokkos_PR-9650/algorithms/unit_tests/TestStdAlgorithmsFind.cpp:148: Skipped
[CUDA-11.8-Clang-15] 49: 
[CUDA-11.8-Clang-15] 49: 
[CUDA-11.8-Clang-15] 49: [  SKIPPED ] std_algorithms_find_test.test_extended_range (0 ms)
[CUDA-11.8-Clang-15] 49: [----------] 2 tests from std_algorithms_find_test (30 ms total)
[CUDA-11.8-Clang-15] 49: 
[CUDA-11.8-Clang-15] 49: [----------] 1 test from std_algorithms_mod_seq_ops
[CUDA-11.8-Clang-15] 49: [ RUN      ] std_algorithms_mod_seq_ops.move_backward
[CUDA-11.8-Clang-15] 49: [       OK ] std_algorithms_mod_seq_ops.move_backward (65 ms)
[CUDA-11.8-Clang-15] 49: [----------] 1 test from std_algorithms_mod_seq_ops (65 ms total)
[CUDA-11.8-Clang-15] 49: 
[CUDA-11.8-Clang-15] 49: [----------] 2 tests from std_algorithms_for_each_test
[CUDA-11.8-Clang-15] 49: [ RUN      ] std_algorithms_for_each_test.test_extended_range
[CUDA-11.8-Clang-15] 49: /var/jenkins/workspace/Kokkos_PR-9650/algorithms/unit_tests/TestStdAlgorithmsForEach.cpp:126: Skipped
[CUDA-11.8-Clang-15] 49: 
[CUDA-11.8-Clang-15] 49: 
[CUDA-11.8-Clang-15] 49: [  SKIPPED ] std_algorithms_for_each_test.test_extended_range (0 ms)
[CUDA-11.8-Clang-15] 49: [ RUN      ] std_algorithms_for_each_test.test
[CUDA-11.8-Clang-15] 49: [       OK ] std_algorithms_for_each_test.test (62 ms)
[CUDA-11.8-Clang-15] 49: [----------] 2 tests from std_algorithms_for_each_test (62 ms total)
[CUDA-11.8-Clang-15] 49: 
[CUDA-11.8-Clang-15] 49: [----------] 1 test from std_algorithms_nonmod_seq_ops
[CUDA-11.8-Clang-15] 49: [ RUN      ] std_algorithms_nonmod_seq_ops.adjacent_find
[CUDA-11.8-Clang-15] 49: [       OK ] std_algorithms_nonmod_seq_ops.adjacent_find (68 ms)
[CUDA-11.8-Clang-15] 49: [----------] 1 test from std_algorithms_nonmod_seq_ops (68 ms total)
[CUDA-11.8-Clang-15] 49: 
[CUDA-11.8-Clang-15] 49: [----------] Global test environment tear-down
[CUDA-11.8-Clang-15] 49: [==========] 17 tests from 10 test suites ran. (1820 ms total)
[CUDA-11.8-Clang-15] 49: [  PASSED  ] 13 tests.
[CUDA-11.8-Clang-15] 49: [  SKIPPED ] 4 tests, listed below:
[CUDA-11.8-Clang-15] 49: [  SKIPPED ] std_algorithms_for_each_test.test_extended_range
[CUDA-11.8-Clang-15] 49: [  SKIPPED ] std_algorithms_find_test.test_extended_range
[CUDA-11.8-Clang-15] 49: [  SKIPPED ] std_algorithms_non_mod_seq_ops.test_extended_range
[CUDA-11.8-Clang-15] 49: [  SKIPPED ] std_algorithms_count_test.test_extended_range
[CUDA-11.8-Clang-15] 49/65 Test #49: Kokkos_AlgorithmsUnitTest_StdSet_C .........................   Passed    1.99 sec
[CUDA-11.8-Clang-15] test 50
[CUDA-11.8-Clang-15]       Start 50: Kokkos_AlgorithmsUnitTest_StdSet_D
[CUDA-11.8-Clang-15] 
[CUDA-11.8-Clang-15] 50: Test command: /var/jenkins/workspace/Kokkos_PR-9650/build/algorithms/unit_tests/Kokkos_AlgorithmsUnitTest_StdSet_D
[CUDA-11.8-Clang-15] 50: Test timeout computed to be: 1500
[CUDA-11.8-Clang-15] 50: Note: Randomizing tests' orders with a seed of 92907 .
[CUDA-11.8-Clang-15] 50: [==========] Running 31 tests from 5 test suites.
[CUDA-11.8-Clang-15] 50: [----------] Global test environment set-up.
[CUDA-11.8-Clang-15] 50: [----------] 3 tests from std_algorithms_mod_ops_test
[CUDA-11.8-Clang-15] 50: [ RUN      ] std_algorithms_mod_ops_test.iter_swap_static_view
[CUDA-11.8-Clang-15] 50: [       OK ] std_algorithms_mod_ops_test.iter_swap_static_view (1 ms)
[CUDA-11.8-Clang-15] 50: [ RUN      ] std_algorithms_mod_ops_test.move_within_parfor
[CUDA-11.8-Clang-15] 50: [       OK ] std_algorithms_mod_ops_test.move_within_parfor (0 ms)
[CUDA-11.8-Clang-15] 50: [ RUN      ] std_algorithms_mod_ops_test.move
[CUDA-11.8-Clang-15] 50: [       OK ] std_algorithms_mod_ops_test.move (0 ms)
[CUDA-11.8-Clang-15] 50: [----------] 3 tests from std_algorithms_mod_ops_test (1 ms total)
[CUDA-11.8-Clang-15] 50: 
[CUDA-11.8-Clang-15] 50: [----------] 1 test from std_algorithms_modseq_test
[CUDA-11.8-Clang-15] 50: [ RUN      ] std_algorithms_modseq_test.reverse
[CUDA-11.8-Clang-15] 50: [       OK ] std_algorithms_modseq_test.reverse (63 ms)
[CUDA-11.8-Clang-15] 50: [----------] 1 test from std_algorithms_modseq_test (63 ms total)
[CUDA-11.8-Clang-15] 50: 
[CUDA-11.8-Clang-15] 50: [----------] 11 tests from std_algorithms_mod_seq_ops
[CUDA-11.8-Clang-15] 50: [ RUN      ] std_algorithms_mod_seq_ops.shift_right
[CUDA-11.8-Clang-15] 50: [       OK ] std_algorithms_mod_seq_ops.shift_right (1376 ms)
[CUDA-11.8-Clang-15] 50: [ RUN      ] std_algorithms_mod_seq_ops.unique
[CUDA-11.8-Clang-15] 50: [       OK ] std_algorithms_mod_seq_ops.unique (86 ms)
[CUDA-11.8-Clang-15] 50: [ RUN      ] std_algorithms_mod_seq_ops.copy_if
[CUDA-11.8-Clang-15] 50: [       OK ] std_algorithms_mod_seq_ops.copy_if (36 ms)
[CUDA-11.8-Clang-15] 50: [ RUN      ] std_algorithms_mod_seq_ops.shift_left
[CUDA-11.8-Clang-15] 50: [       OK ] std_algorithms_mod_seq_ops.shift_left (1367 ms)
[CUDA-11.8-Clang-15] 50: [ RUN      ] std_algorithms_mod_seq_ops.remove_copy
[CUDA-11.8-Clang-15] 50: [       OK ] std_algorithms_mod_seq_ops.remove_copy (144 ms)
[CUDA-11.8-Clang-15] 50: [ RUN      ] std_algorithms_mod_seq_ops.rotate_copy
[CUDA-11.8-Clang-15] 50: [       OK ] std_algorithms_mod_seq_ops.rotate_copy (509 ms)
[CUDA-11.8-Clang-15] 50: [ RUN      ] std_algorithms_mod_seq_ops.rotate
[CUDA-11.8-Clang-15] 50: [       OK ] std_algorithms_mod_seq_ops.rotate (1229 ms)
[CUDA-11.8-Clang-15] 50: [ RUN      ] std_algorithms_mod_seq_ops.remove_copy_if
[CUDA-11.8-Clang-15] 50: [       OK ] std_algorithms_mod_seq_ops.remove_copy_if (40 ms)
[CUDA-11.8-Clang-15] 50: [ RUN      ] std_algorithms_mod_seq_ops.remove_if
[CUDA-11.8-Clang-15] 50: [       OK ] std_algorithms_mod_seq_ops.remove_if (38 ms)
[CUDA-11.8-Clang-15] 50: [ RUN      ] std_algorithms_mod_seq_ops.remove
[CUDA-11.8-Clang-15] 50: [       OK ] std_algorithms_mod_seq_ops.remove (31 ms)
[CUDA-11.8-Clang-15] 50: [ RUN      ] std_algorithms_mod_seq_ops.unique_copy
[CUDA-11.8-Clang-15] 50: [       OK ] std_algorithms_mod_seq_ops.unique_copy (55 ms)
[CUDA-11.8-Clang-15] 50: [----------] 11 tests from std_algorithms_mod_seq_ops (4916 ms total)
[CUDA-11.8-Clang-15] 50: 
[CUDA-11.8-Clang-15] 50: [----------] 12 tests from std_algorithms_mod_seq_ops_test
[CUDA-11.8-Clang-15] 50: [ RUN      ] std_algorithms_mod_seq_ops_test.copy_view
[CUDA-11.8-Clang-15] 50: [       OK ] std_algorithms_mod_seq_ops_test.copy_view (1 ms)
[CUDA-11.8-Clang-15] 50: [ RUN      ] std_algorithms_mod_seq_ops_test.copy_backward
[CUDA-11.8-Clang-15] 50: [       OK ] std_algorithms_mod_seq_ops_test.copy_backward (0 ms)
[CUDA-11.8-Clang-15] 50: [ RUN      ] std_algorithms_mod_seq_ops_test.copy
[CUDA-11.8-Clang-15] 50: [       OK ] std_algorithms_mod_seq_ops_test.copy (0 ms)
[CUDA-11.8-Clang-15] 50: [ RUN      ] std_algorithms_mod_seq_ops_test.fill
[CUDA-11.8-Clang-15] 50: [       OK ] std_algorithms_mod_seq_ops_test.fill (0 ms)
[CUDA-11.8-Clang-15] 50: [ RUN      ] std_algorithms_mod_seq_ops_test.reverse_copy
[CUDA-11.8-Clang-15] 50: [       OK ] std_algorithms_mod_seq_ops_test.reverse_copy (0 ms)
[CUDA-11.8-Clang-15] 50: [ RUN      ] std_algorithms_mod_seq_ops_test.swap_ranges
[CUDA-11.8-Clang-15] 50: [       OK ] std_algorithms_mod_seq_ops_test.swap_ranges (0 ms)
[CUDA-11.8-Clang-15] 50: [ RUN      ] std_algorithms_mod_seq_ops_test.transform_from_fixture_binary_op
[CUDA-11.8-Clang-15] 50: [       OK ] std_algorithms_mod_seq_ops_test.transform_from_fixture_binary_op (0 ms)
[CUDA-11.8-Clang-15] 50: [ RUN      ] std_algorithms_mod_seq_ops_test.generate
[CUDA-11.8-Clang-15] 50: [       OK ] std_algorithms_mod_seq_ops_test.generate (0 ms)
[CUDA-11.8-Clang-15] 50: [ RUN      ] std_algorithms_mod_seq_ops_test.transform_from_fixture_unary_op
[CUDA-11.8-Clang-15] 50: [       OK ] std_algorithms_mod_seq_ops_test.transform_from_fixture_unary_op (0 ms)
[CUDA-11.8-Clang-15] 50: [ RUN      ] std_algorithms_mod_seq_ops_test.fill_n
[CUDA-11.8-Clang-15] 50: [       OK ] std_algorithms_mod_seq_ops_test.fill_n (0 ms)
[CUDA-11.8-Clang-15] 50: [ RUN      ] std_algorithms_mod_seq_ops_test.generate_n
[CUDA-11.8-Clang-15] 50: [       OK ] std_algorithms_mod_seq_ops_test.generate_n (0 ms)
[CUDA-11.8-Clang-15] 50: [ RUN      ] std_algorithms_mod_seq_ops_test.copy_n
[CUDA-11.8-Clang-15] 50: [       OK ] std_algorithms_mod_seq_ops_test.copy_n (0 ms)
[CUDA-11.8-Clang-15] 50: [----------] 12 tests from std_algorithms_mod_seq_ops_test (4 ms total)
[CUDA-11.8-Clang-15] 50: 
[CUDA-11.8-Clang-15] 50: [----------] 4 tests from std_algorithms_replace_ops_test
[CUDA-11.8-Clang-15] 50: [ RUN      ] std_algorithms_replace_ops_test.replace
[CUDA-11.8-Clang-15] 50: [       OK ] std_algorithms_replace_ops_test.replace (30 ms)
[CUDA-11.8-Clang-15] 50: [ RUN      ] std_algorithms_replace_ops_test.replace_if
[CUDA-11.8-Clang-15] 50: [       OK ] std_algorithms_replace_ops_test.replace_if (112 ms)
[CUDA-11.8-Clang-15] 50: [ RUN      ] std_algorithms_replace_ops_test.replace_copy_if
[CUDA-11.8-Clang-15] 50: [       OK ] std_algorithms_replace_ops_test.replace_copy_if (54 ms)
[CUDA-11.8-Clang-15] 50: [ RUN      ] std_algorithms_replace_ops_test.replace_copy
[CUDA-11.8-Clang-15] 50: [       OK ] std_algorithms_replace_ops_test.replace_copy (57 ms)
[CUDA-11.8-Clang-15] 50: [----------] 4 tests from std_algorithms_replace_ops_test (255 ms total)
[CUDA-11.8-Clang-15] 50: 
[CUDA-11.8-Clang-15] 50: [----------] Global test environment tear-down
[CUDA-11.8-Clang-15] 50: [==========] 31 tests from 5 test suites ran. (5240 ms total)
[CUDA-11.8-Clang-15] 50: [  PASSED  ] 31 tests.
[CUDA-11.8-Clang-15] 50/65 Test #50: Kokkos_AlgorithmsUnitTest_StdSet_D .........................   Passed    5.42 sec
[CUDA-11.8-Clang-15] test 51
[CUDA-11.8-Clang-15]       Start 51: Kokkos_AlgorithmsUnitTest_StdSet_E
[CUDA-11.8-Clang-15] 
[CUDA-11.8-Clang-15] 51: Test command: /var/jenkins/workspace/Kokkos_PR-9650/build/algorithms/unit_tests/Kokkos_AlgorithmsUnitTest_StdSet_E
[CUDA-11.8-Clang-15] 51: Test timeout computed to be: 1500
[CUDA-11.8-Clang-15] 51: Note: Randomizing tests' orders with a seed of 98327 .
[CUDA-11.8-Clang-15] 51: [==========] Running 29 tests from 7 test suites.
[CUDA-11.8-Clang-15] 51: [----------] Global test environment set-up.
[CUDA-11.8-Clang-15] 51: [----------] 2 tests from std_algorithms_sorting_ops_test
[CUDA-11.8-Clang-15] 51: [ RUN      ] std_algorithms_sorting_ops_test.is_sorted_until
[CUDA-11.8-Clang-15] 51: [       OK ] std_algorithms_sorting_ops_test.is_sorted_until (15 ms)
[CUDA-11.8-Clang-15] 51: [ RUN      ] std_algorithms_sorting_ops_test.is_sorted
[CUDA-11.8-Clang-15] 51: [       OK ] std_algorithms_sorting_ops_test.is_sorted (9 ms)
[CUDA-11.8-Clang-15] 51: [----------] 2 tests from std_algorithms_sorting_ops_test (24 ms total)
[CUDA-11.8-Clang-15] 51: 
[CUDA-11.8-Clang-15] 51: [----------] 4 tests from std_algorithms_partitioning_test
[CUDA-11.8-Clang-15] 51: [ RUN      ] std_algorithms_partitioning_test.is_partitioned_trivial
[CUDA-11.8-Clang-15] 51: [       OK ] std_algorithms_partitioning_test.is_partitioned_trivial (0 ms)
[CUDA-11.8-Clang-15] 51: [ RUN      ] std_algorithms_partitioning_test.is_partitioned_accepting_view
[CUDA-11.8-Clang-15] 51: [       OK ] std_algorithms_partitioning_test.is_partitioned_accepting_view (1 ms)
[CUDA-11.8-Clang-15] 51: [ RUN      ] std_algorithms_partitioning_test.is_partitioned_accepting_iterators
[CUDA-11.8-Clang-15] 51: [       OK ] std_algorithms_partitioning_test.is_partitioned_accepting_iterators (0 ms)
[CUDA-11.8-Clang-15] 51: [ RUN      ] std_algorithms_partitioning_test.partition_point
[CUDA-11.8-Clang-15] 51: [       OK ] std_algorithms_partitioning_test.partition_point (0 ms)
[CUDA-11.8-Clang-15] 51: [----------] 4 tests from std_algorithms_partitioning_test (3 ms total)
[CUDA-11.8-Clang-15] 51: 
[CUDA-11.8-Clang-15] 51: [----------] 1 test from std_algorithms_transform_ops_test
[CUDA-11.8-Clang-15] 51: [ RUN      ] std_algorithms_transform_ops_test.transform_unary_op
[CUDA-11.8-Clang-15] 51: [       OK ] std_algorithms_transform_ops_test.transform_unary_op (49 ms)
[CUDA-11.8-Clang-15] 51: [----------] 1 test from std_algorithms_transform_ops_test (49 ms total)
[CUDA-11.8-Clang-15] 51: 
[CUDA-11.8-Clang-15] 51: [----------] 12 tests from std_algorithms_numerics_test
[CUDA-11.8-Clang-15] 51: [ RUN      ] std_algorithms_numerics_test.transform_reduce_default_functors_using_custom_value_type
[CUDA-11.8-Clang-15] 51: [       OK ] std_algorithms_numerics_test.transform_reduce_default_functors_using_custom_value_type (3 ms)
[CUDA-11.8-Clang-15] 51: [ RUN      ] std_algorithms_numerics_test.reduce_default_functors_overloadB_using_custom_value_type
[CUDA-11.8-Clang-15] 51: [       OK ] std_algorithms_numerics_test.reduce_default_functors_overloadB_using_custom_value_type (0 ms)
[CUDA-11.8-Clang-15] 51: [ RUN      ] std_algorithms_numerics_test.reduce_default_functors_overloadA_using_custom_value_type
[CUDA-11.8-Clang-15] 51: [       OK ] std_algorithms_numerics_test.reduce_default_functors_overloadA_using_custom_value_type (0 ms)
[CUDA-11.8-Clang-15] 51: [ RUN      ] std_algorithms_numerics_test.transform_reduce_custom_functors_overloadB_using_custom_value_type
[CUDA-11.8-Clang-15] 51: [       OK ] std_algorithms_numerics_test.transform_reduce_custom_functors_overloadB_using_custom_value_type (0 ms)
[CUDA-11.8-Clang-15] 51: [ RUN      ] std_algorithms_numerics_test.transform_reduce_custom_functors_overloadA_using_custom_value_type
[CUDA-11.8-Clang-15] 51: [       OK ] std_algorithms_numerics_test.transform_reduce_custom_functors_overloadA_using_custom_value_type (0 ms)
[CUDA-11.8-Clang-15] 51: [ RUN      ] std_algorithms_numerics_test.reduce_default_functors_overloadB_using_pod_value_type
[CUDA-11.8-Clang-15] 51: [       OK ] std_algorithms_numerics_test.reduce_default_functors_overloadB_using_pod_value_type (0 ms)
[CUDA-11.8-Clang-15] 51: [ RUN      ] std_algorithms_numerics_test.transform_reduce_custom_functors_overloadB_using_pod_value_type
[CUDA-11.8-Clang-15] 51: [       OK ] std_algorithms_numerics_test.transform_reduce_custom_functors_overloadB_using_pod_value_type (0 ms)
[CUDA-11.8-Clang-15] 51: [ RUN      ] std_algorithms_numerics_test.reduce_custom_functors_using_custom_value_type
[CUDA-11.8-Clang-15] 51: [       OK ] std_algorithms_numerics_test.reduce_custom_functors_using_custom_value_type (0 ms)
[CUDA-11.8-Clang-15] 51: [ RUN      ] std_algorithms_numerics_test.transform_reduce_custom_functors_overloadA_using_pod_value_type
[CUDA-11.8-Clang-15] 51: [       OK ] std_algorithms_numerics_test.transform_reduce_custom_functors_overloadA_using_pod_value_type (0 ms)
[CUDA-11.8-Clang-15] 51: [ RUN      ] std_algorithms_numerics_test.transform_reduce_default_functors_using_pod_value_type
[CUDA-11.8-Clang-15] 51: [       OK ] std_algorithms_numerics_test.transform_reduce_default_functors_using_pod_value_type (0 ms)
[CUDA-11.8-Clang-15] 51: [ RUN      ] std_algorithms_numerics_test.reduce_default_functors_overloadA_using_pod_value_type
[CUDA-11.8-Clang-15] 51: [       OK ] std_algorithms_numerics_test.reduce_default_functors_overloadA_using_pod_value_type (0 ms)
[CUDA-11.8-Clang-15] 51: [ RUN      ] std_algorithms_numerics_test.reduce_custom_functors_using_pod_value_type
[CUDA-11.8-Clang-15] 51: [       OK ] std_algorithms_numerics_test.reduce_custom_functors_using_pod_value_type (0 ms)
[CUDA-11.8-Clang-15] 51: [----------] 12 tests from std_algorithms_numerics_test (10 ms total)
[CUDA-11.8-Clang-15] 51: 
[CUDA-11.8-Clang-15] 51: [----------] 1 test from std_algorithms_partitioning_ops
[CUDA-11.8-Clang-15] 51: [ RUN      ] std_algorithms_partitioning_ops.partition_copy
[CUDA-11.8-Clang-15] 51: [       OK ] std_algorithms_partitioning_ops.partition_copy (22 ms)
[CUDA-11.8-Clang-15] 51: [----------] 1 test from std_algorithms_partitioning_ops (22 ms total)
[CUDA-11.8-Clang-15] 51: 
[CUDA-11.8-Clang-15] 51: [----------] 8 tests from std_algorithms_numeric_ops_test
[CUDA-11.8-Clang-15] 51: [ RUN      ] std_algorithms_numeric_ops_test.transform_exclusive_scan
[CUDA-11.8-Clang-15] 51: [       OK ] std_algorithms_numeric_ops_test.transform_exclusive_scan (175 ms)
[CUDA-11.8-Clang-15] 51: [ RUN      ] std_algorithms_numeric_ops_test.inclusive_scan_functor
[CUDA-11.8-Clang-15] 51: [       OK ] std_algorithms_numeric_ops_test.inclusive_scan_functor (0 ms)
[CUDA-11.8-Clang-15] 51: [ RUN      ] std_algorithms_numeric_ops_test.exclusive_scan
[CUDA-11.8-Clang-15] 51: [       OK ] std_algorithms_numeric_ops_test.exclusive_scan (596 ms)
[CUDA-11.8-Clang-15] 51: [ RUN      ] std_algorithms_numeric_ops_test.transform_inclusive_scan_functor
[CUDA-11.8-Clang-15] 51: [       OK ] std_algorithms_numeric_ops_test.transform_inclusive_scan_functor (0 ms)
[CUDA-11.8-Clang-15] 51: [ RUN      ] std_algorithms_numeric_ops_test.inclusive_scan
[CUDA-11.8-Clang-15] 51: [       OK ] std_algorithms_numeric_ops_test.inclusive_scan (527 ms)
[CUDA-11.8-Clang-15] 51: [ RUN      ] std_algorithms_numeric_ops_test.transform_inclusive_scan
[CUDA-11.8-Clang-15] 51: [       OK ] std_algorithms_numeric_ops_test.transform_inclusive_scan (295 ms)
[CUDA-11.8-Clang-15] 51: [ RUN      ] std_algorithms_numeric_ops_test.transform_exclusive_scan_functor
[CUDA-11.8-Clang-15] 51: [       OK ] std_algorithms_numeric_ops_test.transform_exclusive_scan_functor (0 ms)
[CUDA-11.8-Clang-15] 51: [ RUN      ] std_algorithms_numeric_ops_test.exclusive_scan_functor
[CUDA-11.8-Clang-15] 51: [       OK ] std_algorithms_numeric_ops_test.exclusive_scan_functor (0 ms)
[CUDA-11.8-Clang-15] 51: [----------] 8 tests from std_algorithms_numeric_ops_test (1595 ms total)
[CUDA-11.8-Clang-15] 51: 
[CUDA-11.8-Clang-15] 51: [----------] 1 test from std_algorithms_numerics_ops_test
[CUDA-11.8-Clang-15] 51: [ RUN      ] std_algorithms_numerics_ops_test.adjecent_difference
[CUDA-11.8-Clang-15] 51: [       OK ] std_algorithms_numerics_ops_test.adjecent_difference (126 ms)
[CUDA-11.8-Clang-15] 51: [----------] 1 test from std_algorithms_numerics_ops_test (126 ms total)
[CUDA-11.8-Clang-15] 51: 
[CUDA-11.8-Clang-15] 51: [----------] Global test environment tear-down
[CUDA-11.8-Clang-15] 51: [==========] 29 tests from 7 test suites ran. (1832 ms total)
[CUDA-11.8-Clang-15] 51: [  PASSED  ] 29 tests.
[CUDA-11.8-Clang-15] 51/65 Test #51: Kokkos_AlgorithmsUnitTest_StdSet_E .........................   Passed    2.01 sec
[CUDA-11.8-Clang-15] test 52
[CUDA-11.8-Clang-15]       Start 52: Kokkos_AlgorithmsUnitTest_StdSet_Team_A
[CUDA-11.8-Clang-15] 
[CUDA-11.8-Clang-15] 52: Test command: /var/jenkins/workspace/Kokkos_PR-9650/build/algorithms/unit_tests/Kokkos_AlgorithmsUnitTest_StdSet_Team_A
[CUDA-11.8-Clang-15] 52: Test timeout computed to be: 1500
[CUDA-11.8-Clang-15] 52: Note: Randomizing tests' orders with a seed of 337 .
[CUDA-11.8-Clang-15] 52: [==========] Running 12 tests from 7 test suites.
[CUDA-11.8-Clang-15] 52: [----------] Global test environment set-up.
[CUDA-11.8-Clang-15] 52: [----------] 1 test from std_algorithms_for_each_n_team_test
[CUDA-11.8-Clang-15] 52: [ RUN      ] std_algorithms_for_each_n_team_test.test
[CUDA-11.8-Clang-15] 52: [       OK ] std_algorithms_for_each_n_team_test.test (450 ms)
[CUDA-11.8-Clang-15] 52: [----------] 1 test from std_algorithms_for_each_n_team_test (451 ms total)
[CUDA-11.8-Clang-15] 52: 
[CUDA-11.8-Clang-15] 52: [----------] 1 test from std_algorithms_for_each_team_test
[CUDA-11.8-Clang-15] 52: [ RUN      ] std_algorithms_for_each_team_test.test
[CUDA-11.8-Clang-15] 52: [       OK ] std_algorithms_for_each_team_test.test (400 ms)
[CUDA-11.8-Clang-15] 52: [----------] 1 test from std_algorithms_for_each_team_test (400 ms total)
[CUDA-11.8-Clang-15] 52: 
[CUDA-11.8-Clang-15] 52: [----------] 1 test from std_algorithms_count_if_team_test
[CUDA-11.8-Clang-15] 52: [ RUN      ] std_algorithms_count_if_team_test.test
[CUDA-11.8-Clang-15] 52: [       OK ] std_algorithms_count_if_team_test.test (212 ms)
[CUDA-11.8-Clang-15] 52: [----------] 1 test from std_algorithms_count_if_team_test (212 ms total)
[CUDA-11.8-Clang-15] 52: 
[CUDA-11.8-Clang-15] 52: [----------] 3 tests from std_algorithms_lexicographical_compare_team_test
[CUDA-11.8-Clang-15] 52: [ RUN      ] std_algorithms_lexicographical_compare_team_test.views_are_equal
[CUDA-11.8-Clang-15] 52: [       OK ] std_algorithms_lexicographical_compare_team_test.views_are_equal (470 ms)
[CUDA-11.8-Clang-15] 52: [ RUN      ] std_algorithms_lexicographical_compare_team_test.first_view_is_less
[CUDA-11.8-Clang-15] 52: [       OK ] std_algorithms_lexicographical_compare_team_test.first_view_is_less (404 ms)
[CUDA-11.8-Clang-15] 52: [ RUN      ] std_algorithms_lexicographical_compare_team_test.first_view_is_greater
[CUDA-11.8-Clang-15] 52: [       OK ] std_algorithms_lexicographical_compare_team_test.first_view_is_greater (406 ms)
[CUDA-11.8-Clang-15] 52: [----------] 3 tests from std_algorithms_lexicographical_compare_team_test (1282 ms total)
[CUDA-11.8-Clang-15] 52: 
[CUDA-11.8-Clang-15] 52: [----------] 2 tests from std_algorithms_adjacent_find_team_test
[CUDA-11.8-Clang-15] 52: [ RUN      ] std_algorithms_adjacent_find_team_test.two_consecutive_equal_elements_might_exist
[CUDA-11.8-Clang-15] 52: [       OK ] std_algorithms_adjacent_find_team_test.two_consecutive_equal_elements_might_exist (368 ms)
[CUDA-11.8-Clang-15] 52: [ RUN      ] std_algorithms_adjacent_find_team_test.two_consecutive_equal_elements_exist
[CUDA-11.8-Clang-15] 52: [       OK ] std_algorithms_adjacent_find_team_test.two_consecutive_equal_elements_exist (362 ms)
[CUDA-11.8-Clang-15] 52: [----------] 2 tests from std_algorithms_adjacent_find_team_test (730 ms total)
[CUDA-11.8-Clang-15] 52: 
[CUDA-11.8-Clang-15] 52: [----------] 2 tests from std_algorithms_mismatch_team_test
[CUDA-11.8-Clang-15] 52: [ RUN      ] std_algorithms_mismatch_team_test.views_are_not_equal
[CUDA-11.8-Clang-15] 52: [       OK ] std_algorithms_mismatch_team_test.views_are_not_equal (537 ms)
[CUDA-11.8-Clang-15] 52: [ RUN      ] std_algorithms_mismatch_team_test.views_are_equal
[CUDA-11.8-Clang-15] 52: [       OK ] std_algorithms_mismatch_team_test.views_are_equal (491 ms)
[CUDA-11.8-Clang-15] 52: [----------] 2 tests from std_algorithms_mismatch_team_test (1029 ms total)
[CUDA-11.8-Clang-15] 52: 
[CUDA-11.8-Clang-15] 52: [----------] 2 tests from std_algorithms_count_team_test
[CUDA-11.8-Clang-15] 52: [ RUN      ] std_algorithms_count_team_test.count_returns_nonzero
[CUDA-11.8-Clang-15] 52: [       OK ] std_algorithms_count_team_test.count_returns_nonzero (172 ms)
[CUDA-11.8-Clang-15] 52: [ RUN      ] std_algorithms_count_team_test.count_returns_zero
[CUDA-11.8-Clang-15] 52: [       OK ] std_algorithms_count_team_test.count_returns_zero (152 ms)
[CUDA-11.8-Clang-15] 52: [----------] 2 tests from std_algorithms_count_team_test (324 ms total)
[CUDA-11.8-Clang-15] 52: 
[CUDA-11.8-Clang-15] 52: [----------] Global test environment tear-down
[CUDA-11.8-Clang-15] 52: [==========] 12 tests from 7 test suites ran. (4430 ms total)
[CUDA-11.8-Clang-15] 52: [  PASSED  ] 12 tests.
[CUDA-11.8-Clang-15] 52/65 Test #52: Kokkos_AlgorithmsUnitTest_StdSet_Team_A ....................   Passed    4.60 sec
[CUDA-11.8-Clang-15] test 53
[CUDA-11.8-Clang-15]       Start 53: Kokkos_AlgorithmsUnitTest_StdSet_Team_B
[CUDA-11.8-Clang-15] 
[CUDA-11.8-Clang-15] 53: Test command: /var/jenkins/workspace/Kokkos_PR-9650/build/algorithms/unit_tests/Kokkos_AlgorithmsUnitTest_StdSet_Team_B
[CUDA-11.8-Clang-15] 53: Test timeout computed to be: 1500
[CUDA-11.8-Clang-15] 53: Note: Randomizing tests' orders with a seed of 4945 .
[CUDA-11.8-Clang-15] 53: [==========] Running 8 tests from 4 test suites.
[CUDA-11.8-Clang-15] 53: [----------] Global test environment set-up.
[CUDA-11.8-Clang-15] 53: [----------] 2 tests from std_algorithms_search_team_test
[CUDA-11.8-Clang-15] 53: [ RUN      ] std_algorithms_search_team_test.sequences_do_not_exist
[CUDA-11.8-Clang-15] 53: [       OK ] std_algorithms_search_team_test.sequences_do_not_exist (380 ms)
[CUDA-11.8-Clang-15] 53: [ RUN      ] std_algorithms_search_team_test.sequences_exist
[CUDA-11.8-Clang-15] 53: [       OK ] std_algorithms_search_team_test.sequences_exist (344 ms)
[CUDA-11.8-Clang-15] 53: [----------] 2 tests from std_algorithms_search_team_test (725 ms total)
[CUDA-11.8-Clang-15] 53: 
[CUDA-11.8-Clang-15] 53: [----------] 2 tests from std_algorithms_equal_team_test
[CUDA-11.8-Clang-15] 53: [ RUN      ] std_algorithms_equal_team_test.views_are_equal
[CUDA-11.8-Clang-15] 53: [       OK ] std_algorithms_equal_team_test.views_are_equal (731 ms)
[CUDA-11.8-Clang-15] 53: [ RUN      ] std_algorithms_equal_team_test.views_are_not_equal
[CUDA-11.8-Clang-15] 53: [       OK ] std_algorithms_equal_team_test.views_are_not_equal (805 ms)
[CUDA-11.8-Clang-15] 53: [----------] 2 tests from std_algorithms_equal_team_test (1536 ms total)
[CUDA-11.8-Clang-15] 53: 
[CUDA-11.8-Clang-15] 53: [----------] 2 tests from std_algorithms_find_first_of_team_test
[CUDA-11.8-Clang-15] 53: [ RUN      ] std_algorithms_find_first_of_team_test.sequences_do_not_exist
[CUDA-11.8-Clang-15] 53: [       OK ] std_algorithms_find_first_of_team_test.sequences_do_not_exist (605 ms)
[CUDA-11.8-Clang-15] 53: [ RUN      ] std_algorithms_find_first_of_team_test.sequences_exist
[CUDA-11.8-Clang-15] 53: [       OK ] std_algorithms_find_first_of_team_test.sequences_exist (396 ms)
[CUDA-11.8-Clang-15] 53: [----------] 2 tests from std_algorithms_find_first_of_team_test (1001 ms total)
[CUDA-11.8-Clang-15] 53: 
[CUDA-11.8-Clang-15] 53: [----------] 2 tests from std_algorithms_find_end_team_test
[CUDA-11.8-Clang-15] 53: [ RUN      ] std_algorithms_find_end_team_test.sequences_exist
[CUDA-11.8-Clang-15] 53: [       OK ] std_algorithms_find_end_team_test.sequences_exist (477 ms)
[CUDA-11.8-Clang-15] 53: [ RUN      ] std_algorithms_find_end_team_test.sequences_do_not_exist
[CUDA-11.8-Clang-15] 53: [       OK ] std_algorithms_find_end_team_test.sequences_do_not_exist (450 ms)
[CUDA-11.8-Clang-15] 53: [----------] 2 tests from std_algorithms_find_end_team_test (927 ms total)
[CUDA-11.8-Clang-15] 53: 
[CUDA-11.8-Clang-15] 53: [----------] Global test environment tear-down
[CUDA-11.8-Clang-15] 53: [==========] 8 tests from 4 test suites ran. (4191 ms total)
[CUDA-11.8-Clang-15] 53: [  PASSED  ] 8 tests.
[CUDA-11.8-Clang-15] 53/65 Test #53: Kokkos_AlgorithmsUnitTest_StdSet_Team_B ....................   Passed    4.37 sec
[CUDA-11.8-Clang-15] test 54
[CUDA-11.8-Clang-15]       Start 54: Kokkos_AlgorithmsUnitTest_StdSet_Team_C
[CUDA-11.8-Clang-15] 
[CUDA-11.8-Clang-15] 54: Test command: /var/jenkins/workspace/Kokkos_PR-9650/build/algorithms/unit_tests/Kokkos_AlgorithmsUnitTest_StdSet_Team_C
[CUDA-11.8-Clang-15] 54: Test timeout computed to be: 1500
[CUDA-11.8-Clang-15] 54: Note: Randomizing tests' orders with a seed of 9317 .
[CUDA-11.8-Clang-15] 54: [==========] Running 11 tests from 7 test suites.
[CUDA-11.8-Clang-15] 54: [----------] Global test environment set-up.
[CUDA-11.8-Clang-15] 54: [----------] 1 test from std_algorithms_any_of_team_test
[CUDA-11.8-Clang-15] 54: [ RUN      ] std_algorithms_any_of_team_test.test
[CUDA-11.8-Clang-15] 54: [       OK ] std_algorithms_any_of_team_test.test (159 ms)
[CUDA-11.8-Clang-15] 54: [----------] 1 test from std_algorithms_any_of_team_test (159 ms total)
[CUDA-11.8-Clang-15] 54: 
[CUDA-11.8-Clang-15] 54: [----------] 2 tests from std_algorithms_find_if_not_team_test
[CUDA-11.8-Clang-15] 54: [ RUN      ] std_algorithms_find_if_not_team_test.predicates_return_false
[CUDA-11.8-Clang-15] 54: [       OK ] std_algorithms_find_if_not_team_test.predicates_return_false (154 ms)
[CUDA-11.8-Clang-15] 54: [ RUN      ] std_algorithms_find_if_not_team_test.predicates_return_true
[CUDA-11.8-Clang-15] 54: [       OK ] std_algorithms_find_if_not_team_test.predicates_return_true (164 ms)
[CUDA-11.8-Clang-15] 54: [----------] 2 tests from std_algorithms_find_if_not_team_test (318 ms total)
[CUDA-11.8-Clang-15] 54: 
[CUDA-11.8-Clang-15] 54: [----------] 1 test from std_algorithms_all_of_team_test
[CUDA-11.8-Clang-15] 54: [ RUN      ] std_algorithms_all_of_team_test.test
[CUDA-11.8-Clang-15] 54: [       OK ] std_algorithms_all_of_team_test.test (169 ms)
[CUDA-11.8-Clang-15] 54: [----------] 1 test from std_algorithms_all_of_team_test (169 ms total)
[CUDA-11.8-Clang-15] 54: 
[CUDA-11.8-Clang-15] 54: [----------] 2 tests from std_algorithms_find_if_team_test
[CUDA-11.8-Clang-15] 54: [ RUN      ] std_algorithms_find_if_team_test.predicates_return_true
[CUDA-11.8-Clang-15] 54: [       OK ] std_algorithms_find_if_team_test.predicates_return_true (157 ms)
[CUDA-11.8-Clang-15] 54: [ RUN      ] std_algorithms_find_if_team_test.predicates_return_false
[CUDA-11.8-Clang-15] 54: [       OK ] std_algorithms_find_if_team_test.predicates_return_false (164 ms)
[CUDA-11.8-Clang-15] 54: [----------] 2 tests from std_algorithms_find_if_team_test (322 ms total)
[CUDA-11.8-Clang-15] 54: 
[CUDA-11.8-Clang-15] 54: [----------] 2 tests from std_algorithms_find_team_test
[CUDA-11.8-Clang-15] 54: [ RUN      ] std_algorithms_find_team_test.searched_values_do_not_exist
[CUDA-11.8-Clang-15] 54: [       OK ] std_algorithms_find_team_test.searched_values_do_not_exist (164 ms)
[CUDA-11.8-Clang-15] 54: [ RUN      ] std_algorithms_find_team_test.searched_values_exist
[CUDA-11.8-Clang-15] 54: [       OK ] std_algorithms_find_team_test.searched_values_exist (157 ms)
[CUDA-11.8-Clang-15] 54: [----------] 2 tests from std_algorithms_find_team_test (322 ms total)
[CUDA-11.8-Clang-15] 54: 
[CUDA-11.8-Clang-15] 54: [----------] 1 test from std_algorithms_none_of_team_test
[CUDA-11.8-Clang-15] 54: [ RUN      ] std_algorithms_none_of_team_test.test
[CUDA-11.8-Clang-15] 54: [       OK ] std_algorithms_none_of_team_test.test (168 ms)
[CUDA-11.8-Clang-15] 54: [----------] 1 test from std_algorithms_none_of_team_test (168 ms total)
[CUDA-11.8-Clang-15] 54: 
[CUDA-11.8-Clang-15] 54: [----------] 2 tests from std_algorithms_search_n_team_test
[CUDA-11.8-Clang-15] 54: [ RUN      ] std_algorithms_search_n_team_test.sequences_of_equal_elements_exist
[CUDA-11.8-Clang-15] 54: [       OK ] std_algorithms_search_n_team_test.sequences_of_equal_elements_exist (197 ms)
[CUDA-11.8-Clang-15] 54: [ RUN      ] std_algorithms_search_n_team_test.sequences_of_equal_elements_probably_does_not_exist
[CUDA-11.8-Clang-15] 54: [       OK ] std_algorithms_search_n_team_test.sequences_of_equal_elements_probably_does_not_exist (179 ms)
[CUDA-11.8-Clang-15] 54: [----------] 2 tests from std_algorithms_search_n_team_test (377 ms total)
[CUDA-11.8-Clang-15] 54: 
[CUDA-11.8-Clang-15] 54: [----------] Global test environment tear-down
[CUDA-11.8-Clang-15] 54: [==========] 11 tests from 7 test suites ran. (1838 ms total)
[CUDA-11.8-Clang-15] 54: [  PASSED  ] 11 tests.
[CUDA-11.8-Clang-15] 54/65 Test #54: Kokkos_AlgorithmsUnitTest_StdSet_Team_C ....................   Passed    2.02 sec
[CUDA-11.8-Clang-15] test 55
[CUDA-11.8-Clang-15]       Start 55: Kokkos_AlgorithmsUnitTest_StdSet_Team_D
[CUDA-11.8-Clang-15] 
[CUDA-11.8-Clang-15] 55: Test command: /var/jenkins/workspace/Kokkos_PR-9650/build/algorithms/unit_tests/Kokkos_AlgorithmsUnitTest_StdSet_Team_D
[CUDA-11.8-Clang-15] 55: Test timeout computed to be: 1500
[CUDA-11.8-Clang-15] 55: Note: Randomizing tests' orders with a seed of 11339 .
[CUDA-11.8-Clang-15] 55: [==========] Running 3 tests from 3 test suites.
[CUDA-11.8-Clang-15] 55: [----------] Global test environment set-up.
[CUDA-11.8-Clang-15] 55: [----------] 1 test from std_algorithms_minmax_element_team_test
[CUDA-11.8-Clang-15] 55: [ RUN      ] std_algorithms_minmax_element_team_test.test
[CUDA-11.8-Clang-15] 55: [       OK ] std_algorithms_minmax_element_team_test.test (617 ms)
[CUDA-11.8-Clang-15] 55: [----------] 1 test from std_algorithms_minmax_element_team_test (617 ms total)
[CUDA-11.8-Clang-15] 55: 
[CUDA-11.8-Clang-15] 55: [----------] 1 test from std_algorithms_max_element_team_test
[CUDA-11.8-Clang-15] 55: [ RUN      ] std_algorithms_max_element_team_test.test
[CUDA-11.8-Clang-15] 55: [       OK ] std_algorithms_max_element_team_test.test (554 ms)
[CUDA-11.8-Clang-15] 55: [----------] 1 test from std_algorithms_max_element_team_test (554 ms total)
[CUDA-11.8-Clang-15] 55: 
[CUDA-11.8-Clang-15] 55: [----------] 1 test from std_algorithms_min_element_team_test
[CUDA-11.8-Clang-15] 55: [ RUN      ] std_algorithms_min_element_team_test.test
[CUDA-11.8-Clang-15] 55: [       OK ] std_algorithms_min_element_team_test.test (541 ms)
[CUDA-11.8-Clang-15] 55: [----------] 1 test from std_algorithms_min_element_team_test (541 ms total)
[CUDA-11.8-Clang-15] 55: 
[CUDA-11.8-Clang-15] 55: [----------] Global test environment tear-down
[CUDA-11.8-Clang-15] 55: [==========] 3 tests from 3 test suites ran. (1713 ms total)
[CUDA-11.8-Clang-15] 55: [  PASSED  ] 3 tests.
[CUDA-11.8-Clang-15] 55/65 Test #55: Kokkos_AlgorithmsUnitTest_StdSet_Team_D ....................   Passed    1.89 sec
[CUDA-11.8-Clang-15] test 56
[CUDA-11.8-Clang-15]       Start 56: Kokkos_AlgorithmsUnitTest_StdSet_Team_E
[CUDA-11.8-Clang-15] 
[CUDA-11.8-Clang-15] 56: Test command: /var/jenkins/workspace/Kokkos_PR-9650/build/algorithms/unit_tests/Kokkos_AlgorithmsUnitTest_StdSet_Team_E
[CUDA-11.8-Clang-15] 56: Test timeout computed to be: 1500
[CUDA-11.8-Clang-15] 56: Note: Randomizing tests' orders with a seed of 13234 .
[CUDA-11.8-Clang-15] 56: [==========] Running 6 tests from 6 test suites.
[CUDA-11.8-Clang-15] 56: [----------] Global test environment set-up.
[CUDA-11.8-Clang-15] 56: [----------] 1 test from std_algorithms_replace_team_test
[CUDA-11.8-Clang-15] 56: [ RUN      ] std_algorithms_replace_team_test.test
[CUDA-11.8-Clang-15] 56: [       OK ] std_algorithms_replace_team_test.test (428 ms)
[CUDA-11.8-Clang-15] 56: [----------] 1 test from std_algorithms_replace_team_test (428 ms total)
[CUDA-11.8-Clang-15] 56: 
[CUDA-11.8-Clang-15] 56: [----------] 1 test from std_algorithms_replace_if_team_test
[CUDA-11.8-Clang-15] 56: [ RUN      ] std_algorithms_replace_if_team_test.test
[CUDA-11.8-Clang-15] 56: [       OK ] std_algorithms_replace_if_team_test.test (378 ms)
[CUDA-11.8-Clang-15] 56: [----------] 1 test from std_algorithms_replace_if_team_test (378 ms total)
[CUDA-11.8-Clang-15] 56: 
[CUDA-11.8-Clang-15] 56: [----------] 1 test from std_algorithms_fill_team_test
[CUDA-11.8-Clang-15] 56: [ RUN      ] std_algorithms_fill_team_test.test
[CUDA-11.8-Clang-15] 56: [       OK ] std_algorithms_fill_team_test.test (245 ms)
[CUDA-11.8-Clang-15] 56: [----------] 1 test from std_algorithms_fill_team_test (245 ms total)
[CUDA-11.8-Clang-15] 56: 
[CUDA-11.8-Clang-15] 56: [----------] 1 test from std_algorithms_fill_n_team_test
[CUDA-11.8-Clang-15] 56: [ RUN      ] std_algorithms_fill_n_team_test.test
[CUDA-11.8-Clang-15] 56: [       OK ] std_algorithms_fill_n_team_test.test (239 ms)
[CUDA-11.8-Clang-15] 56: [----------] 1 test from std_algorithms_fill_n_team_test (239 ms total)
[CUDA-11.8-Clang-15] 56: 
[CUDA-11.8-Clang-15] 56: [----------] 1 test from std_algorithms_replace_copy_team_test
[CUDA-11.8-Clang-15] 56: [ RUN      ] std_algorithms_replace_copy_team_test.test
[CUDA-11.8-Clang-15] 56: [       OK ] std_algorithms_replace_copy_team_test.test (532 ms)
[CUDA-11.8-Clang-15] 56: [----------] 1 test from std_algorithms_replace_copy_team_test (533 ms total)
[CUDA-11.8-Clang-15] 56: 
[CUDA-11.8-Clang-15] 56: [----------] 1 test from std_algorithms_replace_copy_if_team_test
[CUDA-11.8-Clang-15] 56: [ RUN      ] std_algorithms_replace_copy_if_team_test.test
[CUDA-11.8-Clang-15] 56: [       OK ] std_algorithms_replace_copy_if_team_test.test (413 ms)
[CUDA-11.8-Clang-15] 56: [----------] 1 test from std_algorithms_replace_copy_if_team_test (413 ms total)
[CUDA-11.8-Clang-15] 56: 
[CUDA-11.8-Clang-15] 56: [----------] Global test environment tear-down
[CUDA-11.8-Clang-15] 56: [==========] 6 tests from 6 test suites ran. (2239 ms total)
[CUDA-11.8-Clang-15] 56: [  PASSED  ] 6 tests.
[CUDA-11.8-Clang-15] 56/65 Test #56: Kokkos_AlgorithmsUnitTest_StdSet_Team_E ....................   Passed    2.42 sec
[CUDA-11.8-Clang-15] test 57
[CUDA-11.8-Clang-15]       Start 57: Kokkos_AlgorithmsUnitTest_StdSet_Team_F
[CUDA-11.8-Clang-15] 
[CUDA-11.8-Clang-15] 57: Test command: /var/jenkins/workspace/Kokkos_PR-9650/build/algorithms/unit_tests/Kokkos_AlgorithmsUnitTest_StdSet_Team_F
[CUDA-11.8-Clang-15] 57: Test timeout computed to be: 1500
[CUDA-11.8-Clang-15] 57: Note: Randomizing tests' orders with a seed of 15652 .
[CUDA-11.8-Clang-15] 57: [==========] Running 4 tests from 4 test suites.
[CUDA-11.8-Clang-15] 57: [----------] Global test environment set-up.
[CUDA-11.8-Clang-15] 57: [----------] 1 test from std_algorithms_reverse_team_test
[CUDA-11.8-Clang-15] 57: [ RUN      ] std_algorithms_reverse_team_test.test
[CUDA-11.8-Clang-15] 57: [       OK ] std_algorithms_reverse_team_test.test (272 ms)
[CUDA-11.8-Clang-15] 57: [----------] 1 test from std_algorithms_reverse_team_test (272 ms total)
[CUDA-11.8-Clang-15] 57: 
[CUDA-11.8-Clang-15] 57: [----------] 1 test from std_algorithms_rotate_copy_team_test
[CUDA-11.8-Clang-15] 57: [ RUN      ] std_algorithms_rotate_copy_team_test.test
[CUDA-11.8-Clang-15] 57: [       OK ] std_algorithms_rotate_copy_team_test.test (466 ms)
[CUDA-11.8-Clang-15] 57: [----------] 1 test from std_algorithms_rotate_copy_team_test (467 ms total)
[CUDA-11.8-Clang-15] 57: 
[CUDA-11.8-Clang-15] 57: [----------] 1 test from std_algorithms_rotate_team_test
[CUDA-11.8-Clang-15] 57: [ RUN      ] std_algorithms_rotate_team_test.test
[CUDA-11.8-Clang-15] 57: [       OK ] std_algorithms_rotate_team_test.test (452 ms)
[CUDA-11.8-Clang-15] 57: [----------] 1 test from std_algorithms_rotate_team_test (452 ms total)
[CUDA-11.8-Clang-15] 57: 
[CUDA-11.8-Clang-15] 57: [----------] 1 test from std_algorithms_reverse_copy_team_test
[CUDA-11.8-Clang-15] 57: [ RUN      ] std_algorithms_reverse_copy_team_test.test
[CUDA-11.8-Clang-15] 57: [       OK ] std_algorithms_reverse_copy_team_test.test (315 ms)
[CUDA-11.8-Clang-15] 57: [----------] 1 test from std_algorithms_reverse_copy_team_test (315 ms total)
[CUDA-11.8-Clang-15] 57: 
[CUDA-11.8-Clang-15] 57: [----------] Global test environment tear-down
[CUDA-11.8-Clang-15] 57: [==========] 4 tests from 4 test suites ran. (1508 ms total)
[CUDA-11.8-Clang-15] 57: [  PASSED  ] 4 tests.
[CUDA-11.8-Clang-15] 57/65 Test #57: Kokkos_AlgorithmsUnitTest_StdSet_Team_F ....................   Passed    1.68 sec
[CUDA-11.8-Clang-15] test 58
[CUDA-11.8-Clang-15]       Start 58: Kokkos_AlgorithmsUnitTest_StdSet_Team_G
[CUDA-11.8-Clang-15] 
[CUDA-11.8-Clang-15] 58: Test command: /var/jenkins/workspace/Kokkos_PR-9650/build/algorithms/unit_tests/Kokkos_AlgorithmsUnitTest_StdSet_Team_G
[CUDA-11.8-Clang-15] 58: Test timeout computed to be: 1500
[CUDA-11.8-Clang-15] 58: Note: Randomizing tests' orders with a seed of 17340 .
[CUDA-11.8-Clang-15] 58: [==========] Running 4 tests from 4 test suites.
[CUDA-11.8-Clang-15] 58: [----------] Global test environment set-up.
[CUDA-11.8-Clang-15] 58: [----------] 1 test from std_algorithms_move_team_test
[CUDA-11.8-Clang-15] 58: [ RUN      ] std_algorithms_move_team_test.test
[CUDA-11.8-Clang-15] 58: [       OK ] std_algorithms_move_team_test.test (588 ms)
[CUDA-11.8-Clang-15] 58: [----------] 1 test from std_algorithms_move_team_test (588 ms total)
[CUDA-11.8-Clang-15] 58: 
[CUDA-11.8-Clang-15] 58: [----------] 1 test from std_algorithms_shift_left_team_test
[CUDA-11.8-Clang-15] 58: [ RUN      ] std_algorithms_shift_left_team_test.test
[CUDA-11.8-Clang-15] 58: [       OK ] std_algorithms_shift_left_team_test.test (1408 ms)
[CUDA-11.8-Clang-15] 58: [----------] 1 test from std_algorithms_shift_left_team_test (1408 ms total)
[CUDA-11.8-Clang-15] 58: 
[CUDA-11.8-Clang-15] 58: [----------] 1 test from std_algorithms_shift_right_team_test
[CUDA-11.8-Clang-15] 58: [ RUN      ] std_algorithms_shift_right_team_test.test
[CUDA-11.8-Clang-15] 58: [       OK ] std_algorithms_shift_right_team_test.test (1400 ms)
[CUDA-11.8-Clang-15] 58: [----------] 1 test from std_algorithms_shift_right_team_test (1400 ms total)
[CUDA-11.8-Clang-15] 58: 
[CUDA-11.8-Clang-15] 58: [----------] 1 test from std_algorithms_move_backward_team_test
[CUDA-11.8-Clang-15] 58: [ RUN      ] std_algorithms_move_backward_team_test.test
[CUDA-11.8-Clang-15] 58: [       OK ] std_algorithms_move_backward_team_test.test (465 ms)
[CUDA-11.8-Clang-15] 58: [----------] 1 test from std_algorithms_move_backward_team_test (465 ms total)
[CUDA-11.8-Clang-15] 58: 
[CUDA-11.8-Clang-15] 58: [----------] Global test environment tear-down
[CUDA-11.8-Clang-15] 58: [==========] 4 tests from 4 test suites ran. (3862 ms total)
[CUDA-11.8-Clang-15] 58: [  PASSED  ] 4 tests.
[CUDA-11.8-Clang-15] 58/65 Test #58: Kokkos_AlgorithmsUnitTest_StdSet_Team_G ....................   Passed    4.04 sec
[CUDA-11.8-Clang-15] test 59
[CUDA-11.8-Clang-15]       Start 59: Kokkos_AlgorithmsUnitTest_StdSet_Team_H
[CUDA-11.8-Clang-15] 
[CUDA-11.8-Clang-15] 59: Test command: /var/jenkins/workspace/Kokkos_PR-9650/build/algorithms/unit_tests/Kokkos_AlgorithmsUnitTest_StdSet_Team_H
[CUDA-11.8-Clang-15] 59: Test timeout computed to be: 1500
[CUDA-11.8-Clang-15] 59: Note: Randomizing tests' orders with a seed of 21381 .
[CUDA-11.8-Clang-15] 59: [==========] Running 9 tests from 9 test suites.
[CUDA-11.8-Clang-15] 59: [----------] Global test environment set-up.
[CUDA-11.8-Clang-15] 59: [----------] 1 test from std_algorithms_unique_copy_team_test
[CUDA-11.8-Clang-15] 59: [ RUN      ] std_algorithms_unique_copy_team_test.test
[CUDA-11.8-Clang-15] 59: [       OK ] std_algorithms_unique_copy_team_test.test (530 ms)
[CUDA-11.8-Clang-15] 59: [----------] 1 test from std_algorithms_unique_copy_team_test (530 ms total)
[CUDA-11.8-Clang-15] 59: 
[CUDA-11.8-Clang-15] 59: [----------] 1 test from std_algorithms_copy_n_team_test
[CUDA-11.8-Clang-15] 59: [ RUN      ] std_algorithms_copy_n_team_test.test
[CUDA-11.8-Clang-15] 59: [       OK ] std_algorithms_copy_n_team_test.test (309 ms)
[CUDA-11.8-Clang-15] 59: [----------] 1 test from std_algorithms_copy_n_team_test (309 ms total)
[CUDA-11.8-Clang-15] 59: 
[CUDA-11.8-Clang-15] 59: [----------] 1 test from std_algorithms_copy_backward_team_test
[CUDA-11.8-Clang-15] 59: [ RUN      ] std_algorithms_copy_backward_team_test.test
[CUDA-11.8-Clang-15] 59: [       OK ] std_algorithms_copy_backward_team_test.test (433 ms)
[CUDA-11.8-Clang-15] 59: [----------] 1 test from std_algorithms_copy_backward_team_test (433 ms total)
[CUDA-11.8-Clang-15] 59: 
[CUDA-11.8-Clang-15] 59: [----------] 1 test from std_algorithms_remove_if_team_test
[CUDA-11.8-Clang-15] 59: [ RUN      ] std_algorithms_remove_if_team_test.test
[CUDA-11.8-Clang-15] 59: [       OK ] std_algorithms_remove_if_team_test.test (330 ms)
[CUDA-11.8-Clang-15] 59: [----------] 1 test from std_algorithms_remove_if_team_test (330 ms total)
[CUDA-11.8-Clang-15] 59: 
[CUDA-11.8-Clang-15] 59: [----------] 1 test from std_algorithms_copy_team_test
[CUDA-11.8-Clang-15] 59: [ RUN      ] std_algorithms_copy_team_test.test
[CUDA-11.8-Clang-15] 59: [       OK ] std_algorithms_copy_team_test.test (684 ms)
[CUDA-11.8-Clang-15] 59: [----------] 1 test from std_algorithms_copy_team_test (684 ms total)
[CUDA-11.8-Clang-15] 59: 
[CUDA-11.8-Clang-15] 59: [----------] 1 test from std_algorithms_remove_team_test
[CUDA-11.8-Clang-15] 59: [ RUN      ] std_algorithms_remove_team_test.test
[CUDA-11.8-Clang-15] 59: [       OK ] std_algorithms_remove_team_test.test (385 ms)
[CUDA-11.8-Clang-15] 59: [----------] 1 test from std_algorithms_remove_team_test (385 ms total)
[CUDA-11.8-Clang-15] 59: 
[CUDA-11.8-Clang-15] 59: [----------] 1 test from std_algorithms_remove_copy_team_test
[CUDA-11.8-Clang-15] 59: [ RUN      ] std_algorithms_remove_copy_team_test.test
[CUDA-11.8-Clang-15] 59: [       OK ] std_algorithms_remove_copy_team_test.test (468 ms)
[CUDA-11.8-Clang-15] 59: [----------] 1 test from std_algorithms_remove_copy_team_test (468 ms total)
[CUDA-11.8-Clang-15] 59: 
[CUDA-11.8-Clang-15] 59: [----------] 1 test from std_algorithms_remove_copy_if_team_test
[CUDA-11.8-Clang-15] 59: [ RUN      ] std_algorithms_remove_copy_if_team_test.test
[CUDA-11.8-Clang-15] 59: [       OK ] std_algorithms_remove_copy_if_team_test.test (395 ms)
[CUDA-11.8-Clang-15] 59: [----------] 1 test from std_algorithms_remove_copy_if_team_test (395 ms total)
[CUDA-11.8-Clang-15] 59: 
[CUDA-11.8-Clang-15] 59: [----------] 1 test from std_algorithms_copy_if_team_test
[CUDA-11.8-Clang-15] 59: [ RUN      ] std_algorithms_copy_if_team_test.test
[CUDA-11.8-Clang-15] 59: [       OK ] std_algorithms_copy_if_team_test.test (477 ms)
[CUDA-11.8-Clang-15] 59: [----------] 1 test from std_algorithms_copy_if_team_test (477 ms total)
[CUDA-11.8-Clang-15] 59: 
[CUDA-11.8-Clang-15] 59: [----------] Global test environment tear-down
[CUDA-11.8-Clang-15] 59: [==========] 9 tests from 9 test suites ran. (4016 ms total)
[CUDA-11.8-Clang-15] 59: [  PASSED  ] 9 tests.
[CUDA-11.8-Clang-15] 59/65 Test #59: Kokkos_AlgorithmsUnitTest_StdSet_Team_H ....................   Passed    4.20 sec
[CUDA-11.8-Clang-15] test 60
[CUDA-11.8-Clang-15]       Start 60: Kokkos_AlgorithmsUnitTest_StdSet_Team_I
[CUDA-11.8-Clang-15] 
[CUDA-11.8-Clang-15] 60: Test command: /var/jenkins/workspace/Kokkos_PR-9650/build/algorithms/unit_tests/Kokkos_AlgorithmsUnitTest_StdSet_Team_I
[CUDA-11.8-Clang-15] 60: Test timeout computed to be: 1500
[CUDA-11.8-Clang-15] 60: Note: Randomizing tests' orders with a seed of 25576 .
[CUDA-11.8-Clang-15] 60: [==========] Running 4 tests from 4 test suites.
[CUDA-11.8-Clang-15] 60: [----------] Global test environment set-up.
[CUDA-11.8-Clang-15] 60: [----------] 1 test from std_algorithms_reduce_team_test
[CUDA-11.8-Clang-15] 60: [ RUN      ] std_algorithms_reduce_team_test.test
[CUDA-11.8-Clang-15] 60: [       OK ] std_algorithms_reduce_team_test.test (532 ms)
[CUDA-11.8-Clang-15] 60: [----------] 1 test from std_algorithms_reduce_team_test (532 ms total)
[CUDA-11.8-Clang-15] 60: 
[CUDA-11.8-Clang-15] 60: [----------] 1 test from std_algorithms_transform_reduce_team_test
[CUDA-11.8-Clang-15] 60: [ RUN      ] std_algorithms_transform_reduce_team_test.test
[CUDA-11.8-Clang-15] 60: [       OK ] std_algorithms_transform_reduce_team_test.test (981 ms)
[CUDA-11.8-Clang-15] 60: [----------] 1 test from std_algorithms_transform_reduce_team_test (981 ms total)
[CUDA-11.8-Clang-15] 60: 
[CUDA-11.8-Clang-15] 60: [----------] 1 test from std_algorithms_unique_team_test
[CUDA-11.8-Clang-15] 60: [ RUN      ] std_algorithms_unique_team_test.test_default_predicate
[CUDA-11.8-Clang-15] 60: [       OK ] std_algorithms_unique_team_test.test_default_predicate (502 ms)
[CUDA-11.8-Clang-15] 60: [----------] 1 test from std_algorithms_unique_team_test (502 ms total)
[CUDA-11.8-Clang-15] 60: 
[CUDA-11.8-Clang-15] 60: [----------] 1 test from std_algorithms_adjacent_difference_team_test
[CUDA-11.8-Clang-15] 60: [ RUN      ] std_algorithms_adjacent_difference_team_test.test
[CUDA-11.8-Clang-15] 60: [       OK ] std_algorithms_adjacent_difference_team_test.test (745 ms)
[CUDA-11.8-Clang-15] 60: [----------] 1 test from std_algorithms_adjacent_difference_team_test (745 ms total)
[CUDA-11.8-Clang-15] 60: 
[CUDA-11.8-Clang-15] 60: [----------] Global test environment tear-down
[CUDA-11.8-Clang-15] 60: [==========] 4 tests from 4 test suites ran. (2762 ms total)
[CUDA-11.8-Clang-15] 60: [  PASSED  ] 4 tests.
[CUDA-11.8-Clang-15] 60/65 Test #60: Kokkos_AlgorithmsUnitTest_StdSet_Team_I ....................   Passed    2.94 sec
[CUDA-11.8-Clang-15] test 61
[CUDA-11.8-Clang-15]       Start 61: Kokkos_AlgorithmsUnitTest_StdSet_Team_L
[CUDA-11.8-Clang-15] 
[CUDA-11.8-Clang-15] 61: Test command: /var/jenkins/workspace/Kokkos_PR-9650/build/algorithms/unit_tests/Kokkos_AlgorithmsUnitTest_StdSet_Team_L
[CUDA-11.8-Clang-15] 61: Test timeout computed to be: 1500
[CUDA-11.8-Clang-15] 61: Note: Randomizing tests' orders with a seed of 28517 .
[CUDA-11.8-Clang-15] 61: [==========] Running 18 tests from 5 test suites.
[CUDA-11.8-Clang-15] 61: [----------] Global test environment set-up.
[CUDA-11.8-Clang-15] 61: [----------] 2 tests from std_algorithms_is_sorted_team_test
[CUDA-11.8-Clang-15] 61: [ RUN      ] std_algorithms_is_sorted_team_test.test_data_certainly_sorted
[CUDA-11.8-Clang-15] 61: [       OK ] std_algorithms_is_sorted_team_test.test_data_certainly_sorted (570 ms)
[CUDA-11.8-Clang-15] 61: [ RUN      ] std_algorithms_is_sorted_team_test.test_data_almost_certainly_not_sorted
[CUDA-11.8-Clang-15] 61: [       OK ] std_algorithms_is_sorted_team_test.test_data_almost_certainly_not_sorted (570 ms)
[CUDA-11.8-Clang-15] 61: [----------] 2 tests from std_algorithms_is_sorted_team_test (1141 ms total)
[CUDA-11.8-Clang-15] 61: 
[CUDA-11.8-Clang-15] 61: [----------] 4 tests from std_algorithms_is_partitioned_team_test
[CUDA-11.8-Clang-15] 61: [ RUN      ] std_algorithms_is_partitioned_team_test.all_true
[CUDA-11.8-Clang-15] 61: [       OK ] std_algorithms_is_partitioned_team_test.all_true (278 ms)
[CUDA-11.8-Clang-15] 61: [ RUN      ] std_algorithms_is_partitioned_team_test.empty
[CUDA-11.8-Clang-15] 61: [       OK ] std_algorithms_is_partitioned_team_test.empty (6 ms)
[CUDA-11.8-Clang-15] 61: [ RUN      ] std_algorithms_is_partitioned_team_test.random
[CUDA-11.8-Clang-15] 61: [       OK ] std_algorithms_is_partitioned_team_test.random (261 ms)
[CUDA-11.8-Clang-15] 61: [ RUN      ] std_algorithms_is_partitioned_team_test.all_false
[CUDA-11.8-Clang-15] 61: [       OK ] std_algorithms_is_partitioned_team_test.all_false (280 ms)
[CUDA-11.8-Clang-15] 61: [----------] 4 tests from std_algorithms_is_partitioned_team_test (826 ms total)
[CUDA-11.8-Clang-15] 61: 
[CUDA-11.8-Clang-15] 61: [----------] 4 tests from std_algorithms_partition_point_team_test
[CUDA-11.8-Clang-15] 61: [ RUN      ] std_algorithms_partition_point_team_test.all_true
[CUDA-11.8-Clang-15] 61: [       OK ] std_algorithms_partition_point_team_test.all_true (263 ms)
[CUDA-11.8-Clang-15] 61: [ RUN      ] std_algorithms_partition_point_team_test.random
[CUDA-11.8-Clang-15] 61: [       OK ] std_algorithms_partition_point_team_test.random (254 ms)
[CUDA-11.8-Clang-15] 61: [ RUN      ] std_algorithms_partition_point_team_test.all_false
[CUDA-11.8-Clang-15] 61: [       OK ] std_algorithms_partition_point_team_test.all_false (275 ms)
[CUDA-11.8-Clang-15] 61: [ RUN      ] std_algorithms_partition_point_team_test.empty
[CUDA-11.8-Clang-15] 61: [       OK ] std_algorithms_partition_point_team_test.empty (6 ms)
[CUDA-11.8-Clang-15] 61: [----------] 4 tests from std_algorithms_partition_point_team_test (799 ms total)
[CUDA-11.8-Clang-15] 61: 
[CUDA-11.8-Clang-15] 61: [----------] 4 tests from std_algorithms_partition_copy_team_test
[CUDA-11.8-Clang-15] 61: [ RUN      ] std_algorithms_partition_copy_team_test.empty
[CUDA-11.8-Clang-15] 61: [       OK ] std_algorithms_partition_copy_team_test.empty (12 ms)
[CUDA-11.8-Clang-15] 61: [ RUN      ] std_algorithms_partition_copy_team_test.random
[CUDA-11.8-Clang-15] 61: [       OK ] std_algorithms_partition_copy_team_test.random (725 ms)
[CUDA-11.8-Clang-15] 61: [ RUN      ] std_algorithms_partition_copy_team_test.all_false
[CUDA-11.8-Clang-15] 61: [       OK ] std_algorithms_partition_copy_team_test.all_false (752 ms)
[CUDA-11.8-Clang-15] 61: [ RUN      ] std_algorithms_partition_copy_team_test.all_true
[CUDA-11.8-Clang-15] 61: [       OK ] std_algorithms_partition_copy_team_test.all_true (746 ms)
[CUDA-11.8-Clang-15] 61: [----------] 4 tests from std_algorithms_partition_copy_team_test (2236 ms total)
[CUDA-11.8-Clang-15] 61: 
[CUDA-11.8-Clang-15] 61: [----------] 4 tests from std_algorithms_is_sorted_until_team_test
[CUDA-11.8-Clang-15] 61: [ RUN      ] std_algorithms_is_sorted_until_team_test.test_trivialA
[CUDA-11.8-Clang-15] 61: [       OK ] std_algorithms_is_sorted_until_team_test.test_trivialA (13 ms)
[CUDA-11.8-Clang-15] 61: [ RUN      ] std_algorithms_is_sorted_until_team_test.test_nontrivialA
[CUDA-11.8-Clang-15] 61: [       OK ] std_algorithms_is_sorted_until_team_test.test_nontrivialA (530 ms)
[CUDA-11.8-Clang-15] 61: [ RUN      ] std_algorithms_is_sorted_until_team_test.test_trivialB
[CUDA-11.8-Clang-15] 61: [       OK ] std_algorithms_is_sorted_until_team_test.test_trivialB (16 ms)
[CUDA-11.8-Clang-15] 61: [ RUN      ] std_algorithms_is_sorted_until_team_test.test_nontrivialB
[CUDA-11.8-Clang-15] 61: [       OK ] std_algorithms_is_sorted_until_team_test.test_nontrivialB (587 ms)
[CUDA-11.8-Clang-15] 61: [----------] 4 tests from std_algorithms_is_sorted_until_team_test (1147 ms total)
[CUDA-11.8-Clang-15] 61: 
[CUDA-11.8-Clang-15] 61: [----------] Global test environment tear-down
[CUDA-11.8-Clang-15] 61: [==========] 18 tests from 5 test suites ran. (6151 ms total)
[CUDA-11.8-Clang-15] 61: [  PASSED  ] 18 tests.
[CUDA-11.8-Clang-15] 61/65 Test #61: Kokkos_AlgorithmsUnitTest_StdSet_Team_L ....................   Passed    6.33 sec
[CUDA-11.8-Clang-15] test 62
[CUDA-11.8-Clang-15]       Start 62: Kokkos_AlgorithmsUnitTest_StdSet_Team_M
[CUDA-11.8-Clang-15] 
[CUDA-11.8-Clang-15] 62: Test command: /var/jenkins/workspace/Kokkos_PR-9650/build/algorithms/unit_tests/Kokkos_AlgorithmsUnitTest_StdSet_Team_M
[CUDA-11.8-Clang-15] 62: Test timeout computed to be: 1500
[CUDA-11.8-Clang-15] 62: Note: Randomizing tests' orders with a seed of 34846 .
[CUDA-11.8-Clang-15] 62: [==========] Running 5 tests from 4 test suites.
[CUDA-11.8-Clang-15] 62: [----------] Global test environment set-up.
[CUDA-11.8-Clang-15] 62: [----------] 2 tests from std_algorithms_transform_team_test
[CUDA-11.8-Clang-15] 62: [ RUN      ] std_algorithms_transform_team_test.test_unary_op
[CUDA-11.8-Clang-15] 62: [       OK ] std_algorithms_transform_team_test.test_unary_op (776 ms)
[CUDA-11.8-Clang-15] 62: [ RUN      ] std_algorithms_transform_team_test.test_binary_op
[CUDA-11.8-Clang-15] 62: [       OK ] std_algorithms_transform_team_test.test_binary_op (823 ms)
[CUDA-11.8-Clang-15] 62: [----------] 2 tests from std_algorithms_transform_team_test (1600 ms total)
[CUDA-11.8-Clang-15] 62: 
[CUDA-11.8-Clang-15] 62: [----------] 1 test from std_algorithms_generate_team_test
[CUDA-11.8-Clang-15] 62: [ RUN      ] std_algorithms_generate_team_test.test_unary_op
[CUDA-11.8-Clang-15] 62: [       OK ] std_algorithms_generate_team_test.test_unary_op (1680 ms)
[CUDA-11.8-Clang-15] 62: [----------] 1 test from std_algorithms_generate_team_test (1680 ms total)
[CUDA-11.8-Clang-15] 62: 
[CUDA-11.8-Clang-15] 62: [----------] 1 test from std_algorithms_generate_n_team_test
[CUDA-11.8-Clang-15] 62: [ RUN      ] std_algorithms_generate_n_team_test.test
[CUDA-11.8-Clang-15] 62: [       OK ] std_algorithms_generate_n_team_test.test (251 ms)
[CUDA-11.8-Clang-15] 62: [----------] 1 test from std_algorithms_generate_n_team_test (252 ms total)
[CUDA-11.8-Clang-15] 62: 
[CUDA-11.8-Clang-15] 62: [----------] 1 test from std_algorithms_swap_ranges_team_test
[CUDA-11.8-Clang-15] 62: [ RUN      ] std_algorithms_swap_ranges_team_test.test
[CUDA-11.8-Clang-15] 62: [       OK ] std_algorithms_swap_ranges_team_test.test (778 ms)
[CUDA-11.8-Clang-15] 62: [----------] 1 test from std_algorithms_swap_ranges_team_test (778 ms total)
[CUDA-11.8-Clang-15] 62: 
[CUDA-11.8-Clang-15] 62: [----------] Global test environment tear-down
[CUDA-11.8-Clang-15] 62: [==========] 5 tests from 4 test suites ran. (4311 ms total)
[CUDA-11.8-Clang-15] 62: [  PASSED  ] 5 tests.
[CUDA-11.8-Clang-15] 62/65 Test #62: Kokkos_AlgorithmsUnitTest_StdSet_Team_M ....................   Passed    4.49 sec
[CUDA-11.8-Clang-15] test 63
[CUDA-11.8-Clang-15]       Start 63: Kokkos_AlgorithmsUnitTest_StdSet_Team_P
[CUDA-11.8-Clang-15] 
[CUDA-11.8-Clang-15] 63: Test command: /var/jenkins/workspace/Kokkos_PR-9650/build/algorithms/unit_tests/Kokkos_AlgorithmsUnitTest_StdSet_Team_P
[CUDA-11.8-Clang-15] 63: Test timeout computed to be: 1500
[CUDA-11.8-Clang-15] 63: Note: Randomizing tests' orders with a seed of 39339 .
[CUDA-11.8-Clang-15] 63: [==========] Running 2 tests from 2 test suites.
[CUDA-11.8-Clang-15] 63: [----------] Global test environment set-up.
[CUDA-11.8-Clang-15] 63: [----------] 1 test from std_algorithms_transform_exclusive_scan_team_test
[CUDA-11.8-Clang-15] 63: [ RUN      ] std_algorithms_transform_exclusive_scan_team_test.test
[CUDA-11.8-Clang-15] 63: [       OK ] std_algorithms_transform_exclusive_scan_team_test.test (846 ms)
[CUDA-11.8-Clang-15] 63: [----------] 1 test from std_algorithms_transform_exclusive_scan_team_test (847 ms total)
[CUDA-11.8-Clang-15] 63: 
[CUDA-11.8-Clang-15] 63: [----------] 1 test from std_algorithms_exclusive_scan_team_test
[CUDA-11.8-Clang-15] 63: [ RUN      ] std_algorithms_exclusive_scan_team_test.test
[CUDA-11.8-Clang-15] 63: [       OK ] std_algorithms_exclusive_scan_team_test.test (1606 ms)
[CUDA-11.8-Clang-15] 63: [----------] 1 test from std_algorithms_exclusive_scan_team_test (1606 ms total)
[CUDA-11.8-Clang-15] 63: 
[CUDA-11.8-Clang-15] 63: [----------] Global test environment tear-down
[CUDA-11.8-Clang-15] 63: [==========] 2 tests from 2 test suites ran. (2453 ms total)
[CUDA-11.8-Clang-15] 63: [  PASSED  ] 2 tests.
[CUDA-11.8-Clang-15] 63/65 Test #63: Kokkos_AlgorithmsUnitTest_StdSet_Team_P ....................   Passed    2.63 sec
[CUDA-11.8-Clang-15] test 64
[CUDA-11.8-Clang-15]       Start 64: Kokkos_AlgorithmsUnitTest_StdSet_Team_Q
[CUDA-11.8-Clang-15] 
[CUDA-11.8-Clang-15] 64: Test command: /var/jenkins/workspace/Kokkos_PR-9650/build/algorithms/unit_tests/Kokkos_AlgorithmsUnitTest_StdSet_Team_Q
[CUDA-11.8-Clang-15] 64: Test timeout computed to be: 1500
[CUDA-11.8-Clang-15] 64: Note: Randomizing tests' orders with a seed of 41971 .
[CUDA-11.8-Clang-15] 64: [==========] Running 2 tests from 2 test suites.
[CUDA-11.8-Clang-15] 64: [----------] Global test environment set-up.
[CUDA-11.8-Clang-15] 64: [----------] 1 test from std_algorithms_transform_inclusive_scan_team_test
[CUDA-11.8-Clang-15] 64: [ RUN      ] std_algorithms_transform_inclusive_scan_team_test.test
[CUDA-11.8-Clang-15] 64: [       OK ] std_algorithms_transform_inclusive_scan_team_test.test (1775 ms)
[CUDA-11.8-Clang-15] 64: [----------] 1 test from std_algorithms_transform_inclusive_scan_team_test (1775 ms total)
[CUDA-11.8-Clang-15] 64: 
[CUDA-11.8-Clang-15] 64: [----------] 1 test from std_algorithms_inclusive_scan_team_test
[CUDA-11.8-Clang-15] 64: [ RUN      ] std_algorithms_inclusive_scan_team_test.test
[CUDA-11.8-Clang-15] 64: [       OK ] std_algorithms_inclusive_scan_team_test.test (2500 ms)
[CUDA-11.8-Clang-15] 64: [----------] 1 test from std_algorithms_inclusive_scan_team_test (2500 ms total)
[CUDA-11.8-Clang-15] 64: 
[CUDA-11.8-Clang-15] 64: [----------] Global test environment tear-down
[CUDA-11.8-Clang-15] 64: [==========] 2 tests from 2 test suites ran. (4276 ms total)
[CUDA-11.8-Clang-15] 64: [  PASSED  ] 2 tests.
[CUDA-11.8-Clang-15] 64/65 Test #64: Kokkos_AlgorithmsUnitTest_StdSet_Team_Q ....................   Passed    4.46 sec
[CUDA-11.8-Clang-15] test 65
[CUDA-11.8-Clang-15]       Start 65: Kokkos_UnitTest_SIMD
[CUDA-11.8-Clang-15] 
[CUDA-11.8-Clang-15] 65: Test command: /var/jenkins/workspace/Kokkos_PR-9650/build/simd/unit_tests/Kokkos_UnitTest_SIMD
[CUDA-11.8-Clang-15] 65: Test timeout computed to be: 1500
[CUDA-11.8-Clang-15] 65: Note: Randomizing tests' orders with a seed of 46426 .
[CUDA-11.8-Clang-15] 65: [==========] Running 31 tests from 1 test suite.
[CUDA-11.8-Clang-15] 65: [----------] Global test environment set-up.
[CUDA-11.8-Clang-15] 65: [----------] 31 tests from simd
[CUDA-11.8-Clang-15] 65: [ RUN      ] simd.device_reductions
[CUDA-11.8-Clang-15] 65: [       OK ] simd.device_reductions (5 ms)
[CUDA-11.8-Clang-15] 65: [ RUN      ] simd.device_shift_ops
[CUDA-11.8-Clang-15] 65: [       OK ] simd.device_shift_ops (0 ms)
[CUDA-11.8-Clang-15] 65: [ RUN      ] simd.device_condition
[CUDA-11.8-Clang-15] 65: [       OK ] simd.device_condition (0 ms)
[CUDA-11.8-Clang-15] 65: [ RUN      ] simd.device_mask_bitwise_ops
[CUDA-11.8-Clang-15] 65: [       OK ] simd.device_mask_bitwise_ops (0 ms)
[CUDA-11.8-Clang-15] 65: [ RUN      ] simd.host_loadstore
[CUDA-11.8-Clang-15] 65: [       OK ] simd.host_loadstore (0 ms)
[CUDA-11.8-Clang-15] 65: [ RUN      ] simd.host_mask_comparison_ops
[CUDA-11.8-Clang-15] 65: [       OK ] simd.host_mask_comparison_ops (0 ms)
[CUDA-11.8-Clang-15] 65: [ RUN      ] simd.host_mask_bitwise_ops
[CUDA-11.8-Clang-15] 65: [       OK ] simd.host_mask_bitwise_ops (0 ms)
[CUDA-11.8-Clang-15] 65: [ RUN      ] simd.host_math_ops
[CUDA-11.8-Clang-15] 65: [       OK ] simd.host_math_ops (2 ms)
[CUDA-11.8-Clang-15] 65: [ RUN      ] simd.device_mask_comparison_ops
[CUDA-11.8-Clang-15] 65: [       OK ] simd.device_mask_comparison_ops (0 ms)
[CUDA-11.8-Clang-15] 65: [ RUN      ] simd.device_bitwise_ops
[CUDA-11.8-Clang-15] 65: [       OK ] simd.device_bitwise_ops (0 ms)
[CUDA-11.8-Clang-15] 65: [ RUN      ] simd.device_mask_ops
[CUDA-11.8-Clang-15] 65: [       OK ] simd.device_mask_ops (0 ms)
[CUDA-11.8-Clang-15] 65: [ RUN      ] simd.device_math_ops
[CUDA-11.8-Clang-15] 65: [       OK ] simd.device_math_ops (7 ms)
[CUDA-11.8-Clang-15] 65: [ RUN      ] simd.device_loadstore
[CUDA-11.8-Clang-15] 65: [       OK ] simd.device_loadstore (0 ms)
[CUDA-11.8-Clang-15] 65: [ RUN      ] simd.host_shift_ops
[CUDA-11.8-Clang-15] 65: [       OK ] simd.host_shift_ops (0 ms)
[CUDA-11.8-Clang-15] 65: [ RUN      ] simd.host_construction
[CUDA-11.8-Clang-15] 65: [       OK ] simd.host_construction (0 ms)
[CUDA-11.8-Clang-15] 65: [ RUN      ] simd.host_condition
[CUDA-11.8-Clang-15] 65: [       OK ] simd.host_condition (0 ms)
[CUDA-11.8-Clang-15] 65: [ RUN      ] simd.device_gen_ctors
[CUDA-11.8-Clang-15] 65: [       OK ] simd.device_gen_ctors (0 ms)
[CUDA-11.8-Clang-15] 65: [ RUN      ] simd.host_arithmetic_ops
[CUDA-11.8-Clang-15] 65: [       OK ] simd.host_arithmetic_ops (0 ms)
[CUDA-11.8-Clang-15] 65: [ RUN      ] simd.device_comparison_ops
[CUDA-11.8-Clang-15] 65: [       OK ] simd.device_comparison_ops (0 ms)
[CUDA-11.8-Clang-15] 65: [ RUN      ] simd.host_mask_ops
[CUDA-11.8-Clang-15] 65: [       OK ] simd.host_mask_ops (0 ms)
[CUDA-11.8-Clang-15] 65: [ RUN      ] simd.device_arithmetic_ops
[CUDA-11.8-Clang-15] 65: [       OK ] simd.device_arithmetic_ops (0 ms)
[CUDA-11.8-Clang-15] 65: [ RUN      ] simd.host_memory_permute
[CUDA-11.8-Clang-15] 65: [       OK ] simd.host_memory_permute (0 ms)
[CUDA-11.8-Clang-15] 65: [ RUN      ] simd.host_conversions
[CUDA-11.8-Clang-15] 65: [       OK ] simd.host_conversions (0 ms)
[CUDA-11.8-Clang-15] 65: [ RUN      ] simd.device_memory_permute
[CUDA-11.8-Clang-15] 65: [       OK ] simd.device_memory_permute (0 ms)
[CUDA-11.8-Clang-15] 65: [ RUN      ] simd.device_conversions
[CUDA-11.8-Clang-15] 65: [       OK ] simd.device_conversions (0 ms)
[CUDA-11.8-Clang-15] 65: [ RUN      ] simd.host_simd_construction_in_device
[CUDA-11.8-Clang-15] 65: /var/jenkins/workspace/Kokkos_PR-9650/simd/unit_tests/include/TestSIMD_InDeviceConstruction.hpp:153: Skipped
[CUDA-11.8-Clang-15] 65: Skip for Kokkos SIMD backends pending device-compatibility refactoring
[CUDA-11.8-Clang-15] 65: 
[CUDA-11.8-Clang-15] 65: [  SKIPPED ] simd.host_simd_construction_in_device (0 ms)
[CUDA-11.8-Clang-15] 65: [ RUN      ] simd.host_reductions
[CUDA-11.8-Clang-15] 65: [       OK ] simd.host_reductions (0 ms)
[CUDA-11.8-Clang-15] 65: [ RUN      ] simd.host_bitwise_ops
[CUDA-11.8-Clang-15] 65: [       OK ] simd.host_bitwise_ops (0 ms)
[CUDA-11.8-Clang-15] 65: [ RUN      ] simd.device_construction
[CUDA-11.8-Clang-15] 65: [       OK ] simd.device_construction (0 ms)
[CUDA-11.8-Clang-15] 65: [ RUN      ] simd.host_comparison_ops
[CUDA-11.8-Clang-15] 65: [       OK ] simd.host_comparison_ops (0 ms)
[CUDA-11.8-Clang-15] 65: [ RUN      ] simd.host_gen_ctors
[CUDA-11.8-Clang-15] 65: [       OK ] simd.host_gen_ctors (0 ms)
[CUDA-11.8-Clang-15] 65: [----------] 31 tests from simd (19 ms total)
[CUDA-11.8-Clang-15] 65: 
[CUDA-11.8-Clang-15] 65: [----------] Global test environment tear-down
[CUDA-11.8-Clang-15] 65: [==========] 31 tests from 1 test suite ran. (19 ms total)
[CUDA-11.8-Clang-15] 65: [  PASSED  ] 30 tests.
[CUDA-11.8-Clang-15] 65: [  SKIPPED ] 1 test, listed below:
[CUDA-11.8-Clang-15] 65: [  SKIPPED ] simd.host_simd_construction_in_device
[CUDA-11.8-Clang-15] 65/65 Test #65: Kokkos_UnitTest_SIMD .......................................   Passed    0.20 sec
[CUDA-11.8-Clang-15] 
[CUDA-11.8-Clang-15] 100% tests passed, 0 tests failed out of 65
[CUDA-11.8-Clang-15] 
[CUDA-11.8-Clang-15] Label Time Summary:
[CUDA-11.8-Clang-15] Kokkos    = 238.19 sec*proc (64 tests)
[CUDA-11.8-Clang-15] 
[CUDA-11.8-Clang-15] Total Test time (real) = 240.29 sec
Post stage
[Pipeline] sh
+ ccache --show-stats
Summary:
  Hits:              47 /  775 (6.06 %)
    Direct:          22 /  775 (2.84 %)
    Preprocessed:    25 /  753 (3.32 %)
  Misses:           728
    Direct:         753
    Preprocessed:   728
Primary storage:
  Hits:             411 / 1565 (26.26 %)
  Misses:          1154
  Cache size (GB): 4.38 / 5.00 (87.59 %)
  Cleanups:          16

Use the -v/--verbose option for more details.
[Pipeline] xunit
INFO: Processing CTest-Version 3.x (default)
[Pipeline] cleanWs
[WS-CLEANUP] Deleting project workspace...
[WS-CLEANUP] Deferred wipeout is used...
[WS-CLEANUP] done
[Pipeline] }
$ docker stop --time=1 17eaf06d4e09082c70c59aca32711b9e2097e7937e24a1f5bf334f3b27a2c355
INFO: [CTest-Version 3.x (default)] - 1 test report file(s) were found with the pattern 'build/Testing/**/Test.xml' relative to '/var/jenkins/workspace/Kokkos_PR-9650' for the testing framework 'CTest-Version 3.x (default)'.
$ docker rm -f --volumes 17eaf06d4e09082c70c59aca32711b9e2097e7937e24a1f5bf334f3b27a2c355
[Pipeline] // withDockerContainer
[Pipeline] }
[Pipeline] // withEnv
[Pipeline] }
[Pipeline] // node
[Pipeline] }
[Pipeline] // stage
[Pipeline] }
kkos_CoreUnitTest_InitializeFinalize.dir/TestInitializationSettings.cpp.o
[CUDA-12.2-NVHPC-AS-HOST-COMPILER] [ 43%] Building CXX object core/unit_test/CMakeFiles/Kokkos_CoreUnitTest_OpenMP.dir/openmp/TestOpenMP_RangePolicyExecutionTypes.cpp.o
[CUDA-12.2-NVHPC-AS-HOST-COMPILER] [ 43%] Building CXX object core/unit_test/CMakeFiles/Kokkos_CoreUnitTest_OpenMP.dir/openmp/TestOpenMP_TeamCombinedReducers.cpp.o
[CUDA-12.2-NVHPC-AS-HOST-COMPILER] [ 44%] Building CXX object core/unit_test/CMakeFiles/Kokkos_CoreUnitTest_InitializeFinalize.dir/TestInitializeFinalize.cpp.o
[CUDA-12.2-NVHPC-AS-HOST-COMPILER] [ 44%] Building CXX object core/unit_test/CMakeFiles/Kokkos_CoreUnitTest_OpenMP.dir/openmp/TestOpenMP_TeamPolicyConstructors.cpp.o
[CUDA-12.2-NVHPC-AS-HOST-COMPILER] [ 44%] Building CXX object core/unit_test/CMakeFiles/Kokkos_CoreUnitTest_Cuda1.dir/cuda/TestCuda_MDSpan.cpp.o
[CUDA-12.2-NVHPC-AS-HOST-COMPILER] [ 44%] Building CXX object core/unit_test/CMakeFiles/Kokkos_CoreUnitTest_OpenMP.dir/openmp/TestOpenMP_TeamReductionScan.cpp.o
[CUDA-12.2-NVHPC-AS-HOST-COMPILER] [ 44%] Building CXX object core/unit_test/CMakeFiles/Kokkos_CoreUnitTest_OpenMP.dir/openmp/TestOpenMP_TeamScan.cpp.o
[CUDA-12.2-NVHPC-AS-HOST-COMPILER] [ 44%] Building CXX object core/unit_test/CMakeFiles/Kokkos_CoreUnitTest_InitializeFinalize.dir/TestKokkosHelpCausesNormalProgramTermination.cpp.o
[CUDA-12.2-NVHPC-AS-HOST-COMPILER] [ 44%] Building CXX object core/unit_test/CMakeFiles/Kokkos_CoreUnitTest_OpenMP.dir/openmp/TestOpenMP_TeamScratch.cpp.o
[CUDA-12.2-NVHPC-AS-HOST-COMPILER] [ 44%] Building CXX object core/unit_test/CMakeFiles/Kokkos_CoreUnitTest_Default.dir/default/TestDefaultDeviceType_c3.cpp.o
[CUDA-12.2-NVHPC-AS-HOST-COMPILER] [ 44%] Building CXX object core/unit_test/CMakeFiles/Kokkos_CoreUnitTest_InitializeFinalize.dir/TestLegionInitialization.cpp.o
[CUDA-12.2-NVHPC-AS-HOST-COMPILER] [ 45%] Building CXX object core/unit_test/CMakeFiles/Kokkos_CoreUnitTest_Cuda1.dir/cuda/TestCuda_MDSpanAtomicAccessor.cpp.o
[CUDA-12.2-NVHPC-AS-HOST-COMPILER] [ 45%] Building CXX object core/unit_test/CMakeFiles/Kokkos_CoreUnitTest_OpenMP.dir/openmp/TestOpenMP_TeamTeamSize.cpp.o
[CUDA-12.2-NVHPC-AS-HOST-COMPILER] [ 45%] Building CXX object core/unit_test/CMakeFiles/Kokkos_CoreUnitTest_Cuda1.dir/cuda/TestCuda_MDSpanConversion.cpp.o
[CUDA-12.2-NVHPC-AS-HOST-COMPILER] [ 45%] Building CXX object core/unit_test/CMakeFiles/Kokkos_CoreUnitTest_OpenMP.dir/openmp/TestOpenMP_Timer.cpp.o
[CUDA-12.2-NVHPC-AS-HOST-COMPILER] [ 45%] Building CXX object core/unit_test/CMakeFiles/Kokkos_CoreUnitTest_InitializeFinalize.dir/TestParseCmdLineArgsAndEnvVars.cpp.o
[CUDA-12.2-NVHPC-AS-HOST-COMPILER] [ 45%] Building CXX object core/unit_test/CMakeFiles/Kokkos_CoreUnitTest_Cuda2.dir/cuda/TestCuda_WithoutInitializing.cpp.o
[CUDA-12.2-NVHPC-AS-HOST-COMPILER] [ 45%] Building CXX object core/unit_test/CMakeFiles/Kokkos_CoreUnitTest_OpenMP.dir/openmp/TestOpenMP_UniqueToken.cpp.o
[CUDA-12.2-NVHPC-AS-HOST-COMPILER] [ 45%] Building CXX object core/unit_test/CMakeFiles/Kokkos_CoreUnitTest_InitializeFinalize.dir/TestPushFinalizeHook.cpp.o
[CUDA-12.2-NVHPC-AS-HOST-COMPILER] [ 45%] Building CXX object core/unit_test/CMakeFiles/Kokkos_CoreUnitTest_InitializeFinalize.dir/TestScopeGuard.cpp.o
[CUDA-12.2-NVHPC-AS-HOST-COMPILER] [ 45%] Building CXX object core/unit_test/CMakeFiles/Kokkos_CoreUnitTest_Cuda1.dir/cuda/TestCuda_MinMaxClamp.cpp.o
[CUDA-12.2-NVHPC-AS-HOST-COMPILER] [ 46%] Building CXX object core/unit_test/CMakeFiles/Kokkos_CoreUnitTest_OpenMP.dir/openmp/TestOpenMP_View_64bit.cpp.o
[CUDA-12.2-NVHPC-AS-HOST-COMPILER] [ 46%] Building CXX object core/unit_test/CMakeFiles/Kokkos_CoreUnitTest_OpenMP.dir/openmp/TestOpenMP_ViewAPI_b.cpp.o
[CUDA-12.2-NVHPC-AS-HOST-COMPILER] [ 46%] Linking CXX executable Kokkos_CoreUnitTest_InitializeFinalize
[CUDA-12.2-NVHPC-AS-HOST-COMPILER] [ 46%] Built target Kokkos_CoreUnitTest_InitializeFinalize
[CUDA-12.2-NVHPC-AS-HOST-COMPILER] [ 46%] Building CXX object core/unit_test/CMakeFiles/Kokkos_CoreUnitTest_OpenMP.dir/openmp/TestOpenMP_ViewAPI_c.cpp.o
[CUDA-12.2-NVHPC-AS-HOST-COMPILER] [ 46%] Building CXX object core/unit_test/CMakeFiles/Kokkos_CoreUnitTest_Develop.dir/UnitTestMainInit.cpp.o
[CUDA-12.2-NVHPC-AS-HOST-COMPILER] [ 46%] Building CXX object core/unit_test/CMakeFiles/Kokkos_CoreUnitTest_Default.dir/default/TestDefaultDeviceTypeResize.cpp.o
[CUDA-12.2-NVHPC-AS-HOST-COMPILER] [ 46%] Building CXX object core/unit_test/CMakeFiles/Kokkos_CoreUnitTest_Default.dir/default/TestDefaultDeviceTypeViewAPI.cpp.o
[CUDA-12.2-NVHPC-AS-HOST-COMPILER] [ 46%] Building CXX object core/unit_test/CMakeFiles/Kokkos_CoreUnitTest_OpenMP.dir/openmp/TestOpenMP_ViewAPI_d.cpp.o
[CUDA-12.2-NVHPC-AS-HOST-COMPILER] [ 46%] Building CXX object core/unit_test/CMakeFiles/Kokkos_CoreUnitTest_Develop.dir/default/TestDefaultDeviceDevelop.cpp.o
[CUDA-12.2-NVHPC-AS-HOST-COMPILER] [ 46%] Building CXX object core/unit_test/CMakeFiles/Kokkos_CoreUnitTest_Cuda1.dir/cuda/TestCuda_NumericTraits.cpp.o
[CUDA-12.2-NVHPC-AS-HOST-COMPILER] [ 46%] Building CXX object core/unit_test/CMakeFiles/Kokkos_CoreUnitTest_Cuda2.dir/cuda/TestCuda_SubView_a.cpp.o
[CUDA-12.2-NVHPC-AS-HOST-COMPILER] [ 46%] Building CXX object core/unit_test/CMakeFiles/Kokkos_CoreUnitTest_Cuda1.dir/cuda/TestCuda_OccupancyControlTrait.cpp.o
[CUDA-12.2-NVHPC-AS-HOST-COMPILER] [ 46%] Building CXX object core/unit_test/CMakeFiles/Kokkos_CoreUnitTest_Cuda1.dir/cuda/TestCuda_Other.cpp.o
[CUDA-12.2-NVHPC-AS-HOST-COMPILER] [ 46%] Linking CXX executable Kokkos_CoreUnitTest_Develop
[CUDA-12.2-NVHPC-AS-HOST-COMPILER] [ 46%] Built target Kokkos_CoreUnitTest_Develop
[CUDA-12.2-NVHPC-AS-HOST-COMPILER] [ 46%] Building CXX object core/unit_test/CMakeFiles/Kokkos_CoreUnitTest_KokkosP.dir/UnitTestMainInit.cpp.o
[CUDA-12.2-NVHPC-AS-HOST-COMPILER] [ 46%] Building CXX object core/unit_test/CMakeFiles/Kokkos_CoreUnitTest_KokkosP.dir/tools/TestEventCorrectness.cpp.o
[CUDA-12.2-NVHPC-AS-HOST-COMPILER] [ 46%] Building CXX object core/unit_test/CMakeFiles/Kokkos_CoreUnitTest_OpenMP.dir/openmp/TestOpenMP_ViewAPI_e.cpp.o
[CUDA-12.2-NVHPC-AS-HOST-COMPILER] [ 46%] Building CXX object core/unit_test/CMakeFiles/Kokkos_CoreUnitTest_OpenMP.dir/openmp/TestOpenMP_ViewBadAlloc.cpp.o
[CUDA-12.2-NVHPC-AS-HOST-COMPILER] [ 46%] Building CXX object core/unit_test/CMakeFiles/Kokkos_CoreUnitTest_OpenMP.dir/openmp/TestOpenMP_ViewCopy_a.cpp.o
[CUDA-12.2-NVHPC-AS-HOST-COMPILER] [ 46%] Building CXX object core/unit_test/CMakeFiles/Kokkos_CoreUnitTest_OpenMP.dir/openmp/TestOpenMP_ViewCopy_b.cpp.o
[CUDA-12.2-NVHPC-AS-HOST-COMPILER] [ 47%] Building CXX object core/unit_test/CMakeFiles/Kokkos_CoreUnitTest_KokkosP.dir/tools/TestKernelNames.cpp.o
[CUDA-12.2-NVHPC-AS-HOST-COMPILER] [ 47%] Building CXX object core/unit_test/CMakeFiles/Kokkos_CoreUnitTest_Cuda2.dir/cuda/TestCuda_SubView_b.cpp.o
[CUDA-12.2-NVHPC-AS-HOST-COMPILER] [ 47%] Building CXX object core/unit_test/CMakeFiles/Kokkos_CoreUnitTest_KokkosP.dir/tools/TestProfilingSection.cpp.o
[CUDA-12.2-NVHPC-AS-HOST-COMPILER] [ 47%] Building CXX object core/unit_test/CMakeFiles/Kokkos_CoreUnitTest_KokkosP.dir/tools/TestScopedRegion.cpp.o
[CUDA-12.2-NVHPC-AS-HOST-COMPILER] [ 47%] Building CXX object core/unit_test/CMakeFiles/Kokkos_CoreUnitTest_KokkosP.dir/tools/TestWithoutInitializing.cpp.o
[CUDA-12.2-NVHPC-AS-HOST-COMPILER] [ 47%] Building CXX object core/unit_test/CMakeFiles/Kokkos_CoreUnitTest_OpenMP.dir/openmp/TestOpenMP_ViewCopy_c.cpp.o
[CUDA-12.2-NVHPC-AS-HOST-COMPILER] [ 48%] Building CXX object core/unit_test/CMakeFiles/Kokkos_CoreUnitTest_OpenMP.dir/openmp/TestOpenMP_ViewCtorDimMatch.cpp.o
[CUDA-12.2-NVHPC-AS-HOST-COMPILER] [ 48%] Building CXX object core/unit_test/CMakeFiles/Kokkos_CoreUnitTest_OpenMP.dir/openmp/TestOpenMP_ViewCtorProp.cpp.o
[CUDA-12.2-NVHPC-AS-HOST-COMPILER] [ 48%] Building CXX object core/unit_test/CMakeFiles/Kokkos_CoreUnitTest_OpenMP.dir/openmp/TestOpenMP_ViewEmptyRuntimeUnmanaged.cpp.o
[CUDA-12.2-NVHPC-AS-HOST-COMPILER] [ 48%] Building CXX object core/unit_test/CMakeFiles/Kokkos_CoreUnitTest_Cuda2.dir/cuda/TestCuda_SubView_c01.cpp.o
[CUDA-12.2-NVHPC-AS-HOST-COMPILER] [ 48%] Building CXX object core/unit_test/CMakeFiles/Kokkos_CoreUnitTest_OpenMP.dir/openmp/TestOpenMP_ViewHooks.cpp.o
[CUDA-12.2-NVHPC-AS-HOST-COMPILER] [ 48%] Building CXX object core/unit_test/CMakeFiles/Kokkos_CoreUnitTest_OpenMP.dir/openmp/TestOpenMP_ViewLayoutStrideAssignment.cpp.o
[CUDA-12.2-NVHPC-AS-HOST-COMPILER] [ 48%] Linking CXX executable Kokkos_CoreUnitTest_KokkosP
[CUDA-12.2-NVHPC-AS-HOST-COMPILER] [ 48%] Built target Kokkos_CoreUnitTest_KokkosP
[CUDA-12.2-NVHPC-AS-HOST-COMPILER] [ 48%] Building CXX object core/unit_test/CMakeFiles/Kokkos_CoreUnitTest_ToolIndependence.dir/tools/TestIndependence.cpp.o
[CUDA-12.2-NVHPC-AS-HOST-COMPILER] [ 49%] Linking CXX executable Kokkos_CoreUnitTest_ToolIndependence
[CUDA-12.2-NVHPC-AS-HOST-COMPILER] [ 49%] Built target Kokkos_CoreUnitTest_ToolIndependence
[CUDA-12.2-NVHPC-AS-HOST-COMPILER] [ 49%] Building CXX object core/unit_test/CMakeFiles/Kokkos_ProfilingAllCalls.dir/tools/TestAllCalls.cpp.o
[CUDA-12.2-NVHPC-AS-HOST-COMPILER] [ 49%] Linking CXX executable Kokkos_CoreUnitTest_Default
[CUDA-12.2-NVHPC-AS-HOST-COMPILER] [ 49%] Built target Kokkos_CoreUnitTest_Default
[CUDA-12.2-NVHPC-AS-HOST-COMPILER] [ 49%] Building CXX object core/unit_test/CMakeFiles/Kokkos_ToolsInitialization.dir/UnitTestMain.cpp.o
[CUDA-12.2-NVHPC-AS-HOST-COMPILER] [ 49%] Building CXX object core/unit_test/CMakeFiles/Kokkos_ToolsInitialization.dir/tools/TestToolsInitialization.cpp.o
[CUDA-12.2-NVHPC-AS-HOST-COMPILER] [ 49%] Building CXX object core/unit_test/CMakeFiles/Kokkos_CoreUnitTest_Cuda1.dir/cuda/TestCuda_ParallelScanRangePolicy.cpp.o
[CUDA-12.2-NVHPC-AS-HOST-COMPILER] [ 49%] Building CXX object core/unit_test/CMakeFiles/Kokkos_CoreUnitTest_Cuda2.dir/cuda/TestCuda_SubView_c02.cpp.o
[CUDA-12.2-NVHPC-AS-HOST-COMPILER] [ 49%] Building CXX object core/unit_test/CMakeFiles/Kokkos_CoreUnitTest_Cuda1.dir/cuda/TestCuda_CustomScalarParallelScan.cpp.o
[CUDA-12.2-NVHPC-AS-HOST-COMPILER] [ 49%] Building CXX object core/unit_test/CMakeFiles/Kokkos_CoreUnitTest_Cuda2.dir/cuda/TestCuda_SubView_c03.cpp.o
[CUDA-12.2-NVHPC-AS-HOST-COMPILER] [ 49%] Linking CXX executable Kokkos_ProfilingAllCalls
[CUDA-12.2-NVHPC-AS-HOST-COMPILER] [ 49%] Built target Kokkos_ProfilingAllCalls
[CUDA-12.2-NVHPC-AS-HOST-COMPILER] [ 49%] Building CXX object core/unit_test/CMakeFiles/Kokkos_EmptyProfilingLibraryDeathTest.dir/UnitTestMain.cpp.o
[CUDA-12.2-NVHPC-AS-HOST-COMPILER] [ 49%] Building CXX object core/unit_test/CMakeFiles/Kokkos_EmptyProfilingLibraryDeathTest.dir/tools/TestEmptyProfilingLibrary.cpp.o
[CUDA-12.2-NVHPC-AS-HOST-COMPILER] [ 49%] Linking CXX executable Kokkos_ToolsInitialization
[CUDA-12.2-NVHPC-AS-HOST-COMPILER] [ 49%] Built target Kokkos_ToolsInitialization
[CUDA-12.2-NVHPC-AS-HOST-COMPILER] [ 49%] Building CXX object core/unit_test/CMakeFiles/Kokkos_StackTraceTestExec.dir/TestStackTrace.cpp.o
[CUDA-12.2-NVHPC-AS-HOST-COMPILER] [ 49%] Building CXX object core/unit_test/CMakeFiles/Kokkos_StackTraceTestExec.dir/TestStackTrace_f0.cpp.o
[CUDA-12.2-NVHPC-AS-HOST-COMPILER] [ 49%] Building CXX object core/unit_test/CMakeFiles/Kokkos_CoreUnitTest_Cuda1.dir/cuda/TestCuda_Printf.cpp.o
[CUDA-12.2-NVHPC-AS-HOST-COMPILER] [ 49%] Building CXX object core/unit_test/CMakeFiles/Kokkos_CoreUnitTest_Cuda2.dir/cuda/TestCuda_SubView_c04.cpp.o
[CUDA-12.2-NVHPC-AS-HOST-COMPILER] [ 49%] Linking CXX executable Kokkos_EmptyProfilingLibraryDeathTest
[CUDA-12.2-NVHPC-AS-HOST-COMPILER] [ 49%] Building CXX object core/unit_test/CMakeFiles/Kokkos_StackTraceTestExec.dir/TestStackTrace_f1.cpp.o
[CUDA-12.2-NVHPC-AS-HOST-COMPILER] [ 49%] Built target Kokkos_EmptyProfilingLibraryDeathTest
[CUDA-12.2-NVHPC-AS-HOST-COMPILER] [ 49%] Building CXX object core/unit_test/CMakeFiles/Kokkos_CoreUnitTest_OpenMP.dir/openmp/TestOpenMP_ViewMapping_a.cpp.o
[CUDA-12.2-NVHPC-AS-HOST-COMPILER] [ 49%] Building CXX object core/unit_test/CMakeFiles/Kokkos_CoreUnitTest_OpenMP.dir/openmp/TestOpenMP_ViewMapping_b.cpp.o
[CUDA-12.2-NVHPC-AS-HOST-COMPILER] [ 49%] Building CXX object core/unit_test/CMakeFiles/Kokkos_StackTraceTestExec.dir/TestStackTrace_f2.cpp.o
[CUDA-12.2-NVHPC-AS-HOST-COMPILER] [ 49%] Building CXX object core/unit_test/CMakeFiles/Kokkos_StackTraceTestExec.dir/TestStackTrace_f3.cpp.o
[CUDA-12.2-NVHPC-AS-HOST-COMPILER] [ 49%] Building CXX object core/unit_test/CMakeFiles/Kokkos_StackTraceTestExec.dir/TestStackTrace_f4.cpp.o
[CUDA-12.2-NVHPC-AS-HOST-COMPILER] [ 50%] Building CXX object core/unit_test/CMakeFiles/Kokkos_CoreUnitTest_Cuda1.dir/cuda/TestCuda_QuadPrecisionMath.cpp.o
[CUDA-12.2-NVHPC-AS-HOST-COMPILER] [ 50%] Building CXX object core/unit_test/CMakeFiles/Kokkos_IncrementalTest_OPENMP.dir/UnitTestMainInit.cpp.o
[CUDA-12.2-NVHPC-AS-HOST-COMPILER] [ 50%] Building CXX object core/unit_test/CMakeFiles/Kokkos_IncrementalTest_OPENMP.dir/generated/Test01_execspace_OPENMP.cpp.o
[CUDA-12.2-NVHPC-AS-HOST-COMPILER] [ 51%] Linking CXX executable Kokkos_StackTraceTestExec
[CUDA-12.2-NVHPC-AS-HOST-COMPILER] [ 51%] Building CXX object core/unit_test/CMakeFiles/Kokkos_IncrementalTest_OPENMP.dir/generated/Test02_atomic_host_OPENMP.cpp.o
[CUDA-12.2-NVHPC-AS-HOST-COMPILER] [ 51%] Built target Kokkos_StackTraceTestExec
[CUDA-12.2-NVHPC-AS-HOST-COMPILER] [ 52%] Building CXX object core/unit_test/CMakeFiles/Kokkos_IncrementalTest_OPENMP.dir/generated/Test03a_MemorySpace_malloc_OPENMP.cpp.o
[CUDA-12.2-NVHPC-AS-HOST-COMPILER] [ 52%] Building CXX object core/unit_test/CMakeFiles/Kokkos_IncrementalTest_OPENMP.dir/generated/Test03b_MemorySpace_free_OPENMP.cpp.o
[CUDA-12.2-NVHPC-AS-HOST-COMPILER] [ 52%] Building CXX object core/unit_test/CMakeFiles/Kokkos_IncrementalTest_CUDA.dir/UnitTestMainInit.cpp.o
[CUDA-12.2-NVHPC-AS-HOST-COMPILER] [ 52%] Building CXX object core/unit_test/CMakeFiles/Kokkos_CoreUnitTest_CTestDevice.dir/UnitTestMain.cpp.o
[CUDA-12.2-NVHPC-AS-HOST-COMPILER] [ 52%] Building CXX object core/unit_test/CMakeFiles/Kokkos_CoreUnitTest_CTestDevice.dir/TestCTestDevice.cpp.o
[CUDA-12.2-NVHPC-AS-HOST-COMPILER] [ 52%] Building CXX object core/unit_test/CMakeFiles/Kokkos_CoreUnitTest_OpenMP.dir/openmp/TestOpenMP_ViewMapping_subview.cpp.o
[CUDA-12.2-NVHPC-AS-HOST-COMPILER] [ 52%] Building CXX object core/unit_test/CMakeFiles/Kokkos_IncrementalTest_OPENMP.dir/generated/Test04_ParallelFor_RangePolicy_OPENMP.cpp.o
[CUDA-12.2-NVHPC-AS-HOST-COMPILER] [ 52%] Building CXX object core/unit_test/CMakeFiles/Kokkos_CoreUnitTest_CMakePassCmdLineArgs.dir/UnitTest_CMakePassCmdLineArgs.cpp.o
[CUDA-12.2-NVHPC-AS-HOST-COMPILER] [ 52%] Building CXX object core/unit_test/CMakeFiles/Kokkos_CoreUnitTest_OpenMP.dir/openmp/TestOpenMP_ViewMemoryAccessViolation.cpp.o
[CUDA-12.2-NVHPC-AS-HOST-COMPILER] [ 52%] Linking CXX executable Kokkos_CoreUnitTest_CTestDevice
[CUDA-12.2-NVHPC-AS-HOST-COMPILER] [ 52%] Built target Kokkos_CoreUnitTest_CTestDevice
[CUDA-12.2-NVHPC-AS-HOST-COMPILER] [ 52%] Building CXX object core/unit_test/CMakeFiles/Kokkos_CoreUnitTest_CMakeTriBITSCompatibility.dir/UnitTest_CMakeTriBITSCompatibility.cpp.o
[CUDA-12.2-NVHPC-AS-HOST-COMPILER] [ 52%] Linking CXX executable Kokkos_CoreUnitTest_CMakePassCmdLineArgs
[CUDA-12.2-NVHPC-AS-HOST-COMPILER] [ 52%] Built target Kokkos_CoreUnitTest_CMakePassCmdLineArgs
[CUDA-12.2-NVHPC-AS-HOST-COMPILER] [ 53%] Building CXX object core/unit_test/CMakeFiles/Kokkos_CoreUnitTest_OpenMP.dir/openmp/TestOpenMP_ViewMove.cpp.o
[CUDA-12.2-NVHPC-AS-HOST-COMPILER] [ 53%] Building CXX object core/unit_test/CMakeFiles/Kokkos_IncrementalTest_CUDA.dir/generated/Test01_execspace_CUDA.cpp.o
[CUDA-12.2-NVHPC-AS-HOST-COMPILER] [ 53%] Linking CXX executable Kokkos_CoreUnitTest_CMakeTriBITSCompatibility
[CUDA-12.2-NVHPC-AS-HOST-COMPILER] [ 53%] Built target Kokkos_CoreUnitTest_CMakeTriBITSCompatibility
[CUDA-12.2-NVHPC-AS-HOST-COMPILER] [ 53%] Building CXX object core/unit_test/headers_self_contained/CMakeFiles/Kokkos_HeaderSelfContained_KokkosExp_InterOp_hpp.dir/tstHeader.cpp.o
[CUDA-12.2-NVHPC-AS-HOST-COMPILER] [ 53%] Building CXX object core/unit_test/CMakeFiles/Kokkos_IncrementalTest_CUDA.dir/generated/Test02_atomic_host_CUDA.cpp.o
[CUDA-12.2-NVHPC-AS-HOST-COMPILER] [ 53%] Building CXX object core/unit_test/CMakeFiles/Kokkos_IncrementalTest_OPENMP.dir/generated/Test05_ParallelReduce_RangePolicy_OPENMP.cpp.o
[CUDA-12.2-NVHPC-AS-HOST-COMPILER] [ 53%] Linking CXX executable Kokkos_HeaderSelfContained_KokkosExp_InterOp_hpp
[CUDA-12.2-NVHPC-AS-HOST-COMPILER] [ 53%] Built target Kokkos_HeaderSelfContained_KokkosExp_InterOp_hpp
[CUDA-12.2-NVHPC-AS-HOST-COMPILER] [ 53%] Building CXX object core/unit_test/CMakeFiles/Kokkos_IncrementalTest_OPENMP.dir/generated/Test06_ParallelFor_MDRangePolicy_OPENMP.cpp.o
[CUDA-12.2-NVHPC-AS-HOST-COMPILER] [ 53%] Building CXX object core/unit_test/headers_self_contained/CMakeFiles/Kokkos_HeaderSelfContained_KokkosExp_MDRangePolicy_hpp.dir/tstHeader.cpp.o
[CUDA-12.2-NVHPC-AS-HOST-COMPILER] [ 53%] Building CXX object core/unit_test/headers_self_contained/CMakeFiles/Kokkos_HeaderSelfContained_Kokkos_Abort_hpp.dir/tstHeader.cpp.o
[CUDA-12.2-NVHPC-AS-HOST-COMPILER] [ 53%] Building CXX object core/unit_test/CMakeFiles/Kokkos_CoreUnitTest_Cuda1.dir/cuda/TestCuda_RangePolicyConstructors.cpp.o
[CUDA-12.2-NVHPC-AS-HOST-COMPILER] [ 53%] Building CXX object core/unit_test/CMakeFiles/Kokkos_CoreUnitTest_OpenMP.dir/openmp/TestOpenMP_ViewOfClass.cpp.o
[CUDA-12.2-NVHPC-AS-HOST-COMPILER] [ 53%] Linking CXX executable Kokkos_HeaderSelfContained_KokkosExp_MDRangePolicy_hpp
[CUDA-12.2-NVHPC-AS-HOST-COMPILER] [ 53%] Built target Kokkos_HeaderSelfContained_KokkosExp_MDRangePolicy_hpp
[CUDA-12.2-NVHPC-AS-HOST-COMPILER] [ 53%] Building CXX object core/unit_test/CMakeFiles/Kokkos_CoreUnitTest_OpenMP.dir/openmp/TestOpenMP_ViewOfViews.cpp.o
[CUDA-12.2-NVHPC-AS-HOST-COMPILER] [ 53%] Building CXX object core/unit_test/CMakeFiles/Kokkos_IncrementalTest_CUDA.dir/generated/Test03a_MemorySpace_malloc_CUDA.cpp.o
[CUDA-12.2-NVHPC-AS-HOST-COMPILER] [ 54%] Linking CXX executable Kokkos_HeaderSelfContained_Kokkos_Abort_hpp
[CUDA-12.2-NVHPC-AS-HOST-COMPILER] [ 54%] Built target Kokkos_HeaderSelfContained_Kokkos_Abort_hpp
[CUDA-12.2-NVHPC-AS-HOST-COMPILER] [ 54%] Building CXX object core/unit_test/headers_self_contained/CMakeFiles/Kokkos_HeaderSelfContained_Kokkos_AcquireUniqueTokenImpl_hpp.dir/tstHeader.cpp.o
[CUDA-12.2-NVHPC-AS-HOST-COMPILER] [ 54%] Building CXX object core/unit_test/CMakeFiles/Kokkos_CoreUnitTest_OpenMP.dir/openmp/TestOpenMP_ViewOutOfBoundsAccess.cpp.o
[CUDA-12.2-NVHPC-AS-HOST-COMPILER] [ 54%] Building CXX object core/unit_test/CMakeFiles/Kokkos_IncrementalTest_OPENMP.dir/generated/Test08_deep_copy_OPENMP.cpp.o
[CUDA-12.2-NVHPC-AS-HOST-COMPILER] [ 54%] Linking CXX executable Kokkos_HeaderSelfContained_Kokkos_AcquireUniqueTokenImpl_hpp
[CUDA-12.2-NVHPC-AS-HOST-COMPILER] [ 54%] Built target Kokkos_HeaderSelfContained_Kokkos_AcquireUniqueTokenImpl_hpp
[CUDA-12.2-NVHPC-AS-HOST-COMPILER] [ 54%] Building CXX object core/unit_test/CMakeFiles/Kokkos_CoreUnitTest_OpenMP.dir/openmp/TestOpenMP_ViewResize.cpp.o
[CUDA-12.2-NVHPC-AS-HOST-COMPILER] [ 54%] Building CXX object core/unit_test/CMakeFiles/Kokkos_IncrementalTest_CUDA.dir/generated/Test03b_MemorySpace_free_CUDA.cpp.o
[CUDA-12.2-NVHPC-AS-HOST-COMPILER] [ 54%] Building CXX object core/unit_test/CMakeFiles/Kokkos_IncrementalTest_CUDA.dir/generated/Test04_ParallelFor_RangePolicy_CUDA.cpp.o
[CUDA-12.2-NVHPC-AS-HOST-COMPILER] [ 54%] Building CXX object core/unit_test/CMakeFiles/Kokkos_IncrementalTest_CUDA.dir/generated/Test05_ParallelReduce_RangePolicy_CUDA.cpp.o
[CUDA-12.2-NVHPC-AS-HOST-COMPILER] [ 54%] Building CXX object core/unit_test/CMakeFiles/Kokkos_CoreUnitTest_Cuda2.dir/cuda/TestCuda_SubView_c05.cpp.o
[CUDA-12.2-NVHPC-AS-HOST-COMPILER] [ 54%] Building CXX object core/unit_test/CMakeFiles/Kokkos_IncrementalTest_OPENMP.dir/generated/Test10_HierarchicalBasics_OPENMP.cpp.o
[CUDA-12.2-NVHPC-AS-HOST-COMPILER] [ 54%] Building CXX object core/unit_test/CMakeFiles/Kokkos_CoreUnitTest_Cuda1.dir/cuda/TestCuda_RangePolicyRequire.cpp.o
[CUDA-12.2-NVHPC-AS-HOST-COMPILER] [ 54%] Building CXX object core/unit_test/CMakeFiles/Kokkos_IncrementalTest_OPENMP.dir/generated/Test11a_ParallelFor_TeamThreadRange_OPENMP.cpp.o
[CUDA-12.2-NVHPC-AS-HOST-COMPILER] [ 54%] Building CXX object core/unit_test/CMakeFiles/Kokkos_IncrementalTest_OPENMP.dir/generated/Test11b_ParallelFor_TeamVectorRange_OPENMP.cpp.o
[CUDA-12.2-NVHPC-AS-HOST-COMPILER] [ 55%] Building CXX object core/unit_test/CMakeFiles/Kokkos_IncrementalTest_CUDA.dir/generated/Test06_ParallelFor_MDRangePolicy_CUDA.cpp.o
[CUDA-12.2-NVHPC-AS-HOST-COMPILER] [ 55%] Building CXX object core/unit_test/CMakeFiles/Kokkos_CoreUnitTest_OpenMP.dir/openmp/TestOpenMP_WithoutInitializing.cpp.o
[CUDA-12.2-NVHPC-AS-HOST-COMPILER] [ 55%] Building CXX object core/unit_test/CMakeFiles/Kokkos_CoreUnitTest_OpenMP.dir/openmp/TestOpenMP_SubView_a.cpp.o
[CUDA-12.2-NVHPC-AS-HOST-COMPILER] [ 55%] Building CXX object core/unit_test/CMakeFiles/Kokkos_CoreUnitTest_OpenMP.dir/openmp/TestOpenMP_SubView_b.cpp.o
[CUDA-12.2-NVHPC-AS-HOST-COMPILER] [ 56%] Building CXX object core/unit_test/CMakeFiles/Kokkos_IncrementalTest_OPENMP.dir/generated/Test11c_ParallelFor_ThreadVectorRange_OPENMP.cpp.o
[CUDA-12.2-NVHPC-AS-HOST-COMPILER] [ 56%] Building CXX object core/unit_test/CMakeFiles/Kokkos_IncrementalTest_CUDA.dir/generated/Test08_deep_copy_CUDA.cpp.o
[CUDA-12.2-NVHPC-AS-HOST-COMPILER] [ 56%] Building CXX object core/unit_test/CMakeFiles/Kokkos_CoreUnitTest_Cuda1.dir/cuda/TestCuda_ReducerCTADs.cpp.o
[CUDA-12.2-NVHPC-AS-HOST-COMPILER] [ 56%] Building CXX object core/unit_test/CMakeFiles/Kokkos_IncrementalTest_OPENMP.dir/generated/Test12a_ThreadScratch_OPENMP.cpp.o
[CUDA-12.2-NVHPC-AS-HOST-COMPILER] [ 56%] Building CXX object core/unit_test/CMakeFiles/Kokkos_CoreUnitTest_Cuda1.dir/cuda/TestCuda_Reducers_a.cpp.o
[CUDA-12.2-NVHPC-AS-HOST-COMPILER] [ 56%] Building CXX object core/unit_test/CMakeFiles/Kokkos_IncrementalTest_OPENMP.dir/generated/Test12b_TeamScratch_OPENMP.cpp.o
[CUDA-12.2-NVHPC-AS-HOST-COMPILER] [ 56%] Building CXX object core/unit_test/CMakeFiles/Kokkos_IncrementalTest_OPENMP.dir/generated/Test13a_ParallelRed_TeamThreadRange_OPENMP.cpp.o
[CUDA-12.2-NVHPC-AS-HOST-COMPILER] [ 56%] Building CXX object core/unit_test/CMakeFiles/Kokkos_CoreUnitTest_OpenMP.dir/openmp/TestOpenMP_SubView_c01.cpp.o
[CUDA-12.2-NVHPC-AS-HOST-COMPILER] [ 56%] Building CXX object core/unit_test/CMakeFiles/Kokkos_IncrementalTest_OPENMP.dir/generated/Test13b_ParallelRed_TeamVectorRange_OPENMP.cpp.o
[CUDA-12.2-NVHPC-AS-HOST-COMPILER] [ 56%] Building CXX object core/unit_test/CMakeFiles/Kokkos_IncrementalTest_CUDA.dir/generated/Test10_HierarchicalBasics_CUDA.cpp.o
[CUDA-12.2-NVHPC-AS-HOST-COMPILER] [ 56%] Building CXX object core/unit_test/CMakeFiles/Kokkos_CoreUnitTest_OpenMP.dir/openmp/TestOpenMP_SubView_c02.cpp.o
[CUDA-12.2-NVHPC-AS-HOST-COMPILER] [ 57%] Building CXX object core/unit_test/CMakeFiles/Kokkos_CoreUnitTest_OpenMP.dir/openmp/TestOpenMP_SubView_c03.cpp.o
[CUDA-12.2-NVHPC-AS-HOST-COMPILER] [ 57%] Building CXX object core/unit_test/CMakeFiles/Kokkos_IncrementalTest_OPENMP.dir/generated/Test13c_ParallelRed_ThreadVectorRange_OPENMP.cpp.o
[CUDA-12.2-NVHPC-AS-HOST-COMPILER] [ 57%] Building CXX object core/unit_test/CMakeFiles/Kokkos_CoreUnitTest_OpenMP.dir/openmp/TestOpenMP_SubView_c04.cpp.o
[CUDA-12.2-NVHPC-AS-HOST-COMPILER] [ 57%] Building CXX object core/unit_test/CMakeFiles/Kokkos_IncrementalTest_OPENMP.dir/generated/Test14_MDRangeReduce_OPENMP.cpp.o
[CUDA-12.2-NVHPC-AS-HOST-COMPILER] [ 57%] Building CXX object core/unit_test/CMakeFiles/Kokkos_IncrementalTest_CUDA.dir/generated/Test11a_ParallelFor_TeamThreadRange_CUDA.cpp.o
[CUDA-12.2-NVHPC-AS-HOST-COMPILER] [ 57%] Building CXX object core/unit_test/CMakeFiles/Kokkos_IncrementalTest_CUDA.dir/generated/Test11b_ParallelFor_TeamVectorRange_CUDA.cpp.o
[CUDA-12.2-NVHPC-AS-HOST-COMPILER] [ 57%] Building CXX object core/unit_test/CMakeFiles/Kokkos_IncrementalTest_CUDA.dir/generated/Test11c_ParallelFor_ThreadVectorRange_CUDA.cpp.o
[CUDA-12.2-NVHPC-AS-HOST-COMPILER] [ 57%] Building CXX object core/unit_test/CMakeFiles/Kokkos_CoreUnitTest_OpenMP.dir/openmp/TestOpenMP_SubView_c05.cpp.o
[CUDA-12.2-NVHPC-AS-HOST-COMPILER] [ 58%] Building CXX object core/unit_test/CMakeFiles/Kokkos_CoreUnitTest_Cuda2.dir/cuda/TestCuda_SubView_c06.cpp.o
[CUDA-12.2-NVHPC-AS-HOST-COMPILER] [ 58%] Building CXX object core/unit_test/CMakeFiles/Kokkos_IncrementalTest_OPENMP.dir/generated/Test16_ParallelScan_OPENMP.cpp.o
[CUDA-12.2-NVHPCancelling nested steps due to timeout
Sending interrupt signal to process
Sending interrupt signal to process
Post stage
Post stage
[Pipeline] xunit
[Pipeline] sh
INFO: Processing CTest-Version 3.x (default)
Error when executing always post condition:
Also:   hudson.remoting.Channel$CallSiteStackTrace: Remote call to JNLP4-connect connection from 10.64.200.172/10.64.200.172:39874
		at hudson.remoting.Channel.attachCallSiteStackTrace(Channel.java:1916)
		at hudson.remoting.UserRequest$ExceptionResponse.retrieve(UserRequest.java:384)
		at hudson.remoting.Channel.call(Channel.java:1108)
		at hudson.FilePath.act(FilePath.java:1220)
		at hudson.FilePath.act(FilePath.java:1209)
		at PluginClassLoader for xunit//org.jenkinsci.plugins.xunit.XUnitProcessor.processTestsReport(XUnitProcessor.java:214)
		at PluginClassLoader for xunit//org.jenkinsci.plugins.xunit.XUnitProcessor.process(XUnitProcessor.java:163)
		at PluginClassLoader for xunit//org.jenkinsci.plugins.xunit.pipeline.XUnitResultsStepExecution.run(XUnitResultsStepExecution.java:94)
		at PluginClassLoader for xunit//org.jenkinsci.plugins.xunit.pipeline.XUnitResultsStepExecution.run(XUnitResultsStepExecution.java:53)
		at PluginClassLoader for workflow-step-api//org.jenkinsci.plugins.workflow.steps.SynchronousNonBlockingStepExecution.lambda$start$0(SynchronousNonBlockingStepExecution.java:49)
		at java.base/java.util.concurrent.Executors$RunnableAdapter.call(Unknown Source)
		at java.base/java.util.concurrent.FutureTask.run(Unknown Source)
		at java.base/java.util.concurrent.ThreadPoolExecutor.runWorker(Unknown Source)
		at java.base/java.util.concurrent.ThreadPoolExecutor$Worker.run(Unknown Source)
		at java.base/java.lang.Thread.run(Unknown Source)
Also:   org.jenkinsci.plugins.workflow.actions.ErrorAction$ErrorId: 44695af4-706f-41dd-bffd-62bb509baf29
org.jenkinsci.plugins.xunit.service.NoTestFoundException: [CTest-Version 3.x (default)] - No test report file(s) were found with the pattern 'build/Testing/**/Test.xml' relative to '/var/jenkins/workspace/Kokkos_PR-9650' for the testing framework 'CTest-Version 3.x (default)'.
Did you enter a pattern relative to (and within) the workspace directory?
Did you generate the result report(s) for 'CTest-Version 3.x (default)'?"
	at PluginClassLoader for xunit//org.jenkinsci.plugins.xunit.service.XUnitReportProcessorService.findReports(XUnitReportProcessorService.java:79)
	at PluginClassLoader for xunit//org.jenkinsci.plugins.xunit.service.XUnitTransformerCallable.invoke(XUnitTransformerCallable.java:87)
	at PluginClassLoader for xunit//org.jenkinsci.plugins.xunit.service.XUnitTransformerCallable.invoke(XUnitTransformerCallable.java:39)
	at Jenkins v2.568.3//hudson.FilePath$FileCallableWrapper.call(FilePath.java:3655)
	at hudson.remoting.UserRequest.perform(UserRequest.java:225)
	at hudson.remoting.UserRequest.perform(UserRequest.java:50)
	at hudson.remoting.Request$2.run(Request.java:391)
	at hudson.remoting.InterceptingExecutorService.lambda$wrap$0(InterceptingExecutorService.java:81)
	at java.base/java.util.concurrent.FutureTask.run(FutureTask.java:317)
	at java.base/java.util.concurrent.ThreadPoolExecutor.runWorker(ThreadPoolExecutor.java:1144)
	at java.base/java.util.concurrent.ThreadPoolExecutor$Worker.run(ThreadPoolExecutor.java:642)
	at hudson.remoting.Engine$1.lambda$newThread$0(Engine.java:312)
	at java.base/java.lang.Thread.run(Thread.java:1583)

[Pipeline] }
[Pipeline] // withEnv
[Pipeline] }
$ docker stop --time=1 19dfbbcce3b835b76e026d9cbe01cb1bbf7e68921bc199443869704fda31134b
+ ccache --show-stats
Cacheable calls:   564 / 564 (100.0%)
  Hits:             76 / 564 (13.48%)
    Direct:         62 /  76 (81.58%)
    Preprocessed:   14 /  76 (18.42%)
  Misses:          488 / 564 (86.52%)
Local storage:
  Cache size (GB): 4.8 / 5.0 (96.63%)
  Hits:             76 / 564 (13.48%)
  Misses:          488 / 564 (86.52%)
$ docker rm -f --volumes 19dfbbcce3b835b76e026d9cbe01cb1bbf7e68921bc199443869704fda31134b
Terminated
[Pipeline] // withDockerContainer
[Pipeline] }
[Pipeline] xunit
INFO: Processing CTest-Version 3.x (default)
[Pipeline] // withEnv
[Pipeline] }
Error when executing always post condition:
Also:   hudson.remoting.Channel$CallSiteStackTrace: Remote call to JNLP4-connect connection from 10.64.200.233/10.64.200.233:47878
		at hudson.remoting.Channel.attachCallSiteStackTrace(Channel.java:1916)
		at hudson.remoting.UserRequest$ExceptionResponse.retrieve(UserRequest.java:384)
		at hudson.remoting.Channel.call(Channel.java:1108)
		at hudson.FilePath.act(FilePath.java:1220)
		at hudson.FilePath.act(FilePath.java:1209)
		at PluginClassLoader for xunit//org.jenkinsci.plugins.xunit.XUnitProcessor.processTestsReport(XUnitProcessor.java:214)
		at PluginClassLoader for xunit//org.jenkinsci.plugins.xunit.XUnitProcessor.process(XUnitProcessor.java:163)
		at PluginClassLoader for xunit//org.jenkinsci.plugins.xunit.pipeline.XUnitResultsStepExecution.run(XUnitResultsStepExecution.java:94)
		at PluginClassLoader for xunit//org.jenkinsci.plugins.xunit.pipeline.XUnitResultsStepExecution.run(XUnitResultsStepExecution.java:53)
		at PluginClassLoader for workflow-step-api//org.jenkinsci.plugins.workflow.steps.SynchronousNonBlockingStepExecution.lambda$start$0(SynchronousNonBlockingStepExecution.java:49)
		at java.base/java.util.concurrent.Executors$RunnableAdapter.call(Unknown Source)
		at java.base/java.util.concurrent.FutureTask.run(Unknown Source)
		at java.base/java.util.concurrent.ThreadPoolExecutor.runWorker(Unknown Source)
		at java.base/java.util.concurrent.ThreadPoolExecutor$Worker.run(Unknown Source)
		at java.base/java.lang.Thread.run(Unknown Source)
Also:   org.jenkinsci.plugins.workflow.actions.ErrorAction$ErrorId: fe2aef06-9c57-4600-8046-2e9dbad8ed3a
org.jenkinsci.plugins.xunit.service.NoTestFoundException: [CTest-Version 3.x (default)] - No test report file(s) were found with the pattern 'build/Testing/**/Test.xml' relative to '/var/jenkins/workspace/Kokkos_PR-9650' for the testing framework 'CTest-Version 3.x (default)'.
Did you enter a pattern relative to (and within) the workspace directory?
Did you generate the result report(s) for 'CTest-Version 3.x (default)'?"
	at PluginClassLoader for xunit//org.jenkinsci.plugins.xunit.service.XUnitReportProcessorService.findReports(XUnitReportProcessorService.java:79)
	at PluginClassLoader for xunit//org.jenkinsci.plugins.xunit.service.XUnitTransformerCallable.invoke(XUnitTransformerCallable.java:87)
	at PluginClassLoader for xunit//org.jenkinsci.plugins.xunit.service.XUnitTransformerCallable.invoke(XUnitTransformerCallable.java:39)
	at Jenkins v2.568.3//hudson.FilePath$FileCallableWrapper.call(FilePath.java:3655)
	at hudson.remoting.UserRequest.perform(UserRequest.java:225)
	at hudson.remoting.UserRequest.perform(UserRequest.java:50)
	at hudson.remoting.Request$2.run(Request.java:391)
	at hudson.remoting.InterceptingExecutorService.lambda$wrap$0(InterceptingExecutorService.java:81)
	at java.base/java.util.concurrent.FutureTask.run(FutureTask.java:317)
	at java.base/java.util.concurrent.ThreadPoolExecutor.runWorker(ThreadPoolExecutor.java:1144)
	at java.base/java.util.concurrent.ThreadPoolExecutor$Worker.run(ThreadPoolExecutor.java:642)
	at hudson.remoting.Engine$1.lambda$newThread$0(Engine.java:312)
	at java.base/java.lang.Thread.run(Thread.java:1583)

[Pipeline] // node
[Pipeline] }
[Pipeline] // stage
[Pipeline] }
Failed in branch CUDA-12.2-NVHPC-AS-HOST-COMPILER
[Pipeline] }
$ docker stop --time=1 62d9f33298e7ad833068bc1ab668d42012be00e86a920937494d84140da82892
$ docker rm -f --volumes 62d9f33298e7ad833068bc1ab668d42012be00e86a920937494d84140da82892
[Pipeline] // withDockerContainer
[Pipeline] }
[Pipeline] // withEnv
[Pipeline] }
[Pipeline] // node
[Pipeline] }
[Pipeline] // stage
[Pipeline] }
Failed in branch CUDA-12.5.1-Clang-17-RDC
[Pipeline] // parallel
[Pipeline] }
[Pipeline] // stage
[Pipeline] }
[Pipeline] // timeout
[Pipeline] }
[Pipeline] // withEnv
[Pipeline] End of Pipeline
Timeout has been exceeded
java.io.IOException: failed to run kill
	at PluginClassLoader for docker-workflow//org.jenkinsci.plugins.docker.workflow.WithContainerStep$Decorator$1.kill(WithContainerStep.java:401)
	at PluginClassLoader for durable-task//org.jenkinsci.plugins.durabletask.FileMonitoringTask$FileMonitoringController.stop(FileMonitoringTask.java:488)
	at PluginClassLoader for workflow-durable-task-step//org.jenkinsci.plugins.workflow.steps.durable_task.DurableTaskStep$Execution.stop(DurableTaskStep.java:527)
	at PluginClassLoader for workflow-cps//org.jenkinsci.plugins.workflow.cps.CpsThread.stop(CpsThread.java:325)
	at PluginClassLoader for workflow-cps//org.jenkinsci.plugins.workflow.cps.CpsBodyExecution$2.onSuccess(CpsBodyExecution.java:274)
	at PluginClassLoader for workflow-cps//org.jenkinsci.plugins.workflow.cps.CpsBodyExecution$2.onSuccess(CpsBodyExecution.java:257)
	at PluginClassLoader for workflow-cps//org.jenkinsci.plugins.workflow.cps.CpsFlowExecution$4$1.run(CpsFlowExecution.java:1060)
	at PluginClassLoader for workflow-cps//org.jenkinsci.plugins.workflow.cps.CpsVmExecutorService.lambda$wrap$2(CpsVmExecutorService.java:81)
	at java.base/java.util.concurrent.Executors$RunnableAdapter.call(Unknown Source)
	at java.base/java.util.concurrent.FutureTask.run(Unknown Source)
	at hudson.remoting.SingleLaneExecutorService$1.run(SingleLaneExecutorService.java:139)
	at jenkins.util.ContextResettingExecutorService.lambda$wrap$0(ContextResettingExecutorService.java:26)
	at jenkins.security.ImpersonatingExecutorService.lambda$wrap$0(ImpersonatingExecutorService.java:66)
	at jenkins.util.ErrorLoggingExecutorService.lambda$wrap$0(ErrorLoggingExecutorService.java:51)
	at java.base/java.util.concurrent.Executors$RunnableAdapter.call(Unknown Source)
	at java.base/java.util.concurrent.FutureTask.run(Unknown Source)
	at java.base/java.util.concurrent.ThreadPoolExecutor.runWorker(Unknown Source)
	at java.base/java.util.concurrent.ThreadPoolExecutor$Worker.run(Unknown Source)
	at PluginClassLoader for workflow-cps//org.jenkinsci.plugins.workflow.cps.CpsVmExecutorService$1.call(CpsVmExecutorService.java:53)
	at PluginClassLoader for workflow-cps//org.jenkinsci.plugins.workflow.cps.CpsVmExecutorService$1.call(CpsVmExecutorService.java:50)
	at org.codehaus.groovy.runtime.GroovyCategorySupport$ThreadCategoryInfo.use(GroovyCategorySupport.java:136)
	at org.codehaus.groovy.runtime.GroovyCategorySupport.use(GroovyCategorySupport.java:275)
	at PluginClassLoader for workflow-cps//org.jenkinsci.plugins.workflow.cps.CpsVmExecutorService.lambda$categoryThreadFactory$0(CpsVmExecutorService.java:50)
	at java.base/java.lang.Thread.run(Unknown Source)
java.io.IOException: failed to run kill
	at PluginClassLoader for docker-workflow//org.jenkinsci.plugins.docker.workflow.WithContainerStep$Decorator$1.kill(WithContainerStep.java:401)
	at PluginClassLoader for durable-task//org.jenkinsci.plugins.durabletask.FileMonitoringTask$FileMonitoringController.stop(FileMonitoringTask.java:488)
	at PluginClassLoader for workflow-durable-task-step//org.jenkinsci.plugins.workflow.steps.durable_task.DurableTaskStep$Execution.stop(DurableTaskStep.java:527)
	at PluginClassLoader for workflow-cps//org.jenkinsci.plugins.workflow.cps.CpsThread.stop(CpsThread.java:325)
	at PluginClassLoader for workflow-cps//org.jenkinsci.plugins.workflow.cps.CpsBodyExecution$2.onSuccess(CpsBodyExecution.java:274)
	at PluginClassLoader for workflow-cps//org.jenkinsci.plugins.workflow.cps.CpsBodyExecution$2.onSuccess(CpsBodyExecution.java:257)
	at PluginClassLoader for workflow-cps//org.jenkinsci.plugins.workflow.cps.CpsFlowExecution$4$1.run(CpsFlowExecution.java:1060)
	at PluginClassLoader for workflow-cps//org.jenkinsci.plugins.workflow.cps.CpsVmExecutorService.lambda$wrap$2(CpsVmExecutorService.java:81)
	at java.base/java.util.concurrent.Executors$RunnableAdapter.call(Unknown Source)
	at java.base/java.util.concurrent.FutureTask.run(Unknown Source)
	at hudson.remoting.SingleLaneExecutorService$1.run(SingleLaneExecutorService.java:139)
	at jenkins.util.ContextResettingExecutorService.lambda$wrap$0(ContextResettingExecutorService.java:26)
	at jenkins.security.ImpersonatingExecutorService.lambda$wrap$0(ImpersonatingExecutorService.java:66)
	at jenkins.util.ErrorLoggingExecutorService.lambda$wrap$0(ErrorLoggingExecutorService.java:51)
	at java.base/java.util.concurrent.Executors$RunnableAdapter.call(Unknown Source)
	at java.base/java.util.concurrent.FutureTask.run(Unknown Source)
	at java.base/java.util.concurrent.ThreadPoolExecutor.runWorker(Unknown Source)
	at java.base/java.util.concurrent.ThreadPoolExecutor$Worker.run(Unknown Source)
	at PluginClassLoader for workflow-cps//org.jenkinsci.plugins.workflow.cps.CpsVmExecutorService$1.call(CpsVmExecutorService.java:53)
	at PluginClassLoader for workflow-cps//org.jenkinsci.plugins.workflow.cps.CpsVmExecutorService$1.call(CpsVmExecutorService.java:50)
	at org.codehaus.groovy.runtime.GroovyCategorySupport$ThreadCategoryInfo.use(GroovyCategorySupport.java:136)
	at org.codehaus.groovy.runtime.GroovyCategorySupport.use(GroovyCategorySupport.java:275)
	at PluginClassLoader for workflow-cps//org.jenkinsci.plugins.workflow.cps.CpsVmExecutorService.lambda$categoryThreadFactory$0(CpsVmExecutorService.java:50)
	at java.base/java.lang.Thread.run(Unknown Source)
org.jenkinsci.plugins.workflow.actions.ErrorAction$ErrorId: 630c3596-a5b9-44c2-a61f-3b949cf4a4ab

GitHub has been notified of this commit’s build result

Finished: ABORTED