54: [ OK ] std_algorithms_find_first_of_team_test.sequences_exist (549 ms)
54: [ RUN ] std_algorithms_find_first_of_team_test.sequences_do_not_exist
54: [ OK ] std_algorithms_find_first_of_team_test.sequences_do_not_exist (763 ms)
54: [----------] 2 tests from std_algorithms_find_first_of_team_test (1312 ms total)
54:
54: [----------] Global test environment tear-down
54: [==========] 8 tests from 4 test suites ran. (5595 ms total)
54: [ PASSED ] 8 tests.
54/73 Test #54: Kokkos_AlgorithmsUnitTest_StdSet_Team_B .................... Passed 5.95 sec
test 55
Start 55: Kokkos_AlgorithmsUnitTest_StdSet_Team_C
55: Test command: /var/jenkins/workspace/Kokkos_nightly/build/algorithms/unit_tests/Kokkos_AlgorithmsUnitTest_StdSet_Team_C
55: Environment variable modifications:
55: KOKKOS_TOOLS_LIBS=cmake_list_append:/var/jenkins/workspace/Kokkos_nightly/build/core/unit_test/libkokkoshwmtracker-tool.so
55: Test timeout computed to be: 600
55: [==========] Running 11 tests from 7 test suites.
55: [----------] Global test environment set-up.
55: [----------] 2 tests from std_algorithms_find_team_test
55: [ RUN ] std_algorithms_find_team_test.searched_values_exist
55: [ OK ] std_algorithms_find_team_test.searched_values_exist (239 ms)
55: [ RUN ] std_algorithms_find_team_test.searched_values_do_not_exist
55: [ OK ] std_algorithms_find_team_test.searched_values_do_not_exist (240 ms)
55: [----------] 2 tests from std_algorithms_find_team_test (480 ms total)
55:
55: [----------] 2 tests from std_algorithms_find_if_team_test
55: [ RUN ] std_algorithms_find_if_team_test.predicates_return_true
55: [ OK ] std_algorithms_find_if_team_test.predicates_return_true (232 ms)
55: [ RUN ] std_algorithms_find_if_team_test.predicates_return_false
55: [ OK ] std_algorithms_find_if_team_test.predicates_return_false (241 ms)
55: [----------] 2 tests from std_algorithms_find_if_team_test (473 ms total)
55:
55: [----------] 2 tests from std_algorithms_find_if_not_team_test
55: [ RUN ] std_algorithms_find_if_not_team_test.predicates_return_true
55: [ OK ] std_algorithms_find_if_not_team_test.predicates_return_true (241 ms)
55: [ RUN ] std_algorithms_find_if_not_team_test.predicates_return_false
55: [ OK ] std_algorithms_find_if_not_team_test.predicates_return_false (239 ms)
55: [----------] 2 tests from std_algorithms_find_if_not_team_test (480 ms total)
55:
55: [----------] 1 test from std_algorithms_all_of_team_test
55: [ RUN ] std_algorithms_all_of_team_test.test
55: [ OK ] std_algorithms_all_of_team_test.test (238 ms)
55: [----------] 1 test from std_algorithms_all_of_team_test (238 ms total)
55:
55: [----------] 1 test from std_algorithms_any_of_team_test
55: [ RUN ] std_algorithms_any_of_team_test.test
55: [ OK ] std_algorithms_any_of_team_test.test (229 ms)
55: [----------] 1 test from std_algorithms_any_of_team_test (229 ms total)
55:
55: [----------] 1 test from std_algorithms_none_of_team_test
55: [ RUN ] std_algorithms_none_of_team_test.test
55: [ OK ] std_algorithms_none_of_team_test.test (238 ms)
55: [----------] 1 test from std_algorithms_none_of_team_test (238 ms total)
55:
55: [----------] 2 tests from std_algorithms_search_n_team_test
55: [ RUN ] std_algorithms_search_n_team_test.sequences_of_equal_elements_exist
55: [ OK ] std_algorithms_search_n_team_test.sequences_of_equal_elements_exist (267 ms)
55: [ RUN ] std_algorithms_search_n_team_test.sequences_of_equal_elements_probably_does_not_exist
55: [ OK ] std_algorithms_search_n_team_test.sequences_of_equal_elements_probably_does_not_exist (256 ms)
55: [----------] 2 tests from std_algorithms_search_n_team_test (523 ms total)
55:
55: [----------] Global test environment tear-down
55: [==========] 11 tests from 7 test suites ran. (2665 ms total)
55: [ PASSED ] 11 tests.
55/73 Test #55: Kokkos_AlgorithmsUnitTest_StdSet_Team_C .................... Passed 3.01 sec
test 56
Start 56: Kokkos_AlgorithmsUnitTest_StdSet_Team_D
56: Test command: /var/jenkins/workspace/Kokkos_nightly/build/algorithms/unit_tests/Kokkos_AlgorithmsUnitTest_StdSet_Team_D
56: Environment variable modifications:
56: KOKKOS_TOOLS_LIBS=cmake_list_append:/var/jenkins/workspace/Kokkos_nightly/build/core/unit_test/libkokkoshwmtracker-tool.so
56: Test timeout computed to be: 600
56: [==========] Running 3 tests from 3 test suites.
56: [----------] Global test environment set-up.
56: [----------] 1 test from std_algorithms_min_element_team_test
56: [ RUN ] std_algorithms_min_element_team_test.test
56: [ OK ] std_algorithms_min_element_team_test.test (515 ms)
56: [----------] 1 test from std_algorithms_min_element_team_test (515 ms total)
56:
56: [----------] 1 test from std_algorithms_max_element_team_test
56: [ RUN ] std_algorithms_max_element_team_test.test
56: [ OK ] std_algorithms_max_element_team_test.test (509 ms)
56: [----------] 1 test from std_algorithms_max_element_team_test (510 ms total)
56:
56: [----------] 1 test from std_algorithms_minmax_element_team_test
56: [ RUN ] std_algorithms_minmax_element_team_test.test
56: [ OK ] std_algorithms_minmax_element_team_test.test (546 ms)
56: [----------] 1 test from std_algorithms_minmax_element_team_test (546 ms total)
56:
56: [----------] Global test environment tear-down
56: [==========] 3 tests from 3 test suites ran. (1572 ms total)
56: [ PASSED ] 3 tests.
56/73 Test #56: Kokkos_AlgorithmsUnitTest_StdSet_Team_D .................... Passed 1.92 sec
test 57
Start 57: Kokkos_AlgorithmsUnitTest_StdSet_Team_E
57: Test command: /var/jenkins/workspace/Kokkos_nightly/build/algorithms/unit_tests/Kokkos_AlgorithmsUnitTest_StdSet_Team_E
57: Environment variable modifications:
57: KOKKOS_TOOLS_LIBS=cmake_list_append:/var/jenkins/workspace/Kokkos_nightly/build/core/unit_test/libkokkoshwmtracker-tool.so
57: Test timeout computed to be: 600
57: [==========] Running 6 tests from 6 test suites.
57: [----------] Global test environment set-up.
57: [----------] 1 test from std_algorithms_fill_team_test
57: [ RUN ] std_algorithms_fill_team_test.test
57: [ OK ] std_algorithms_fill_team_test.test (250 ms)
57: [----------] 1 test from std_algorithms_fill_team_test (251 ms total)
57:
57: [----------] 1 test from std_algorithms_fill_n_team_test
57: [ RUN ] std_algorithms_fill_n_team_test.test
57: [ OK ] std_algorithms_fill_n_team_test.test (375 ms)
57: [----------] 1 test from std_algorithms_fill_n_team_test (375 ms total)
57:
57: [----------] 1 test from std_algorithms_replace_team_test
57: [ RUN ] std_algorithms_replace_team_test.test
57: [ OK ] std_algorithms_replace_team_test.test (372 ms)
57: [----------] 1 test from std_algorithms_replace_team_test (372 ms total)
57:
57: [----------] 1 test from std_algorithms_replace_if_team_test
57: [ RUN ] std_algorithms_replace_if_team_test.test
57: [ OK ] std_algorithms_replace_if_team_test.test (306 ms)
57: [----------] 1 test from std_algorithms_replace_if_team_test (306 ms total)
57:
57: [----------] 1 test from std_algorithms_replace_copy_team_test
57: [ RUN ] std_algorithms_replace_copy_team_test.test
57: [ OK ] std_algorithms_replace_copy_team_test.test (334 ms)
57: [----------] 1 test from std_algorithms_replace_copy_team_test (334 ms total)
57:
57: [----------] 1 test from std_algorithms_replace_copy_if_team_test
57: [ RUN ] std_algorithms_replace_copy_if_team_test.test
57: [ OK ] std_algorithms_replace_copy_if_team_test.test (365 ms)
57: [----------] 1 test from std_algorithms_replace_copy_if_team_test (365 ms total)
57:
57: [----------] Global test environment tear-down
57: [==========] 6 tests from 6 test suites ran. (2006 ms total)
57: [ PASSED ] 6 tests.
57/73 Test #57: Kokkos_AlgorithmsUnitTest_StdSet_Team_E .................... Passed 2.36 sec
test 58
Start 58: Kokkos_AlgorithmsUnitTest_StdSet_Team_F
58: Test command: /var/jenkins/workspace/Kokkos_nightly/build/algorithms/unit_tests/Kokkos_AlgorithmsUnitTest_StdSet_Team_F
58: Environment variable modifications:
58: KOKKOS_TOOLS_LIBS=cmake_list_append:/var/jenkins/workspace/Kokkos_nightly/build/core/unit_test/libkokkoshwmtracker-tool.so
58: Test timeout computed to be: 600
58: [==========] Running 4 tests from 4 test suites.
58: [----------] Global test environment set-up.
58: [----------] 1 test from std_algorithms_reverse_team_test
58: [ RUN ] std_algorithms_reverse_team_test.test
58: [ OK ] std_algorithms_reverse_team_test.test (267 ms)
58: [----------] 1 test from std_algorithms_reverse_team_test (267 ms total)
58:
58: [----------] 1 test from std_algorithms_reverse_copy_team_test
58: [ RUN ] std_algorithms_reverse_copy_team_test.test
58: [ OK ] std_algorithms_reverse_copy_team_test.test (324 ms)
58: [----------] 1 test from std_algorithms_reverse_copy_team_test (324 ms total)
58:
58: [----------] 1 test from std_algorithms_rotate_team_test
58: [ RUN ] std_algorithms_rotate_team_test.test
58: [ OK ] std_algorithms_rotate_team_test.test (522 ms)
58: [----------] 1 test from std_algorithms_rotate_team_test (522 ms total)
58:
58: [----------] 1 test from std_algorithms_rotate_copy_team_test
58: [ RUN ] std_algorithms_rotate_copy_team_test.test
58: [ OK ] std_algorithms_rotate_copy_team_test.test (559 ms)
58: [----------] 1 test from std_algorithms_rotate_copy_team_test (559 ms total)
58:
58: [----------] Global test environment tear-down
58: [==========] 4 tests from 4 test suites ran. (1674 ms total)
58: [ PASSED ] 4 tests.
58/73 Test #58: Kokkos_AlgorithmsUnitTest_StdSet_Team_F .................... Passed 2.02 sec
test 59
Start 59: Kokkos_AlgorithmsUnitTest_StdSet_Team_G
59: Test command: /var/jenkins/workspace/Kokkos_nightly/build/algorithms/unit_tests/Kokkos_AlgorithmsUnitTest_StdSet_Team_G
59: Environment variable modifications:
59: KOKKOS_TOOLS_LIBS=cmake_list_append:/var/jenkins/workspace/Kokkos_nightly/build/core/unit_test/libkokkoshwmtracker-tool.so
59: Test timeout computed to be: 600
59: [==========] Running 4 tests from 4 test suites.
59: [----------] Global test environment set-up.
59: [----------] 1 test from std_algorithms_move_team_test
59: [ RUN ] std_algorithms_move_team_test.test
59: [ OK ] std_algorithms_move_team_test.test (434 ms)
59: [----------] 1 test from std_algorithms_move_team_test (434 ms total)
59:
59: [----------] 1 test from std_algorithms_move_backward_team_test
59: [ RUN ] std_algorithms_move_backward_team_test.test
59: [ OK ] std_algorithms_move_backward_team_test.test (432 ms)
59: [----------] 1 test from std_algorithms_move_backward_team_test (432 ms total)
59:
59: [----------] 1 test from std_algorithms_shift_left_team_test
59: [ RUN ] std_algorithms_shift_left_team_test.test
59: [ OK ] std_algorithms_shift_left_team_test.test (1452 ms)
59: [----------] 1 test from std_algorithms_shift_left_team_test (1452 ms total)
59:
59: [----------] 1 test from std_algorithms_shift_right_team_test
59: [ RUN ] std_algorithms_shift_right_team_test.test
59: [ OK ] std_algorithms_shift_right_team_test.test (1451 ms)
59: [----------] 1 test from std_algorithms_shift_right_team_test (1451 ms total)
59:
59: [----------] Global test environment tear-down
59: [==========] 4 tests from 4 test suites ran. (3771 ms total)
59: [ PASSED ] 4 tests.
59/73 Test #59: Kokkos_AlgorithmsUnitTest_StdSet_Team_G .................... Passed 4.12 sec
test 60
Start 60: Kokkos_AlgorithmsUnitTest_StdSet_Team_H
60: Test command: /var/jenkins/workspace/Kokkos_nightly/build/algorithms/unit_tests/Kokkos_AlgorithmsUnitTest_StdSet_Team_H
60: Environment variable modifications:
60: KOKKOS_TOOLS_LIBS=cmake_list_append:/var/jenkins/workspace/Kokkos_nightly/build/core/unit_test/libkokkoshwmtracker-tool.so
60: Test timeout computed to be: 600
60: [==========] Running 9 tests from 9 test suites.
60: [----------] Global test environment set-up.
60: [----------] 1 test from std_algorithms_copy_team_test
60: [ RUN ] std_algorithms_copy_team_test.test
60: [ OK ] std_algorithms_copy_team_test.test (539 ms)
60: [----------] 1 test from std_algorithms_copy_team_test (539 ms total)
60:
60: [----------] 1 test from std_algorithms_copy_n_team_test
60: [ RUN ] std_algorithms_copy_n_team_test.test
60: [ OK ] std_algorithms_copy_n_team_test.test (468 ms)
60: [----------] 1 test from std_algorithms_copy_n_team_test (468 ms total)
60:
60: [----------] 1 test from std_algorithms_copy_backward_team_test
60: [ RUN ] std_algorithms_copy_backward_team_test.test
60: [ OK ] std_algorithms_copy_backward_team_test.test (419 ms)
60: [----------] 1 test from std_algorithms_copy_backward_team_test (419 ms total)
60:
60: [----------] 1 test from std_algorithms_copy_if_team_test
60: [ RUN ] std_algorithms_copy_if_team_test.test
60: [ OK ] std_algorithms_copy_if_team_test.test (514 ms)
60: [----------] 1 test from std_algorithms_copy_if_team_test (514 ms total)
60:
60: [----------] 1 test from std_algorithms_unique_copy_team_test
60: [ RUN ] std_algorithms_unique_copy_team_test.test
60: [ OK ] std_algorithms_unique_copy_team_test.test (677 ms)
60: [----------] 1 test from std_algorithms_unique_copy_team_test (677 ms total)
60:
60: [----------] 1 test from std_algorithms_remove_team_test
60: [ RUN ] std_algorithms_remove_team_test.test
60: [ OK ] std_algorithms_remove_team_test.test (438 ms)
60: [----------] 1 test from std_algorithms_remove_team_test (438 ms total)
60:
60: [----------] 1 test from std_algorithms_remove_if_team_test
60: [ RUN ] std_algorithms_remove_if_team_test.test
60: [ OK ] std_algorithms_remove_if_team_test.test (395 ms)
60: [----------] 1 test from std_algorithms_remove_if_team_test (395 ms total)
60:
60: [----------] 1 test from std_algorithms_remove_copy_team_test
60: [ RUN ] std_algorithms_remove_copy_team_test.test
60: [ OK ] std_algorithms_remove_copy_team_test.test (526 ms)
60: [----------] 1 test from std_algorithms_remove_copy_team_test (526 ms total)
60:
60: [----------] 1 test from std_algorithms_remove_copy_if_team_test
60: [ RUN ] std_algorithms_remove_copy_if_team_test.test
60: [ OK ] std_algorithms_remove_copy_if_team_test.test (459 ms)
60: [----------] 1 test from std_algorithms_remove_copy_if_team_test (459 ms total)
60:
60: [----------] Global test environment tear-down
60: [==========] 9 tests from 9 test suites ran. (4440 ms total)
60: [ PASSED ] 9 tests.
60/73 Test #60: Kokkos_AlgorithmsUnitTest_StdSet_Team_H .................... Passed 4.81 sec
test 61
Start 61: Kokkos_AlgorithmsUnitTest_StdSet_Team_I
61: Test command: /var/jenkins/workspace/Kokkos_nightly/build/algorithms/unit_tests/Kokkos_AlgorithmsUnitTest_StdSet_Team_I
61: Environment variable modifications:
61: KOKKOS_TOOLS_LIBS=cmake_list_append:/var/jenkins/workspace/Kokkos_nightly/build/core/unit_test/libkokkoshwmtracker-tool.so
61: Test timeout computed to be: 600
61: [==========] Running 4 tests from 4 test suites.
61: [----------] Global test environment set-up.
61: [----------] 1 test from std_algorithms_unique_team_test
61: [ RUN ] std_algorithms_unique_team_test.test_default_predicate
61: [ OK ] std_algorithms_unique_team_test.test_default_predicate (647 ms)
61: [----------] 1 test from std_algorithms_unique_team_test (647 ms total)
61:
61: [----------] 1 test from std_algorithms_adjacent_difference_team_test
61: [ RUN ] std_algorithms_adjacent_difference_team_test.test
61: [ OK ] std_algorithms_adjacent_difference_team_test.test (714 ms)
61: [----------] 1 test from std_algorithms_adjacent_difference_team_test (714 ms total)
61:
61: [----------] 1 test from std_algorithms_reduce_team_test
61: [ RUN ] std_algorithms_reduce_team_test.test
61: [ OK ] std_algorithms_reduce_team_test.test (770 ms)
61: [----------] 1 test from std_algorithms_reduce_team_test (770 ms total)
61:
61: [----------] 1 test from std_algorithms_transform_reduce_team_test
61: [ RUN ] std_algorithms_transform_reduce_team_test.test
61: [ OK ] std_algorithms_transform_reduce_team_test.test (1340 ms)
61: [----------] 1 test from std_algorithms_transform_reduce_team_test (1340 ms total)
61:
61: [----------] Global test environment tear-down
61: [==========] 4 tests from 4 test suites ran. (3472 ms total)
61: [ PASSED ] 4 tests.
61/73 Test #61: Kokkos_AlgorithmsUnitTest_StdSet_Team_I .................... Passed 3.82 sec
test 62
Start 62: Kokkos_AlgorithmsUnitTest_StdSet_Team_L
62: Test command: /var/jenkins/workspace/Kokkos_nightly/build/algorithms/unit_tests/Kokkos_AlgorithmsUnitTest_StdSet_Team_L
62: Environment variable modifications:
62: KOKKOS_TOOLS_LIBS=cmake_list_append:/var/jenkins/workspace/Kokkos_nightly/build/core/unit_test/libkokkoshwmtracker-tool.so
62: Test timeout computed to be: 600
62: [==========] Running 18 tests from 5 test suites.
62: [----------] Global test environment set-up.
62: [----------] 2 tests from std_algorithms_is_sorted_team_test
62: [ RUN ] std_algorithms_is_sorted_team_test.test_data_almost_certainly_not_sorted
62: [ OK ] std_algorithms_is_sorted_team_test.test_data_almost_certainly_not_sorted (430 ms)
62: [ RUN ] std_algorithms_is_sorted_team_test.test_data_certainly_sorted
62: [ OK ] std_algorithms_is_sorted_team_test.test_data_certainly_sorted (336 ms)
62: [----------] 2 tests from std_algorithms_is_sorted_team_test (766 ms total)
62:
62: [----------] 4 tests from std_algorithms_is_sorted_until_team_test
62: [ RUN ] std_algorithms_is_sorted_until_team_test.test_trivialA
62: [ OK ] std_algorithms_is_sorted_until_team_test.test_trivialA (18 ms)
62: [ RUN ] std_algorithms_is_sorted_until_team_test.test_trivialB
62: [ OK ] std_algorithms_is_sorted_until_team_test.test_trivialB (25 ms)
62: [ RUN ] std_algorithms_is_sorted_until_team_test.test_nontrivialA
62: [ OK ] std_algorithms_is_sorted_until_team_test.test_nontrivialA (270 ms)
62: [ RUN ] std_algorithms_is_sorted_until_team_test.test_nontrivialB
62: [ OK ] std_algorithms_is_sorted_until_team_test.test_nontrivialB (397 ms)
62: [----------] 4 tests from std_algorithms_is_sorted_until_team_test (711 ms total)
62:
62: [----------] 4 tests from std_algorithms_is_partitioned_team_test
62: [ RUN ] std_algorithms_is_partitioned_team_test.empty
62: [ OK ] std_algorithms_is_partitioned_team_test.empty (9 ms)
62: [ RUN ] std_algorithms_is_partitioned_team_test.all_true
62: [ OK ] std_algorithms_is_partitioned_team_test.all_true (186 ms)
62: [ RUN ] std_algorithms_is_partitioned_team_test.all_false
62: [ OK ] std_algorithms_is_partitioned_team_test.all_false (188 ms)
62: [ RUN ] std_algorithms_is_partitioned_team_test.random
62: [ OK ] std_algorithms_is_partitioned_team_test.random (131 ms)
62: [----------] 4 tests from std_algorithms_is_partitioned_team_test (516 ms total)
62:
62: [----------] 4 tests from std_algorithms_partition_copy_team_test
62: [ RUN ] std_algorithms_partition_copy_team_test.empty
62: [ OK ] std_algorithms_partition_copy_team_test.empty (15 ms)
62: [ RUN ] std_algorithms_partition_copy_team_test.all_true
62: [ OK ] std_algorithms_partition_copy_team_test.all_true (498 ms)
62: [ RUN ] std_algorithms_partition_copy_team_test.all_false
62: [ OK ] std_algorithms_partition_copy_team_test.all_false (505 ms)
62: [ RUN ] std_algorithms_partition_copy_team_test.random
62: [ OK ] std_algorithms_partition_copy_team_test.random (452 ms)
62: [----------] 4 tests from std_algorithms_partition_copy_team_test (1472 ms total)
62:
62: [----------] 4 tests from std_algorithms_partition_point_team_test
62: [ RUN ] std_algorithms_partition_point_team_test.empty
62: [ OK ] std_algorithms_partition_point_team_test.empty (9 ms)
62: [ RUN ] std_algorithms_partition_point_team_test.all_true
62: [ OK ] std_algorithms_partition_point_team_test.all_true (190 ms)
62: [ RUN ] std_algorithms_partition_point_team_test.all_false
62: [ OK ] std_algorithms_partition_point_team_test.all_false (191 ms)
62: [ RUN ] std_algorithms_partition_point_team_test.random
62: [ OK ] std_algorithms_partition_point_team_test.random (135 ms)
62: [----------] 4 tests from std_algorithms_partition_point_team_test (527 ms total)
62:
62: [----------] Global test environment tear-down
62: [==========] 18 tests from 5 test suites ran. (3993 ms total)
62: [ PASSED ] 18 tests.
62/73 Test #62: Kokkos_AlgorithmsUnitTest_StdSet_Team_L .................... Passed 4.34 sec
test 63
Start 63: Kokkos_AlgorithmsUnitTest_StdSet_Team_M
63: Test command: /var/jenkins/workspace/Kokkos_nightly/build/algorithms/unit_tests/Kokkos_AlgorithmsUnitTest_StdSet_Team_M
63: Environment variable modifications:
63: KOKKOS_TOOLS_LIBS=cmake_list_append:/var/jenkins/workspace/Kokkos_nightly/build/core/unit_test/libkokkoshwmtracker-tool.so
63: Test timeout computed to be: 600
63: [==========] Running 5 tests from 4 test suites.
63: [----------] Global test environment set-up.
63: [----------] 2 tests from std_algorithms_transform_team_test
63: [ RUN ] std_algorithms_transform_team_test.test_binary_op
63: [ OK ] std_algorithms_transform_team_test.test_binary_op (738 ms)
63: [ RUN ] std_algorithms_transform_team_test.test_unary_op
63: [ OK ] std_algorithms_transform_team_test.test_unary_op (578 ms)
63: [----------] 2 tests from std_algorithms_transform_team_test (1317 ms total)
63:
63: [----------] 1 test from std_algorithms_generate_team_test
63: [ RUN ] std_algorithms_generate_team_test.test_unary_op
63: [ OK ] std_algorithms_generate_team_test.test_unary_op (1349 ms)
63: [----------] 1 test from std_algorithms_generate_team_test (1349 ms total)
63:
63: [----------] 1 test from std_algorithms_generate_n_team_test
63: [ RUN ] std_algorithms_generate_n_team_test.test
63: [ OK ] std_algorithms_generate_n_team_test.test (376 ms)
63: [----------] 1 test from std_algorithms_generate_n_team_test (376 ms total)
63:
63: [----------] 1 test from std_algorithms_swap_ranges_team_test
63: [ RUN ] std_algorithms_swap_ranges_team_test.test
63: [ OK ] std_algorithms_swap_ranges_team_test.test (686 ms)
63: [----------] 1 test from std_algorithms_swap_ranges_team_test (686 ms total)
63:
63: [----------] Global test environment tear-down
63: [==========] 5 tests from 4 test suites ran. (3730 ms total)
63: [ PASSED ] 5 tests.
63/73 Test #63: Kokkos_AlgorithmsUnitTest_StdSet_Team_M .................... Passed 4.09 sec
test 64
Start 64: Kokkos_AlgorithmsUnitTest_StdSet_Team_P
64: Test command: /var/jenkins/workspace/Kokkos_nightly/build/algorithms/unit_tests/Kokkos_AlgorithmsUnitTest_StdSet_Team_P
64: Environment variable modifications:
64: KOKKOS_TOOLS_LIBS=cmake_list_append:/var/jenkins/workspace/Kokkos_nightly/build/core/unit_test/libkokkoshwmtracker-tool.so
64: Test timeout computed to be: 600
64: [==========] Running 2 tests from 2 test suites.
64: [----------] Global test environment set-up.
64: [----------] 1 test from std_algorithms_exclusive_scan_team_test
64: [ RUN ] std_algorithms_exclusive_scan_team_test.test
64: [ OK ] std_algorithms_exclusive_scan_team_test.test (1502 ms)
64: [----------] 1 test from std_algorithms_exclusive_scan_team_test (1502 ms total)
64:
64: [----------] 1 test from std_algorithms_transform_exclusive_scan_team_test
64: [ RUN ] std_algorithms_transform_exclusive_scan_team_test.test
64: [ OK ] std_algorithms_transform_exclusive_scan_team_test.test (743 ms)
64: [----------] 1 test from std_algorithms_transform_exclusive_scan_team_test (743 ms total)
64:
64: [----------] Global test environment tear-down
64: [==========] 2 tests from 2 test suites ran. (2246 ms total)
64: [ PASSED ] 2 tests.
64/73 Test #64: Kokkos_AlgorithmsUnitTest_StdSet_Team_P .................... Passed 2.60 sec
test 65
Start 65: Kokkos_AlgorithmsUnitTest_StdSet_Team_Q
65: Test command: /var/jenkins/workspace/Kokkos_nightly/build/algorithms/unit_tests/Kokkos_AlgorithmsUnitTest_StdSet_Team_Q
65: Environment variable modifications:
65: KOKKOS_TOOLS_LIBS=cmake_list_append:/var/jenkins/workspace/Kokkos_nightly/build/core/unit_test/libkokkoshwmtracker-tool.so
65: Test timeout computed to be: 600
65: [==========] Running 2 tests from 2 test suites.
65: [----------] Global test environment set-up.
65: [----------] 1 test from std_algorithms_inclusive_scan_team_test
65: [ RUN ] std_algorithms_inclusive_scan_team_test.test
wrapper script does not seem to be touching the log file in /var/jenkins/workspace/Kokkos_nightly@tmp/durable-ce8ddb9c
This may occur if the durable task process was terminated externally, for example by interrupting an interactive terminal session running the agent since the interrupt can terminate forked durable task processes.
(JENKINS-48300: if on an extremely laggy filesystem, consider -Dorg.jenkinsci.plugins.durabletask.BourneShellScript.HEARTBEAT_CHECK_INTERVAL=86400)
waffle_02 seems to be removed or offline (java.io.IOException: Disk quota exceeded); will wait for 5 min 0 sec for it to come back online
65: [ OK ] std_algorithms_inclusive_scan_team_test.test (3174 ms)
65: [----------] 1 test from std_algorithms_inclusive_scan_team_test (3174 ms total)
65:
65: [----------] 1 test from std_algorithms_transform_inclusive_scan_team_test
65: [ RUN ] std_algorithms_transform_inclusive_scan_team_test.test
65: [ OK ] std_algorithms_transform_inclusive_scan_team_test.test (1465 ms)
65: [----------] 1 test from std_algorithms_transform_inclusive_scan_team_test (1465 ms total)
65:
65: [----------] Global test environment tear-down
65: [==========] 2 tests from 2 test suites ran. (4640 ms total)
65: [ PASSED ] 2 tests.
65/73 Test #65: Kokkos_AlgorithmsUnitTest_StdSet_Team_Q .................... Passed 4.98 sec
test 66
Start 66: Kokkos_PerformanceTest_InclusiveScan
66: Test command: /var/jenkins/workspace/Kokkos_nightly/build/algorithms/perf_test/Kokkos_PerformanceTest_InclusiveScan "--benchmark_counters_tabular=true" "--benchmark_out=Kokkos_PerformanceTest_InclusiveScan_2026-11-01_T04-32-21.json"
66: Environment variable modifications:
66: KOKKOS_TOOLS_LIBS=cmake_list_append:/var/jenkins/workspace/Kokkos_nightly/build/core/unit_test/libkokkoshwmtracker-tool.so
66: Test timeout computed to be: 600
66: 2026-11-01T05:11:43+00:00
66: Running /var/jenkins/workspace/Kokkos_nightly/build/algorithms/perf_test/Kokkos_PerformanceTest_InclusiveScan
66: Run on (64 X 2994.5 MHz CPU s)
66: CPU Caches:
66: L1 Data 32 KiB (x32)
66: L1 Instruction 32 KiB (x32)
66: L2 Unified 512 KiB (x32)
66: L3 Unified 16384 KiB (x16)
66: Load Average: 1.64, 2.50, 5.23
66: APU or dGPU: dGPU
66: Architecture capable of accessing system allocated memory: 1
66: CPU architecture: NATIVE
66: Default Device: HIP
66: GPU architecture: AMD_GFX908
66: Is Large Bar: 1
66: KOKKOS_COMPILER_CLANG: 2000
66: KOKKOS_ENABLE_ASM: no
66: KOKKOS_ENABLE_CXX20: yes
66: KOKKOS_ENABLE_CXX23: no
66: KOKKOS_ENABLE_CXX26: no
66: KOKKOS_ENABLE_DEBUG_BOUNDS_CHECK: no
66: KOKKOS_ENABLE_HIP: yes
66: KOKKOS_ENABLE_HIP_RELOCATABLE_DEVICE_CODE: yes
66: KOKKOS_ENABLE_HWLOC: no
66: KOKKOS_ENABLE_LIBDL: yes
66: KOKKOS_ENABLE_PRAGMA_IVDEP: no
66: KOKKOS_ENABLE_PRAGMA_LOOPCOUNT: no
66: KOKKOS_ENABLE_PRAGMA_UNROLL: no
66: KOKKOS_ENABLE_PRAGMA_VECTOR: no
66: KOKKOS_ENABLE_SERIAL: yes
66: Kernel reports HMM module via `CONFIG_HMM_MIRROR=y` in `/boot/config`: no
66: Kokkos Version: 5.3.99
66: Kokkos::HIP[ 0 ] gcnArch gfx908:sramecc+:xnack-: Selected
66: Shared Memory per Block: 64 KiB
66: Supports Managed Memory: 1
66: System allows accessing system allocated memory on GPU: 0
66: Total Global Memory: 31.98 GiB
66: Wavefront Size: 64
66: XNACK environment variable set: no
66: desul atomics version: 72536f9a004d55affb4de19e0938dd3443eae759
66: macro HIP_VERSION: 70051831 = version 7.0.51831
66: macro KOKKOS_ENABLE_HIP: defined
66: macro KOKKOS_ENABLE_IMPL_HIP_MALLOC_ASYNC: no
66: macro KOKKOS_ENABLE_ROCTHRUST: defined
66: mdspan version: d1636dadb9f7a57fcca534d4c199b5e1b7666eaf
66: platform: 64bit
66: ***WARNING*** ASLR is enabled, the results may have unreproducible noise in them.
66: ----------------------------------------------------------------------------------------------------------------------------------------------
66: Benchmark Time CPU Iterations FOM: GB/s MB Passed
66: ----------------------------------------------------------------------------------------------------------------------------------------------
66: BM_inclusive_scan<std::uint64_t>/100000000/manual_time 0.002 s 0.002 s 398 1.0061k/s 1.6k 1
66: BM_inclusive_scan<std::int64_t>/100000000/manual_time 0.002 s 0.002 s 441 1.01191k/s 1.6k 1
66: BM_inclusive_scan<double>/100000000/manual_time 0.002 s 0.002 s 442 1.01159k/s 1.6k 1
66: BM_inclusive_scan<std::uint64_t, SumFunctor>/100000000/manual_time 0.002 s 0.002 s 442 1.00779k/s 1.6k 1
waffle_02 is back online
66: BM_inclusive_scan<std::int64_t, SumFunctor>/100000000/manual_time 0.002 s 0.002 s 442 1.01164k/s 1.6k 1
66: BM_inclusive_scan<double, SumFunctor>/100000000/manual_time 0.002 s 0.002 s 442 1.00818k/s 1.6k 1
66: BM_inclusive_scan<std::uint64_t, MaxFunctor>/100000000/manual_time 0.002 s 0.002 s 443 1.01253k/s 1.6k 1
66: BM_inclusive_scan<std::int64_t, MaxFunctor>/100000000/manual_time 0.002 s 0.002 s 441 1.01243k/s 1.6k 1
66: BM_inclusive_scan<double, MaxFunctor>/100000000/manual_time 0.002 s 0.002 s 442 1.01221k/s 1.6k 1
66/73 Test #66: Kokkos_PerformanceTest_InclusiveScan ....................... Passed 21.51 sec
test 67
Start 67: Kokkos_PerformanceTest_Random
67: Test command: /var/jenkins/workspace/Kokkos_nightly/build/algorithms/perf_test/Kokkos_PerformanceTest_Random "--benchmark_counters_tabular=true" "--benchmark_out=Kokkos_PerformanceTest_Random_2026-11-01_T04-32-21.json"
67: Environment variable modifications:
67: KOKKOS_TOOLS_LIBS=cmake_list_append:/var/jenkins/workspace/Kokkos_nightly/build/core/unit_test/libkokkoshwmtracker-tool.so
67: Test timeout computed to be: 600
67: 2026-11-01T05:12:04+00:00
67: Running /var/jenkins/workspace/Kokkos_nightly/build/algorithms/perf_test/Kokkos_PerformanceTest_Random
67: Run on (64 X 2994.5 MHz CPU s)
67: CPU Caches:
67: L1 Data 32 KiB (x32)
67: L1 Instruction 32 KiB (x32)
67: L2 Unified 512 KiB (x32)
67: L3 Unified 16384 KiB (x16)
67: Load Average: 1.67, 2.45, 5.15
67: APU or dGPU: dGPU
67: Architecture capable of accessing system allocated memory: 1
67: CPU architecture: NATIVE
67: Default Device: HIP
67: GPU architecture: AMD_GFX908
67: Is Large Bar: 1
67: KOKKOS_COMPILER_CLANG: 2000
67: KOKKOS_ENABLE_ASM: no
67: KOKKOS_ENABLE_CXX20: yes
67: KOKKOS_ENABLE_CXX23: no
67: KOKKOS_ENABLE_CXX26: no
67: KOKKOS_ENABLE_DEBUG_BOUNDS_CHECK: no
67: KOKKOS_ENABLE_HIP: yes
67: KOKKOS_ENABLE_HIP_RELOCATABLE_DEVICE_CODE: yes
67: KOKKOS_ENABLE_HWLOC: no
67: KOKKOS_ENABLE_LIBDL: yes
67: KOKKOS_ENABLE_PRAGMA_IVDEP: no
67: KOKKOS_ENABLE_PRAGMA_LOOPCOUNT: no
67: KOKKOS_ENABLE_PRAGMA_UNROLL: no
67: KOKKOS_ENABLE_PRAGMA_VECTOR: no
67: KOKKOS_ENABLE_SERIAL: yes
67: Kernel reports HMM module via `CONFIG_HMM_MIRROR=y` in `/boot/config`: no
67: Kokkos Version: 5.3.99
67: Kokkos::HIP[ 0 ] gcnArch gfx908:sramecc+:xnack-: Selected
67: Shared Memory per Block: 64 KiB
67: Supports Managed Memory: 1
67: System allows accessing system allocated memory on GPU: 0
67: Total Global Memory: 31.98 GiB
67: Wavefront Size: 64
67: XNACK environment variable set: no
67: desul atomics version: 72536f9a004d55affb4de19e0938dd3443eae759
67: macro HIP_VERSION: 70051831 = version 7.0.51831
67: macro KOKKOS_ENABLE_HIP: defined
67: macro KOKKOS_ENABLE_IMPL_HIP_MALLOC_ASYNC: no
67: macro KOKKOS_ENABLE_ROCTHRUST: defined
67: mdspan version: d1636dadb9f7a57fcca534d4c199b5e1b7666eaf
67: platform: 64bit
67: ***WARNING*** ASLR is enabled, the results may have unreproducible noise in them.
67: ------------------------------------------------------------------------------------------
67: Benchmark Time CPU Iterations FOM: rate
67: ------------------------------------------------------------------------------------------
67: Random64/N:2097152/K:1/real_time 66.1 us 65.8 us 10614 31.7191G/s
67: Random64/N:2097152/K:256/real_time 15761 us 12656 us 427 34.0636G/s
67: Random1024/N:2097152/K:1/real_time 665 us 663 us 1051 3.15142G/s
67: Random1024/N:2097152/K:256/real_time 10133 us 10099 us 69 52.9811G/s
67/73 Test #67: Kokkos_PerformanceTest_Random .............................. Passed 9.99 sec
test 68
Start 68: Kokkos_PerformanceTest_SortByKey
68: Test command: /var/jenkins/workspace/Kokkos_nightly/build/algorithms/perf_test/Kokkos_PerformanceTest_SortByKey "--benchmark_counters_tabular=true" "--benchmark_out=Kokkos_PerformanceTest_SortByKey_2026-11-01_T04-32-21.json"
68: Environment variable modifications:
68: KOKKOS_TOOLS_LIBS=cmake_list_append:/var/jenkins/workspace/Kokkos_nightly/build/core/unit_test/libkokkoshwmtracker-tool.so
68: Test timeout computed to be: 600
68: 2026-11-01T05:12:14+00:00
68: Running /var/jenkins/workspace/Kokkos_nightly/build/algorithms/perf_test/Kokkos_PerformanceTest_SortByKey
68: Run on (64 X 2994.5 MHz CPU s)
68: CPU Caches:
68: L1 Data 32 KiB (x32)
68: L1 Instruction 32 KiB (x32)
68: L2 Unified 512 KiB (x32)
68: L3 Unified 16384 KiB (x16)
68: Load Average: 2.10, 2.52, 5.14
68: APU or dGPU: dGPU
68: Architecture capable of accessing system allocated memory: 1
68: CPU architecture: NATIVE
68: Default Device: HIP
68: GPU architecture: AMD_GFX908
68: Is Large Bar: 1
68: KOKKOS_COMPILER_CLANG: 2000
68: KOKKOS_ENABLE_ASM: no
68: KOKKOS_ENABLE_CXX20: yes
68: KOKKOS_ENABLE_CXX23: no
68: KOKKOS_ENABLE_CXX26: no
68: KOKKOS_ENABLE_DEBUG_BOUNDS_CHECK: no
68: KOKKOS_ENABLE_HIP: yes
68: KOKKOS_ENABLE_HIP_RELOCATABLE_DEVICE_CODE: yes
68: KOKKOS_ENABLE_HWLOC: no
68: KOKKOS_ENABLE_LIBDL: yes
68: KOKKOS_ENABLE_PRAGMA_IVDEP: no
68: KOKKOS_ENABLE_PRAGMA_LOOPCOUNT: no
68: KOKKOS_ENABLE_PRAGMA_UNROLL: no
68: KOKKOS_ENABLE_PRAGMA_VECTOR: no
68: KOKKOS_ENABLE_SERIAL: yes
68: Kernel reports HMM module via `CONFIG_HMM_MIRROR=y` in `/boot/config`: no
68: Kokkos Version: 5.3.99
68: Kokkos::HIP[ 0 ] gcnArch gfx908:sramecc+:xnack-: Selected
68: Shared Memory per Block: 64 KiB
68: Supports Managed Memory: 1
68: System allows accessing system allocated memory on GPU: 0
68: Total Global Memory: 31.98 GiB
68: Wavefront Size: 64
68: XNACK environment variable set: no
68: desul atomics version: 72536f9a004d55affb4de19e0938dd3443eae759
68: macro HIP_VERSION: 70051831 = version 7.0.51831
68: macro KOKKOS_ENABLE_HIP: defined
68: macro KOKKOS_ENABLE_IMPL_HIP_MALLOC_ASYNC: no
68: macro KOKKOS_ENABLE_ROCTHRUST: defined
68: mdspan version: d1636dadb9f7a57fcca534d4c199b5e1b7666eaf
68: platform: 64bit
68: ***WARNING*** ASLR is enabled, the results may have unreproducible noise in them.
68: ------------------------------------------------------------------------------------------------------------------------
68: Benchmark Time CPU Iterations FOM: GB/s MB Passed
68: ------------------------------------------------------------------------------------------------------------------------
68: BM_sort_by_key<unsigned>/100000/manual_time 0.000 s 0.000 s 7523 8.54136/s 0.8 1
68: BM_sort_by_key<int>/100000/manual_time 0.000 s 0.000 s 7434 8.51941/s 0.8 1
68: BM_sort_by_key<long long>/100000/manual_time 0.000 s 0.000 s 6237 7.11962/s 0.8 1
68: BM_sort_by_key<float>/100000/manual_time 0.000 s 0.000 s 6934 7.94575/s 0.8 1
68: BM_sort_by_key<double>/100000/manual_time 0.000 s 0.000 s 5682 6.49603/s 0.8 1
68/73 Test #68: Kokkos_PerformanceTest_SortByKey ........................... Passed 6.62 sec
test 69
Start 69: Kokkos_UnitTest_SIMD
69: Test command: /var/jenkins/workspace/Kokkos_nightly/build/simd/unit_tests/Kokkos_UnitTest_SIMD
69: Environment variable modifications:
69: KOKKOS_TOOLS_LIBS=cmake_list_append:/var/jenkins/workspace/Kokkos_nightly/build/core/unit_test/libkokkoshwmtracker-tool.so
69: Test timeout computed to be: 600
69: [==========] Running 31 tests from 1 test suite.
69: [----------] Global test environment set-up.
69: [----------] 31 tests from simd
69: [ RUN ] simd.host_arithmetic_ops
69: [ OK ] simd.host_arithmetic_ops (0 ms)
69: [ RUN ] simd.device_arithmetic_ops
69: [ OK ] simd.device_arithmetic_ops (0 ms)
69: [ RUN ] simd.host_bitwise_ops
69: [ OK ] simd.host_bitwise_ops (0 ms)
69: [ RUN ] simd.host_mask_bitwise_ops
69: [ OK ] simd.host_mask_bitwise_ops (0 ms)
69: [ RUN ] simd.device_bitwise_ops
69: [ OK ] simd.device_bitwise_ops (0 ms)
69: [ RUN ] simd.device_mask_bitwise_ops
69: [ OK ] simd.device_mask_bitwise_ops (4 ms)
69: [ RUN ] simd.host_comparison_ops
69: [ OK ] simd.host_comparison_ops (0 ms)
69: [ RUN ] simd.host_mask_comparison_ops
69: [ OK ] simd.host_mask_comparison_ops (0 ms)
69: [ RUN ] simd.device_comparison_ops
69: [ OK ] simd.device_comparison_ops (1 ms)
69: [ RUN ] simd.device_mask_comparison_ops
69: [ OK ] simd.device_mask_comparison_ops (0 ms)
69: [ RUN ] simd.host_condition
69: [ OK ] simd.host_condition (0 ms)
69: [ RUN ] simd.device_condition
69: [ OK ] simd.device_condition (0 ms)
69: [ RUN ] simd.host_construction
69: [ OK ] simd.host_construction (0 ms)
69: [ RUN ] simd.device_construction
69: [ OK ] simd.device_construction (0 ms)
69: [ RUN ] simd.host_conversions
69: [ OK ] simd.host_conversions (0 ms)
69: [ RUN ] simd.device_conversions
69: [ OK ] simd.device_conversions (0 ms)
69: [ RUN ] simd.host_gen_ctors
69: [ OK ] simd.host_gen_ctors (0 ms)
69: [ RUN ] simd.device_gen_ctors
69: [ OK ] simd.device_gen_ctors (0 ms)
69: [ RUN ] simd.host_simd_construction_in_device
69: [ OK ] simd.host_simd_construction_in_device (0 ms)
69: [ RUN ] simd.host_loadstore
69: [ OK ] simd.host_loadstore (0 ms)
69: [ RUN ] simd.device_loadstore
69: [ OK ] simd.device_loadstore (0 ms)
69: [ RUN ] simd.host_mask_ops
69: [ OK ] simd.host_mask_ops (0 ms)
69: [ RUN ] simd.device_mask_ops
69: [ OK ] simd.device_mask_ops (0 ms)
69: [ RUN ] simd.host_math_ops
69: [ OK ] simd.host_math_ops (0 ms)
69: [ RUN ] simd.device_math_ops
69: [ OK ] simd.device_math_ops (4 ms)
69: [ RUN ] simd.host_memory_permute
69: [ OK ] simd.host_memory_permute (0 ms)
69: [ RUN ] simd.device_memory_permute
69: [ OK ] simd.device_memory_permute (0 ms)
69: [ RUN ] simd.host_reductions
69: [ OK ] simd.host_reductions (0 ms)
69: [ RUN ] simd.device_reductions
69: [ OK ] simd.device_reductions (1 ms)
69: [ RUN ] simd.host_shift_ops
69: [ OK ] simd.host_shift_ops (0 ms)
69: [ RUN ] simd.device_shift_ops
69: [ OK ] simd.device_shift_ops (0 ms)
69: [----------] 31 tests from simd (13 ms total)
69:
69: [----------] Global test environment tear-down
69: [==========] 31 tests from 1 test suite ran. (13 ms total)
69: [ PASSED ] 31 tests.
69/73 Test #69: Kokkos_UnitTest_SIMD ....................................... Passed 0.36 sec
test 70
Start 70: Kokkos_PerformanceTest_SIMD_Host
70: Test command: /var/jenkins/workspace/Kokkos_nightly/build/simd/perf_tests/Kokkos_PerformanceTest_SIMD_Host "--benchmark_counters_tabular=true" "--benchmark_out=Kokkos_PerformanceTest_SIMD_Host_2026-11-01_T04-32-21.json"
70: Environment variable modifications:
70: KOKKOS_TOOLS_LIBS=cmake_list_append:/var/jenkins/workspace/Kokkos_nightly/build/core/unit_test/libkokkoshwmtracker-tool.so
70: Test timeout computed to be: 600
70: 2026-11-01T05:12:21+00:00
70: Running /var/jenkins/workspace/Kokkos_nightly/build/simd/perf_tests/Kokkos_PerformanceTest_SIMD_Host
70: Run on (64 X 2994.5 MHz CPU s)
70: CPU Caches:
70: L1 Data 32 KiB (x32)
70: L1 Instruction 32 KiB (x32)
70: L2 Unified 512 KiB (x32)
70: L3 Unified 16384 KiB (x16)
70: Load Average: 2.01, 2.49, 5.10
70: APU or dGPU: dGPU
70: Architecture capable of accessing system allocated memory: 1
70: CPU architecture: NATIVE
70: Default Device: HIP
70: GPU architecture: AMD_GFX908
70: Is Large Bar: 1
70: KOKKOS_COMPILER_CLANG: 2000
70: KOKKOS_ENABLE_ASM: no
70: KOKKOS_ENABLE_CXX20: yes
70: KOKKOS_ENABLE_CXX23: no
70: KOKKOS_ENABLE_CXX26: no
70: KOKKOS_ENABLE_DEBUG_BOUNDS_CHECK: no
70: KOKKOS_ENABLE_HIP: yes
70: KOKKOS_ENABLE_HIP_RELOCATABLE_DEVICE_CODE: yes
70: KOKKOS_ENABLE_HWLOC: no
70: KOKKOS_ENABLE_LIBDL: yes
70: KOKKOS_ENABLE_PRAGMA_IVDEP: no
70: KOKKOS_ENABLE_PRAGMA_LOOPCOUNT: no
70: KOKKOS_ENABLE_PRAGMA_UNROLL: no
70: KOKKOS_ENABLE_PRAGMA_VECTOR: no
70: KOKKOS_ENABLE_SERIAL: yes
70: Kernel reports HMM module via `CONFIG_HMM_MIRROR=y` in `/boot/config`: no
70: Kokkos Version: 5.3.99
70: Kokkos::HIP[ 0 ] gcnArch gfx908:sramecc+:xnack-: Selected
70: Shared Memory per Block: 64 KiB
70: Supports Managed Memory: 1
70: System allows accessing system allocated memory on GPU: 0
70: Total Global Memory: 31.98 GiB
70: Wavefront Size: 64
70: XNACK environment variable set: no
70: desul atomics version: 72536f9a004d55affb4de19e0938dd3443eae759
70: macro HIP_VERSION: 70051831 = version 7.0.51831
70: macro KOKKOS_ENABLE_HIP: defined
70: macro KOKKOS_ENABLE_IMPL_HIP_MALLOC_ASYNC: no
70: macro KOKKOS_ENABLE_ROCTHRUST: defined
70: mdspan version: d1636dadb9f7a57fcca534d4c199b5e1b7666eaf
70: platform: 64bit
70: ***WARNING*** ASLR is enabled, the results may have unreproducible noise in them.
70: ----------------------------------------------------------------------------------------------------
70: Benchmark Time CPU Iterations
70: ----------------------------------------------------------------------------------------------------
70: host common scalar i32 add/iterations:3 0.014 ms 0.013 ms 3
70: host common scalar i32 sub/iterations:3 0.010 ms 0.008 ms 3
70: host common scalar i32 multiply/iterations:3 0.009 ms 0.009 ms 3
70: host common scalar i32 abs/iterations:3 0.005 ms 0.005 ms 3
70: host common scalar i32 shift_right/iterations:3 0.008 ms 0.008 ms 3
70: host common scalar i32 shift_left/iterations:3 0.007 ms 0.007 ms 3
70: host common scalar i32 min/iterations:3 0.007 ms 0.007 ms 3
70: host common scalar i32 max/iterations:3 0.008 ms 0.008 ms 3
70: host common scalar i32 reduce/iterations:3 0.005 ms 0.005 ms 3
70: host common scalar i32 reduce_min/iterations:3 0.005 ms 0.005 ms 3
70: host common scalar i32 reduce_max/iterations:3 0.005 ms 0.005 ms 3
70: host common scalar i32 masked_reduce/iterations:3 0.007 ms 0.007 ms 3
70: host common scalar i32 masked_reduce_min/iterations:3 0.006 ms 0.006 ms 3
70: host common scalar i32 masked_reduce_max/iterations:3 0.006 ms 0.006 ms 3
70: host common scalar i64 add/iterations:3 0.031 ms 0.031 ms 3
70: host common scalar i64 sub/iterations:3 0.020 ms 0.020 ms 3
70: host common scalar i64 multiply/iterations:3 0.020 ms 0.019 ms 3
70: host common scalar i64 abs/iterations:3 0.012 ms 0.012 ms 3
70: host common scalar i64 shift_right/iterations:3 0.020 ms 0.020 ms 3
70: host common scalar i64 shift_left/iterations:3 0.020 ms 0.020 ms 3
70: host common scalar i64 min/iterations:3 0.020 ms 0.020 ms 3
70: host common scalar i64 max/iterations:3 0.020 ms 0.020 ms 3
70: host common scalar i64 reduce/iterations:3 0.011 ms 0.011 ms 3
70: host common scalar i64 reduce_min/iterations:3 0.011 ms 0.011 ms 3
70: host common scalar i64 reduce_max/iterations:3 0.011 ms 0.011 ms 3
70: host common scalar i64 masked_reduce/iterations:3 0.016 ms 0.016 ms 3
70: host common scalar i64 masked_reduce_min/iterations:3 0.013 ms 0.013 ms 3
70: host common scalar i64 masked_reduce_max/iterations:3 0.013 ms 0.013 ms 3
70: host common scalar u64 add/iterations:3 0.032 ms 0.030 ms 3
70: host common scalar u64 sub/iterations:3 0.020 ms 0.020 ms 3
70: host common scalar u64 multiply/iterations:3 0.019 ms 0.019 ms 3
70: host common scalar u64 abs/iterations:3 0.012 ms 0.012 ms 3
70: host common scalar u64 shift_right/iterations:3 0.019 ms 0.019 ms 3
70: host common scalar u64 shift_left/iterations:3 0.020 ms 0.020 ms 3
70: host common scalar u64 min/iterations:3 0.020 ms 0.020 ms 3
70: host common scalar u64 max/iterations:3 0.020 ms 0.020 ms 3
70: host common scalar u64 reduce/iterations:3 0.009 ms 0.009 ms 3
70: host common scalar u64 reduce_min/iterations:3 0.010 ms 0.010 ms 3
70: host common scalar u64 reduce_max/iterations:3 0.010 ms 0.010 ms 3
70: host common scalar u64 masked_reduce/iterations:3 0.016 ms 0.016 ms 3
70: host common scalar u64 masked_reduce_min/iterations:3 0.013 ms 0.013 ms 3
70: host common scalar u64 masked_reduce_max/iterations:3 0.016 ms 0.016 ms 3
70: host common scalar double add/iterations:3 0.029 ms 0.029 ms 3
70: host common scalar double sub/iterations:3 0.019 ms 0.019 ms 3
70: host common scalar double multiply/iterations:3 0.018 ms 0.018 ms 3
70: host common scalar double divide/iterations:3 0.020 ms 0.020 ms 3
70: host common scalar double floor/iterations:3 0.011 ms 0.011 ms 3
70: host common scalar double ceil/iterations:3 0.011 ms 0.011 ms 3
70: host common scalar double round/iterations:3 0.070 ms 0.070 ms 3
70: host common scalar double truncate/iterations:3 0.013 ms 0.010 ms 3
70: host common scalar double abs/iterations:3 0.011 ms 0.011 ms 3
70: host common scalar double min/iterations:3 0.014 ms 0.014 ms 3
70: host common scalar double max/iterations:3 0.014 ms 0.014 ms 3
70: host common scalar double reduce/iterations:3 0.010 ms 0.010 ms 3
70: host common scalar double reduce_min/iterations:3 0.010 ms 0.010 ms 3
70: host common scalar double reduce_max/iterations:3 0.012 ms 0.012 ms 3
70: host common scalar double masked_reduce/iterations:3 0.016 ms 0.016 ms 3
70: host common scalar double masked_reduce_min/iterations:3 0.013 ms 0.013 ms 3
70: host common scalar double masked_reduce_max/iterations:3 0.013 ms 0.013 ms 3
70: host common scalar float add/iterations:3 0.012 ms 0.012 ms 3
70: host common scalar float sub/iterations:3 0.007 ms 0.007 ms 3
70: host common scalar float multiply/iterations:3 0.007 ms 0.007 ms 3
70: host common scalar float divide/iterations:3 0.007 ms 0.007 ms 3
70: host common scalar float floor/iterations:3 0.005 ms 0.005 ms 3
70: host common scalar float ceil/iterations:3 0.005 ms 0.005 ms 3
70: host common scalar float round/iterations:3 0.086 ms 0.086 ms 3
70: host common scalar float truncate/iterations:3 0.005 ms 0.005 ms 3
70: host common scalar float abs/iterations:3 0.005 ms 0.005 ms 3
70: host common scalar float min/iterations:3 0.007 ms 0.007 ms 3
70: host common scalar float max/iterations:3 0.007 ms 0.007 ms 3
70: host common scalar float reduce/iterations:3 0.006 ms 0.006 ms 3
70: host common scalar float reduce_min/iterations:3 0.005 ms 0.005 ms 3
70: host common scalar float reduce_max/iterations:3 0.005 ms 0.005 ms 3
70: host common scalar float masked_reduce/iterations:3 0.006 ms 0.006 ms 3
70: host common scalar float masked_reduce_min/iterations:3 0.007 ms 0.005 ms 3
70: host common scalar float masked_reduce_max/iterations:3 0.005 ms 0.005 ms 3
70: host math scalar double exp/iterations:3 0.289 ms 0.287 ms 3
70: host math scalar double exp2/iterations:3 0.171 ms 0.170 ms 3
70: host math scalar double log/iterations:3 0.247 ms 0.246 ms 3
70: host math scalar double log10/iterations:3 0.508 ms 0.506 ms 3
70: host math scalar double log2/iterations:3 0.244 ms 0.242 ms 3
70: host math scalar double sqrt/iterations:3 0.136 ms 0.136 ms 3
70: host math scalar double cbrt/iterations:3 0.758 ms 0.754 ms 3
70: host math scalar double sin/iterations:3 1.09 ms 1.08 ms 3
70: host math scalar double cos/iterations:3 1.10 ms 1.10 ms 3
70: host math scalar double tan/iterations:3 1.49 ms 1.49 ms 3
70: host math scalar double asin/iterations:3 0.415 ms 0.413 ms 3
70: host math scalar double acos/iterations:3 0.399 ms 0.397 ms 3
70: host math scalar double atan/iterations:3 0.549 ms 0.546 ms 3
70: host math scalar double sinh/iterations:3 0.668 ms 0.666 ms 3
70: host math scalar double cosh/iterations:3 0.465 ms 0.463 ms 3
70: host math scalar double tanh/iterations:3 0.476 ms 0.475 ms 3
70: host math scalar double asinh/iterations:3 0.584 ms 0.581 ms 3
70: host math scalar double acosh/iterations:3 0.537 ms 0.536 ms 3
70: host math scalar double atanh/iterations:3 0.272 ms 0.270 ms 3
70: host math scalar double erf/iterations:3 0.245 ms 0.244 ms 3
70: host math scalar double erfc/iterations:3 0.942 ms 0.939 ms 3
70: host math scalar double tgamma/iterations:3 5.76 ms 5.73 ms 3
70: host math scalar double lgamma/iterations:3 0.762 ms 0.758 ms 3
70: host math scalar double pow/iterations:3 0.854 ms 0.851 ms 3
70: host math scalar double hypot/iterations:3 0.442 ms 0.439 ms 3
70: host math scalar double atan2/iterations:3 1.000 ms 0.996 ms 3
70: host math scalar double copysign/iterations:3 0.019 ms 0.019 ms 3
70: host math scalar double fma/iterations:3 0.031 ms 0.031 ms 3
70: host math scalar double ternary_hypot/iterations:3 0.035 ms 0.035 ms 3
70: host math scalar float exp/iterations:3 0.224 ms 0.223 ms 3
70: host math scalar float exp2/iterations:3 0.138 ms 0.138 ms 3
70: host math scalar float log/iterations:3 0.155 ms 0.153 ms 3
70: host math scalar float log10/iterations:3 0.365 ms 0.363 ms 3
70: host math scalar float log2/iterations:3 0.153 ms 0.153 ms 3
70: host math scalar float sqrt/iterations:3 0.086 ms 0.084 ms 3
70: host math scalar float cbrt/iterations:3 0.630 ms 0.628 ms 3
70: host math scalar float sin/iterations:3 0.539 ms 0.537 ms 3
70: host math scalar float cos/iterations:3 0.524 ms 0.521 ms 3
70: host math scalar float tan/iterations:3 0.895 ms 0.892 ms 3
70: host math scalar float asin/iterations:3 0.523 ms 0.520 ms 3
70: host math scalar float acos/iterations:3 0.536 ms 0.533 ms 3
70: host math scalar float atan/iterations:3 0.371 ms 0.370 ms 3
70: host math scalar float sinh/iterations:3 0.744 ms 0.741 ms 3
70: host math scalar float cosh/iterations:3 0.560 ms 0.557 ms 3
70: host math scalar float tanh/iterations:3 0.508 ms 0.506 ms 3
70: host math scalar float asinh/iterations:3 0.421 ms 0.419 ms 3
70: host math scalar float acosh/iterations:3 0.372 ms 0.371 ms 3
70: host math scalar float atanh/iterations:3 0.337 ms 0.335 ms 3
70: host math scalar float erf/iterations:3 0.302 ms 0.300 ms 3
70: host math scalar float erfc/iterations:3 0.933 ms 0.929 ms 3
70: host math scalar float tgamma/iterations:3 1.75 ms 1.75 ms 3
70: host math scalar float lgamma/iterations:3 0.652 ms 0.650 ms 3
70: host math scalar float pow/iterations:3 0.357 ms 0.355 ms 3
70: host math scalar float hypot/iterations:3 0.170 ms 0.168 ms 3
70: host math scalar float atan2/iterations:3 0.827 ms 0.825 ms 3
70: host math scalar float copysign/iterations:3 0.008 ms 0.008 ms 3
70: host math scalar float fma/iterations:3 0.013 ms 0.013 ms 3
70: host math scalar float ternary_hypot/iterations:3 0.011 ms 0.011 ms 3
70: host common avx2 x4 i32 add/iterations:3 0.019 ms 0.019 ms 3
70: host common avx2 x4 i32 sub/iterations:3 0.018 ms 0.017 ms 3
70: host common avx2 x4 i32 multiply/iterations:3 0.016 ms 0.016 ms 3
70: host common avx2 x4 i32 abs/iterations:3 0.011 ms 0.011 ms 3
70: host common avx2 x4 i32 shift_right/iterations:3 0.017 ms 0.017 ms 3
70: host common avx2 x4 i32 shift_left/iterations:3 0.016 ms 0.016 ms 3
70: host common avx2 x4 i32 min/iterations:3 0.016 ms 0.016 ms 3
70: host common avx2 x4 i32 max/iterations:3 0.016 ms 0.016 ms 3
70: host common avx2 x4 i32 reduce/iterations:3 0.012 ms 0.012 ms 3
70: host common avx2 x4 i32 reduce_min/iterations:3 0.012 ms 0.012 ms 3
70: host common avx2 x4 i32 reduce_max/iterations:3 0.012 ms 0.012 ms 3
70: host common avx2 x4 i32 masked_reduce/iterations:3 0.090 ms 0.090 ms 3
70: host common avx2 x4 i32 masked_reduce_min/iterations:3 0.128 ms 0.128 ms 3
70: host common avx2 x4 i32 masked_reduce_max/iterations:3 0.125 ms 0.125 ms 3
70: host common avx2 x4 i64 add/iterations:3 0.030 ms 0.030 ms 3
70: host common avx2 x4 i64 sub/iterations:3 0.020 ms 0.020 ms 3
70: host common avx2 x4 i64 multiply/iterations:3 0.022 ms 0.021 ms 3
70: host common avx2 x4 i64 abs/iterations:3 0.013 ms 0.013 ms 3
70: host common avx2 x4 i64 shift_right/iterations:3 0.020 ms 0.020 ms 3
70: host common avx2 x4 i64 shift_left/iterations:3 0.021 ms 0.021 ms 3
70: host common avx2 x4 i64 min/iterations:3 0.018 ms 0.018 ms 3
70: host common avx2 x4 i64 max/iterations:3 0.018 ms 0.018 ms 3
70: host common avx2 x4 i64 reduce/iterations:3 0.007 ms 0.007 ms 3
70: host common avx2 x4 i64 reduce_min/iterations:3 0.008 ms 0.008 ms 3
70: host common avx2 x4 i64 reduce_max/iterations:3 0.008 ms 0.008 ms 3
70: host common avx2 x4 i64 masked_reduce/iterations:3 0.199 ms 0.199 ms 3
70: host common avx2 x4 i64 masked_reduce_min/iterations:3 0.179 ms 0.178 ms 3
70: host common avx2 x4 i64 masked_reduce_max/iterations:3 0.181 ms 0.179 ms 3
70: host common avx2 x4 u64 add/iterations:3 0.030 ms 0.030 ms 3
70: host common avx2 x4 u64 sub/iterations:3 0.020 ms 0.020 ms 3
70: host common avx2 x4 u64 multiply/iterations:3 0.021 ms 0.021 ms 3
70: host common avx2 x4 u64 abs/iterations:3 0.013 ms 0.013 ms 3
70: host common avx2 x4 u64 shift_right/iterations:3 0.020 ms 0.020 ms 3
70: host common avx2 x4 u64 shift_left/iterations:3 0.022 ms 0.021 ms 3
70: host common avx2 x4 u64 min/iterations:3 0.020 ms 0.020 ms 3
70: host common avx2 x4 u64 max/iterations:3 0.021 ms 0.021 ms 3
70: host common avx2 x4 u64 reduce/iterations:3 0.007 ms 0.007 ms 3
70: host common avx2 x4 u64 reduce_min/iterations:3 0.010 ms 0.010 ms 3
70: host common avx2 x4 u64 reduce_max/iterations:3 0.010 ms 0.010 ms 3
70: host common avx2 x4 u64 masked_reduce/iterations:3 0.204 ms 0.202 ms 3
70: host common avx2 x4 u64 masked_reduce_min/iterations:3 0.133 ms 0.133 ms 3
70: host common avx2 x4 u64 masked_reduce_max/iterations:3 0.179 ms 0.179 ms 3
70: host common avx2 x4 double add/iterations:3 0.030 ms 0.030 ms 3
70: host common avx2 x4 double sub/iterations:3 0.021 ms 0.021 ms 3
70: host common avx2 x4 double multiply/iterations:3 0.021 ms 0.021 ms 3
70: host common avx2 x4 double divide/iterations:3 0.022 ms 0.022 ms 3
70: host common avx2 x4 double floor/iterations:3 0.013 ms 0.013 ms 3
70: host common avx2 x4 double ceil/iterations:3 0.013 ms 0.013 ms 3
70: host common avx2 x4 double round/iterations:3 0.013 ms 0.013 ms 3
70: host common avx2 x4 double truncate/iterations:3 0.013 ms 0.013 ms 3
70: host common avx2 x4 double abs/iterations:3 0.013 ms 0.013 ms 3
70: host common avx2 x4 double min/iterations:3 0.020 ms 0.020 ms 3
70: host common avx2 x4 double max/iterations:3 0.020 ms 0.020 ms 3
70: host common avx2 x4 double reduce/iterations:3 0.007 ms 0.007 ms 3
70: host common avx2 x4 double reduce_min/iterations:3 0.007 ms 0.007 ms 3
70: host common avx2 x4 double reduce_max/iterations:3 0.007 ms 0.007 ms 3
70: host common avx2 x4 double masked_reduce/iterations:3 0.204 ms 0.203 ms 3
70: host common avx2 x4 double masked_reduce_min/iterations:3 0.207 ms 0.206 ms 3
70: host common avx2 x4 double masked_reduce_max/iterations:3 0.205 ms 0.205 ms 3
70: host common avx2 x4 float add/iterations:3 0.018 ms 0.018 ms 3
70: host common avx2 x4 float sub/iterations:3 0.016 ms 0.018 ms 3
70: host common avx2 x4 float multiply/iterations:3 0.016 ms 0.016 ms 3
70: host common avx2 x4 float divide/iterations:3 0.016 ms 0.016 ms 3
70: host common avx2 x4 float floor/iterations:3 0.011 ms 0.011 ms 3
70: host common avx2 x4 float ceil/iterations:3 0.011 ms 0.011 ms 3
70: host common avx2 x4 float round/iterations:3 0.011 ms 0.011 ms 3
70: host common avx2 x4 float truncate/iterations:3 0.011 ms 0.011 ms 3
70: host common avx2 x4 float abs/iterations:3 0.011 ms 0.011 ms 3
70: host common avx2 x4 float min/iterations:3 0.016 ms 0.016 ms 3
70: host common avx2 x4 float max/iterations:3 0.016 ms 0.016 ms 3
70: host common avx2 x4 float reduce/iterations:3 0.010 ms 0.010 ms 3
70: host common avx2 x4 float reduce_min/iterations:3 0.012 ms 0.012 ms 3
70: host common avx2 x4 float reduce_max/iterations:3 0.010 ms 0.010 ms 3
70: host common avx2 x4 float masked_reduce/iterations:3 0.191 ms 0.191 ms 3
70: host common avx2 x4 float masked_reduce_min/iterations:3 0.196 ms 0.194 ms 3
70: host common avx2 x4 float masked_reduce_max/iterations:3 0.201 ms 0.200 ms 3
70: host math avx2 x4 double exp/iterations:3 0.282 ms 0.280 ms 3
70: host math avx2 x4 double exp2/iterations:3 0.178 ms 0.178 ms 3
70: host math avx2 x4 double log/iterations:3 0.266 ms 0.266 ms 3
70: host math avx2 x4 double log10/iterations:3 0.524 ms 0.521 ms 3
70: host math avx2 x4 double log2/iterations:3 0.259 ms 0.257 ms 3
70: host math avx2 x4 double sqrt/iterations:3 0.035 ms 0.035 ms 3
70: host math avx2 x4 double cbrt/iterations:3 0.776 ms 0.773 ms 3
70: host math avx2 x4 double sin/iterations:3 1.11 ms 1.11 ms 3
70: host math avx2 x4 double cos/iterations:3 1.11 ms 1.11 ms 3
70: host math avx2 x4 double tan/iterations:3 1.50 ms 1.49 ms 3
70: host math avx2 x4 double asin/iterations:3 0.457 ms 0.456 ms 3
70: host math avx2 x4 double acos/iterations:3 0.395 ms 0.393 ms 3
70: host math avx2 x4 double atan/iterations:3 0.559 ms 0.557 ms 3
70: host math avx2 x4 double sinh/iterations:3 0.687 ms 0.684 ms 3
70: host math avx2 x4 double cosh/iterations:3 0.469 ms 0.465 ms 3
70: host math avx2 x4 double tanh/iterations:3 0.480 ms 0.479 ms 3
70: host math avx2 x4 double asinh/iterations:3 0.611 ms 0.608 ms 3
70: host math avx2 x4 double acosh/iterations:3 0.560 ms 0.557 ms 3
70: host math avx2 x4 double atanh/iterations:3 0.253 ms 0.253 ms 3
70: host math avx2 x4 double erf/iterations:3 0.244 ms 0.242 ms 3
70: host math avx2 x4 double erfc/iterations:3 0.957 ms 0.953 ms 3
70: host math avx2 x4 double tgamma/iterations:3 5.88 ms 5.87 ms 3
70: host math avx2 x4 double lgamma/iterations:3 0.852 ms 0.848 ms 3
70: host math avx2 x4 double pow/iterations:3 0.875 ms 0.869 ms 3
70: host math avx2 x4 double hypot/iterations:3 0.479 ms 0.476 ms 3
70: host math avx2 x4 double atan2/iterations:3 1.03 ms 1.02 ms 3
70: host math avx2 x4 double copysign/iterations:3 0.018 ms 0.018 ms 3
70: host math avx2 x4 double fma/iterations:3 0.029 ms 0.029 ms 3
70: host math avx2 x4 double ternary_hypot/iterations:3 0.045 ms 0.045 ms 3
70: host math avx2 x4 float exp/iterations:3 0.228 ms 0.226 ms 3
70: host math avx2 x4 float exp2/iterations:3 0.140 ms 0.140 ms 3
70: host math avx2 x4 float log/iterations:3 0.172 ms 0.170 ms 3
70: host math avx2 x4 float log10/iterations:3 0.438 ms 0.436 ms 3
70: host math avx2 x4 float log2/iterations:3 0.167 ms 0.166 ms 3
70: host math avx2 x4 float sqrt/iterations:3 0.022 ms 0.022 ms 3
70: host math avx2 x4 float cbrt/iterations:3 0.642 ms 0.639 ms 3
70: host math avx2 x4 float sin/iterations:3 0.502 ms 0.500 ms 3
70: host math avx2 x4 float cos/iterations:3 0.488 ms 0.486 ms 3
70: host math avx2 x4 float tan/iterations:3 0.912 ms 0.908 ms 3
70: host math avx2 x4 float asin/iterations:3 0.499 ms 0.497 ms 3
70: host math avx2 x4 float acos/iterations:3 0.459 ms 0.457 ms 3
70: host math avx2 x4 float atan/iterations:3 0.377 ms 0.376 ms 3
70: host math avx2 x4 float sinh/iterations:3 0.752 ms 0.749 ms 3
70: host math avx2 x4 float cosh/iterations:3 0.551 ms 0.548 ms 3
70: host math avx2 x4 float tanh/iterations:3 0.492 ms 0.491 ms 3
70: host math avx2 x4 float asinh/iterations:3 0.447 ms 0.445 ms 3
70: host math avx2 x4 float acosh/iterations:3 0.387 ms 0.386 ms 3
70: host math avx2 x4 float atanh/iterations:3 0.278 ms 0.276 ms 3
70: host math avx2 x4 float erf/iterations:3 0.248 ms 0.248 ms 3
70: host math avx2 x4 float erfc/iterations:3 0.956 ms 0.953 ms 3
70: host math avx2 x4 float tgamma/iterations:3 1.73 ms 1.72 ms 3
70: host math avx2 x4 float lgamma/iterations:3 0.642 ms 0.638 ms 3
70: host math avx2 x4 float pow/iterations:3 0.398 ms 0.396 ms 3
70: host math avx2 x4 float hypot/iterations:3 0.168 ms 0.168 ms 3
70: host math avx2 x4 float atan2/iterations:3 0.842 ms 0.837 ms 3
70: host math avx2 x4 float copysign/iterations:3 0.016 ms 0.016 ms 3
70: host math avx2 x4 float fma/iterations:3 0.025 ms 0.025 ms 3
70: host math avx2 x4 float ternary_hypot/iterations:3 0.023 ms 0.023 ms 3
70: host common avx2 x8 i32 add/iterations:3 0.013 ms 0.013 ms 3
70: host common avx2 x8 i32 sub/iterations:3 0.010 ms 0.010 ms 3
70: host common avx2 x8 i32 multiply/iterations:3 0.009 ms 0.009 ms 3
70: host common avx2 x8 i32 abs/iterations:3 0.007 ms 0.007 ms 3
70: host common avx2 x8 i32 shift_right/iterations:3 0.009 ms 0.009 ms 3
70: host common avx2 x8 i32 shift_left/iterations:3 0.010 ms 0.010 ms 3
70: host common avx2 x8 i32 min/iterations:3 0.009 ms 0.009 ms 3
70: host common avx2 x8 i32 max/iterations:3 0.009 ms 0.009 ms 3
70: host common avx2 x8 i32 reduce/iterations:3 0.007 ms 0.007 ms 3
70: host common avx2 x8 i32 reduce_min/iterations:3 0.008 ms 0.008 ms 3
70: host common avx2 x8 i32 reduce_max/iterations:3 0.007 ms 0.007 ms 3
70: host common avx2 x8 i32 masked_reduce/iterations:3 0.044 ms 0.042 ms 3
70: host common avx2 x8 i32 masked_reduce_min/iterations:3 0.153 ms 0.151 ms 3
70: host common avx2 x8 i32 masked_reduce_max/iterations:3 0.150 ms 0.148 ms 3
70: host common avx2 x8 float add/iterations:3 0.012 ms 0.012 ms 3
70: host common avx2 x8 float sub/iterations:3 0.009 ms 0.009 ms 3
70: host common avx2 x8 float multiply/iterations:3 0.009 ms 0.009 ms 3
70: host common avx2 x8 float divide/iterations:3 0.009 ms 0.009 ms 3
70: host common avx2 x8 float floor/iterations:3 0.007 ms 0.007 ms 3
70: host common avx2 x8 float ceil/iterations:3 0.007 ms 0.007 ms 3
70: host common avx2 x8 float round/iterations:3 0.007 ms 0.007 ms 3
70: host common avx2 x8 float truncate/iterations:3 0.006 ms 0.006 ms 3
70: host common avx2 x8 float abs/iterations:3 0.007 ms 0.007 ms 3
70: host common avx2 x8 float min/iterations:3 0.009 ms 0.009 ms 3
70: host common avx2 x8 float max/iterations:3 0.009 ms 0.009 ms 3
70: host common avx2 x8 float reduce/iterations:3 0.009 ms 0.008 ms 3
70: host common avx2 x8 float reduce_min/iterations:3 0.009 ms 0.009 ms 3
70: host common avx2 x8 float reduce_max/iterations:3 0.010 ms 0.009 ms 3
70: host common avx2 x8 float masked_reduce/iterations:3 0.192 ms 0.190 ms 3
70: host common avx2 x8 float masked_reduce_min/iterations:3 0.182 ms 0.180 ms 3
70: host common avx2 x8 float masked_reduce_max/iterations:3 0.191 ms 0.191 ms 3
70: host math avx2 x8 float exp/iterations:3 0.220 ms 0.218 ms 3
70: host math avx2 x8 float exp2/iterations:3 0.132 ms 0.132 ms 3
70: host math avx2 x8 float log/iterations:3 0.175 ms 0.173 ms 3
70: host math avx2 x8 float log10/iterations:3 0.397 ms 0.395 ms 3
70: host math avx2 x8 float log2/iterations:3 0.174 ms 0.173 ms 3
70: host math avx2 x8 float sqrt/iterations:3 0.011 ms 0.011 ms 3
70: host math avx2 x8 float cbrt/iterations:3 0.644 ms 0.641 ms 3
70: host math avx2 x8 float sin/iterations:3 0.474 ms 0.472 ms 3
70: host math avx2 x8 float cos/iterations:3 0.476 ms 0.473 ms 3
70: host math avx2 x8 float tan/iterations:3 0.894 ms 0.892 ms 3
70: host math avx2 x8 float asin/iterations:3 0.492 ms 0.489 ms 3
70: host math avx2 x8 float acos/iterations:3 0.456 ms 0.455 ms 3
70: host math avx2 x8 float atan/iterations:3 0.376 ms 0.375 ms 3
70: host math avx2 x8 float sinh/iterations:3 0.743 ms 0.738 ms 3
70: host math avx2 x8 float cosh/iterations:3 0.553 ms 0.552 ms 3
70: host math avx2 x8 float tanh/iterations:3 0.495 ms 0.493 ms 3
70: host math avx2 x8 float asinh/iterations:3 0.511 ms 0.508 ms 3
70: host math avx2 x8 float acosh/iterations:3 0.391 ms 0.389 ms 3
70: host math avx2 x8 float atanh/iterations:3 0.274 ms 0.273 ms 3
70: host math avx2 x8 float erf/iterations:3 0.259 ms 0.259 ms 3
70: host math avx2 x8 float erfc/iterations:3 0.970 ms 0.967 ms 3
70: host math avx2 x8 float tgamma/iterations:3 1.73 ms 1.73 ms 3
70: host math avx2 x8 float lgamma/iterations:3 0.626 ms 0.624 ms 3
70: host math avx2 x8 float pow/iterations:3 0.385 ms 0.383 ms 3
70: host math avx2 x8 float hypot/iterations:3 0.167 ms 0.167 ms 3
70: host math avx2 x8 float atan2/iterations:3 0.820 ms 0.816 ms 3
70: host math avx2 x8 float copysign/iterations:3 0.009 ms 0.009 ms 3
70: host math avx2 x8 float fma/iterations:3 0.013 ms 0.013 ms 3
70: host math avx2 x8 float ternary_hypot/iterations:3 0.012 ms 0.012 ms 3
70/73 Test #70: Kokkos_PerformanceTest_SIMD_Host ........................... Passed 0.74 sec
test 71
Start 71: Kokkos_PerformanceTest_SIMD_Device
71: Test command: /var/jenkins/workspace/Kokkos_nightly/build/simd/perf_tests/Kokkos_PerformanceTest_SIMD_Device "--benchmark_counters_tabular=true" "--benchmark_out=Kokkos_PerformanceTest_SIMD_Device_2026-11-01_T04-32-21.json"
71: Environment variable modifications:
71: KOKKOS_TOOLS_LIBS=cmake_list_append:/var/jenkins/workspace/Kokkos_nightly/build/core/unit_test/libkokkoshwmtracker-tool.so
71: Test timeout computed to be: 600
71: 2026-11-01T05:12:22+00:00
71: Running /var/jenkins/workspace/Kokkos_nightly/build/simd/perf_tests/Kokkos_PerformanceTest_SIMD_Device
71: Run on (64 X 2994.5 MHz CPU s)
71: CPU Caches:
71: L1 Data 32 KiB (x32)
71: L1 Instruction 32 KiB (x32)
71: L2 Unified 512 KiB (x32)
71: L3 Unified 16384 KiB (x16)
71: Load Average: 2.01, 2.49, 5.10
71: APU or dGPU: dGPU
71: Architecture capable of accessing system allocated memory: 1
71: CPU architecture: NATIVE
71: Default Device: HIP
71: GPU architecture: AMD_GFX908
71: Is Large Bar: 1
71: KOKKOS_COMPILER_CLANG: 2000
71: KOKKOS_ENABLE_ASM: no
71: KOKKOS_ENABLE_CXX20: yes
71: KOKKOS_ENABLE_CXX23: no
71: KOKKOS_ENABLE_CXX26: no
71: KOKKOS_ENABLE_DEBUG_BOUNDS_CHECK: no
71: KOKKOS_ENABLE_HIP: yes
71: KOKKOS_ENABLE_HIP_RELOCATABLE_DEVICE_CODE: yes
71: KOKKOS_ENABLE_HWLOC: no
71: KOKKOS_ENABLE_LIBDL: yes
71: KOKKOS_ENABLE_PRAGMA_IVDEP: no
71: KOKKOS_ENABLE_PRAGMA_LOOPCOUNT: no
71: KOKKOS_ENABLE_PRAGMA_UNROLL: no
71: KOKKOS_ENABLE_PRAGMA_VECTOR: no
71: KOKKOS_ENABLE_SERIAL: yes
71: Kernel reports HMM module via `CONFIG_HMM_MIRROR=y` in `/boot/config`: no
71: Kokkos Version: 5.3.99
71: Kokkos::HIP[ 0 ] gcnArch gfx908:sramecc+:xnack-: Selected
71: Shared Memory per Block: 64 KiB
71: Supports Managed Memory: 1
71: System allows accessing system allocated memory on GPU: 0
71: Total Global Memory: 31.98 GiB
71: Wavefront Size: 64
71: XNACK environment variable set: no
71: desul atomics version: 72536f9a004d55affb4de19e0938dd3443eae759
71: macro HIP_VERSION: 70051831 = version 7.0.51831
71: macro KOKKOS_ENABLE_HIP: defined
71: macro KOKKOS_ENABLE_IMPL_HIP_MALLOC_ASYNC: no
71: macro KOKKOS_ENABLE_ROCTHRUST: defined
71: mdspan version: d1636dadb9f7a57fcca534d4c199b5e1b7666eaf
71: platform: 64bit
71: ***WARNING*** ASLR is enabled, the results may have unreproducible noise in them.
71: -----------------------------------------------------------------------------------------------------------------
71: Benchmark Time CPU Iterations
71: -----------------------------------------------------------------------------------------------------------------
71: device common scalar i32 add/iterations:1/manual_time 12.2 ms 12.1 ms 1
71: device common scalar i32 sub/iterations:1/manual_time 12.0 ms 12.0 ms 1
71: device common scalar i32 multiply/iterations:1/manual_time 12.5 ms 12.5 ms 1
71: device common scalar i32 abs/iterations:1/manual_time 14.8 ms 14.7 ms 1
71: device common scalar i32 shift_right/iterations:1/manual_time 12.4 ms 12.4 ms 1
71: device common scalar i32 shift_left/iterations:1/manual_time 12.7 ms 12.7 ms 1
71: device common scalar i32 min/iterations:1/manual_time 15.1 ms 15.1 ms 1
71: device common scalar i32 max/iterations:1/manual_time 15.4 ms 15.4 ms 1
71: device common scalar i32 reduce/iterations:1/manual_time 11.3 ms 11.2 ms 1
71: device common scalar i32 reduce_min/iterations:1/manual_time 11.5 ms 11.4 ms 1
71: device common scalar i32 reduce_max/iterations:1/manual_time 12.2 ms 12.2 ms 1
71: device common scalar i32 masked_reduce/iterations:1/manual_time 12.8 ms 12.7 ms 1
71: device common scalar i32 masked_reduce_min/iterations:1/manual_time 12.5 ms 12.5 ms 1
71: device common scalar i32 masked_reduce_max/iterations:1/manual_time 13.2 ms 13.1 ms 1
71: device common scalar i64 add/iterations:1/manual_time 14.6 ms 14.6 ms 1
71: device common scalar i64 sub/iterations:1/manual_time 14.4 ms 14.4 ms 1
71: device common scalar i64 multiply/iterations:1/manual_time 15.3 ms 15.3 ms 1
71: device common scalar i64 abs/iterations:1/manual_time 16.3 ms 16.2 ms 1
71: device common scalar i64 shift_right/iterations:1/manual_time 13.5 ms 13.5 ms 1
71: device common scalar i64 shift_left/iterations:1/manual_time 14.4 ms 14.3 ms 1
71: device common scalar i64 min/iterations:1/manual_time 17.4 ms 17.4 ms 1
71: device common scalar i64 max/iterations:1/manual_time 17.5 ms 17.4 ms 1
71: device common scalar i64 reduce/iterations:1/manual_time 13.5 ms 13.5 ms 1
71: device common scalar i64 reduce_min/iterations:1/manual_time 12.6 ms 12.6 ms 1
71: device common scalar i64 reduce_max/iterations:1/manual_time 13.7 ms 13.6 ms 1
71: device common scalar i64 masked_reduce/iterations:1/manual_time 14.1 ms 14.1 ms 1
71: device common scalar i64 masked_reduce_min/iterations:1/manual_time 14.4 ms 14.3 ms 1
71: device common scalar i64 masked_reduce_max/iterations:1/manual_time 13.6 ms 13.5 ms 1
71: device common scalar u64 add/iterations:1/manual_time 14.1 ms 14.0 ms 1
71: device common scalar u64 sub/iterations:1/manual_time 14.8 ms 14.8 ms 1
71: device common scalar u64 multiply/iterations:1/manual_time 15.8 ms 15.8 ms 1
71: device common scalar u64 abs/iterations:1/manual_time 13.1 ms 13.0 ms 1
71: device common scalar u64 shift_right/iterations:1/manual_time 13.9 ms 13.8 ms 1
71: device common scalar u64 shift_left/iterations:1/manual_time 13.7 ms 13.7 ms 1
71: device common scalar u64 min/iterations:1/manual_time 17.0 ms 16.9 ms 1
71: device common scalar u64 max/iterations:1/manual_time 17.7 ms 17.7 ms 1
71: device common scalar u64 reduce/iterations:1/manual_time 13.2 ms 13.1 ms 1
71: device common scalar u64 reduce_min/iterations:1/manual_time 13.4 ms 13.3 ms 1
71: device common scalar u64 reduce_max/iterations:1/manual_time 13.2 ms 13.1 ms 1
71: device common scalar u64 masked_reduce/iterations:1/manual_time 13.5 ms 13.5 ms 1
71: device common scalar u64 masked_reduce_min/iterations:1/manual_time 14.3 ms 14.3 ms 1
71: device common scalar u64 masked_reduce_max/iterations:1/manual_time 14.2 ms 14.1 ms 1
71: device common scalar double add/iterations:1/manual_time 14.3 ms 14.3 ms 1
71: device common scalar double sub/iterations:1/manual_time 14.3 ms 14.2 ms 1
71: device common scalar double multiply/iterations:1/manual_time 13.9 ms 13.8 ms 1
71: device common scalar double divide/iterations:1/manual_time 17.3 ms 17.2 ms 1
71: device common scalar double floor/iterations:1/manual_time 14.1 ms 14.1 ms 1
71: device common scalar double ceil/iterations:1/manual_time 14.0 ms 14.0 ms 1
71: device common scalar double round/iterations:1/manual_time 19.0 ms 19.0 ms 1
71: device common scalar double truncate/iterations:1/manual_time 13.5 ms 13.5 ms 1
71: device common scalar double abs/iterations:1/manual_time 16.5 ms 16.4 ms 1
71: device common scalar double min/iterations:1/manual_time 16.9 ms 16.8 ms 1
71: device common scalar double max/iterations:1/manual_time 17.6 ms 17.5 ms 1
71: device common scalar double reduce/iterations:1/manual_time 13.1 ms 13.0 ms 1
71: device common scalar double reduce_min/iterations:1/manual_time 13.2 ms 13.1 ms 1
71: device common scalar double reduce_max/iterations:1/manual_time 13.1 ms 13.0 ms 1
71: device common scalar double masked_reduce/iterations:1/manual_time 14.4 ms 14.3 ms 1
71: device common scalar double masked_reduce_min/iterations:1/manual_time 14.2 ms 14.1 ms 1
71: device common scalar double masked_reduce_max/iterations:1/manual_time 14.0 ms 14.0 ms 1
71: device common scalar float add/iterations:1/manual_time 12.8 ms 12.7 ms 1
71: device common scalar float sub/iterations:1/manual_time 12.7 ms 12.7 ms 1
71: device common scalar float multiply/iterations:1/manual_time 12.6 ms 12.6 ms 1
71: device common scalar float divide/iterations:1/manual_time 14.1 ms 14.0 ms 1
71: device common scalar float floor/iterations:1/manual_time 12.5 ms 12.4 ms 1
71: device common scalar float ceil/iterations:1/manual_time 11.8 ms 11.8 ms 1
71: device common scalar float round/iterations:1/manual_time 16.9 ms 16.8 ms 1
71: device common scalar float truncate/iterations:1/manual_time 12.8 ms 12.7 ms 1
71: device common scalar float abs/iterations:1/manual_time 14.8 ms 14.8 ms 1
71: device common scalar float min/iterations:1/manual_time 14.9 ms 14.9 ms 1
71: device common scalar float max/iterations:1/manual_time 14.9 ms 14.8 ms 1
71: device common scalar float reduce/iterations:1/manual_time 12.3 ms 12.3 ms 1
71: device common scalar float reduce_min/iterations:1/manual_time 4027 ms 3493 ms 1
71: device common scalar float reduce_max/iterations:1/manual_time 11.3 ms 11.3 ms 1
71: device common scalar float masked_reduce/iterations:1/manual_time 12.5 ms 12.4 ms 1
71: device common scalar float masked_reduce_min/iterations:1/manual_time 12.1 ms 12.1 ms 1
71: device common scalar float masked_reduce_max/iterations:1/manual_time 12.8 ms 12.7 ms 1
71: device math scalar double exp/iterations:1/manual_time 19.0 ms 18.9 ms 1
71: device math scalar double exp2/iterations:1/manual_time 19.2 ms 19.1 ms 1
71: device math scalar double log/iterations:1/manual_time 35.7 ms 35.6 ms 1
71: device math scalar double log10/iterations:1/manual_time 37.7 ms 37.6 ms 1
71: device math scalar double log2/iterations:1/manual_time 32.8 ms 32.7 ms 1
71: device math scalar double sqrt/iterations:1/manual_time 18.8 ms 18.7 ms 1
71: device math scalar double cbrt/iterations:1/manual_time 21.0 ms 21.0 ms 1
71: device math scalar double sin/iterations:1/manual_time 30.2 ms 30.1 ms 1
71: device math scalar double cos/iterations:1/manual_time 30.2 ms 30.1 ms 1
71: device math scalar double tan/iterations:1/manual_time 37.1 ms 37.0 ms 1
71: device math scalar double asin/iterations:1/manual_time 34.1 ms 34.0 ms 1
71: device math scalar double acos/iterations:1/manual_time 31.5 ms 31.4 ms 1
71: device math scalar double atan/iterations:1/manual_time 25.1 ms 25.0 ms 1
71: device math scalar double sinh/iterations:1/manual_time 46.9 ms 46.7 ms 1
71: device math scalar double cosh/iterations:1/manual_time 46.5 ms 46.4 ms 1
71: device math scalar double tanh/iterations:1/manual_time 52.3 ms 52.2 ms 1
71: device math scalar double asinh/iterations:1/manual_time 60.1 ms 59.9 ms 1
71: device math scalar double acosh/iterations:1/manual_time 59.8 ms 59.6 ms 1
71: device math scalar double atanh/iterations:1/manual_time 51.4 ms 51.2 ms 1
71: device math scalar double erf/iterations:1/manual_time 29.4 ms 29.3 ms 1
71: device math scalar double erfc/iterations:1/manual_time 35.8 ms 35.7 ms 1
71: device math scalar double tgamma/iterations:1/manual_time 101 ms 101 ms 1
71: device math scalar double lgamma/iterations:1/manual_time 56.3 ms 56.1 ms 1
71: device math scalar double pow/iterations:1/manual_time 65.4 ms 65.2 ms 1
71: device math scalar double hypot/iterations:1/manual_time 20.9 ms 20.8 ms 1
71: device math scalar double atan2/iterations:1/manual_time 30.2 ms 30.1 ms 1
71: device math scalar double copysign/iterations:1/manual_time 14.6 ms 14.6 ms 1
71: device math scalar double fma/iterations:1/manual_time 15.4 ms 15.3 ms 1
71: device math scalar double ternary_hypot/iterations:1/manual_time 20.4 ms 20.3 ms 1
71: device math scalar float exp/iterations:1/manual_time 14.1 ms 14.1 ms 1
71: device math scalar float exp2/iterations:1/manual_time 13.6 ms 13.5 ms 1
71: device math scalar float log/iterations:1/manual_time 15.3 ms 15.2 ms 1
71: device math scalar float log10/iterations:1/manual_time 18.8 ms 18.7 ms 1
71: device math scalar float log2/iterations:1/manual_time 14.3 ms 14.3 ms 1
71: device math scalar float sqrt/iterations:1/manual_time 14.8 ms 14.7 ms 1
71: device math scalar float cbrt/iterations:1/manual_time 15.7 ms 15.7 ms 1
71: device math scalar float sin/iterations:1/manual_time 19.8 ms 19.7 ms 1
71: device math scalar float cos/iterations:1/manual_time 20.6 ms 20.5 ms 1
71: device math scalar float tan/iterations:1/manual_time 21.5 ms 21.4 ms 1
71: device math scalar float asin/iterations:1/manual_time 14.7 ms 14.6 ms 1
71: device math scalar float acos/iterations:1/manual_time 15.0 ms 15.0 ms 1
71: device math scalar float atan/iterations:1/manual_time 14.3 ms 14.3 ms 1
71: device math scalar float sinh/iterations:1/manual_time 28.1 ms 28.0 ms 1
71: device math scalar float cosh/iterations:1/manual_time 27.2 ms 27.1 ms 1
71: device math scalar float tanh/iterations:1/manual_time 18.0 ms 18.0 ms 1
71: device math scalar float asinh/iterations:1/manual_time 35.5 ms 35.4 ms 1
71: device math scalar float acosh/iterations:1/manual_time 35.0 ms 34.9 ms 1
71: device math scalar float atanh/iterations:1/manual_time 30.8 ms 30.7 ms 1
71: device math scalar float erf/iterations:1/manual_time 18.3 ms 18.2 ms 1
71: device math scalar float erfc/iterations:1/manual_time 19.6 ms 19.5 ms 1
71: device math scalar float tgamma/iterations:1/manual_time 50.0 ms 49.9 ms 1
71: device math scalar float lgamma/iterations:1/manual_time 30.4 ms 30.3 ms 1
71: device math scalar float pow/iterations:1/manual_time 38.6 ms 38.4 ms 1
71: device math scalar float hypot/iterations:1/manual_time 15.0 ms 15.0 ms 1
71: device math scalar float atan2/iterations:1/manual_time 19.0 ms 18.9 ms 1
71: device math scalar float copysign/iterations:1/manual_time 12.0 ms 12.0 ms 1
71: device math scalar float fma/iterations:1/manual_time 12.5 ms 12.5 ms 1
71: device math scalar float ternary_hypot/iterations:1/manual_time 16.1 ms 16.0 ms 1
71/73 Test #71: Kokkos_PerformanceTest_SIMD_Device ......................... Passed 7.27 sec
test 72
Start 72: Kokkos_Example_VirtualFunctions
72: Test command: /var/jenkins/workspace/Kokkos_nightly/build/example/virtual_functions/Kokkos_example_virtual_functions
72: Test timeout computed to be: 600
72: Values: 1 2
72/73 Test #72: Kokkos_Example_VirtualFunctions ............................ Passed 0.34 sec
test 73
Start 73: Kokkos_Example_RelocatableFunction
73: Test command: /var/jenkins/workspace/Kokkos_nightly/build/example/relocatable_function/Kokkos_example_relocatable_function
73: Test timeout computed to be: 600
73: 1.000000e+01 1.195250e-04s (relocatable) vs. 5.817900e-05s (inline)
73: 1.000000e+02 5.708700e-05s (relocatable) vs. 5.677700e-05s (inline)
73: 1.000000e+03 5.588500e-05s (relocatable) vs. 5.721800e-05s (inline)
73: 1.000000e+04 5.596500e-05s (relocatable) vs. 5.554400e-05s (inline)
73: 1.000000e+05 5.567500e-05s (relocatable) vs. 5.648600e-05s (inline)
73: 1.000000e+06 6.469100e-05s (relocatable) vs. 6.566400e-05s (inline)
73: 1.000000e+07 1.128320e-04s (relocatable) vs. 1.125110e-04s (inline)
73: 1.000000e+08 1.532380e-04s (relocatable) vs. 1.529770e-04s (inline)
73/73 Test #73: Kokkos_Example_RelocatableFunction ......................... Passed 0.34 sec
100% tests passed, 0 tests failed out of 73
Label Time Summary:
Kokkos = 460.54 sec*proc (57 tests)
Total Test time (real) = 1303.23 sec
SetCTestConfiguration:BuildDirectory:/var/jenkins/workspace/Kokkos_nightly/build
SetCTestConfiguration:SourceDirectory:/var/jenkins/workspace/Kokkos_nightly
SetCTestConfiguration:SubmitURL:https://my.cdash.org/submit.php?project=Kokkos
Submit files
SubmitURL: https://my.cdash.org/submit.php?project=Kokkos
Upload file: /var/jenkins/workspace/Kokkos_nightly/build/Testing/20261101-0100/Update.xml to https://my.cdash.org/submit.php?project=Kokkos&FileName=ornl-jenkins___HIP-ROCM-7.0-MI100-RDC-CXX20___20261101-0100-Nightly___XML___Update.xml&build=HIP-ROCM-7.0-MI100-RDC-CXX20&site=ornl-jenkins&stamp=20261101-0100-Nightly&MD5=0db412cf32411944c9f92e7f7f77e6d4 Size: 507
Uploaded: /var/jenkins/workspace/Kokkos_nightly/build/Testing/20261101-0100/Update.xml
Upload file: /var/jenkins/workspace/Kokkos_nightly/build/Testing/20261101-0100/Configure.xml to https://my.cdash.org/submit.php?project=Kokkos&FileName=ornl-jenkins___HIP-ROCM-7.0-MI100-RDC-CXX20___20261101-0100-Nightly___XML___Configure.xml&build=HIP-ROCM-7.0-MI100-RDC-CXX20&site=ornl-jenkins&stamp=20261101-0100-Nightly&MD5=1ae95be7d12ed2952c1a06d469e8b408 Size: 6629
Uploaded: /var/jenkins/workspace/Kokkos_nightly/build/Testing/20261101-0100/Configure.xml
Upload file: /var/jenkins/workspace/Kokkos_nightly/build/Testing/20261101-0100/Build.xml to https://my.cdash.org/submit.php?project=Kokkos&FileName=ornl-jenkins___HIP-ROCM-7.0-MI100-RDC-CXX20___20261101-0100-Nightly___XML___Build.xml&build=HIP-ROCM-7.0-MI100-RDC-CXX20&site=ornl-jenkins&stamp=20261101-0100-Nightly&MD5=a4c68df51101310c9af5e57c14c24572 Size: 1067
Uploaded: /var/jenkins/workspace/Kokkos_nightly/build/Testing/20261101-0100/Build.xml
Upload file: /var/jenkins/workspace/Kokkos_nightly/build/Testing/20261101-0100/Test.xml to https://my.cdash.org/submit.php?project=Kokkos&FileName=ornl-jenkins___HIP-ROCM-7.0-MI100-RDC-CXX20___20261101-0100-Nightly___XML___Test.xml&build=HIP-ROCM-7.0-MI100-RDC-CXX20&site=ornl-jenkins&stamp=20261101-0100-Nightly&MD5=bbad2a6fab0c4c61b59edc0e963901ee Size: 139818
Uploaded: /var/jenkins/workspace/Kokkos_nightly/build/Testing/20261101-0100/Test.xml
Upload file: /var/jenkins/workspace/Kokkos_nightly/build/Testing/20261101-0100/Done.xml to https://my.cdash.org/submit.php?project=Kokkos&FileName=ornl-jenkins___HIP-ROCM-7.0-MI100-RDC-CXX20___20261101-0100-Nightly___XML___Done.xml&build=HIP-ROCM-7.0-MI100-RDC-CXX20&site=ornl-jenkins&stamp=20261101-0100-Nightly&MD5=f0f3f7989b415319f3b73f90a60a577f Size: 107
Uploaded: /var/jenkins/workspace/Kokkos_nightly/build/Testing/20261101-0100/Done.xml
Submission successful
Post stage
[Pipeline] sh
+ ccache --show-stats
Local storage:
Cache size (GiB): 0.0 / 5.0 ( 0.00%)
[Pipeline] xunit
INFO: Processing CTest-Version 3.x (default)
[Pipeline] cleanWs
[WS-CLEANUP] Deleting project workspace...
[WS-CLEANUP] Deferred wipeout is used...
[WS-CLEANUP] done
[Pipeline] }
$ docker stop --time=1 6edd03b9cf434f16e7e88c1b523e2c1e855d3cb0918ef25422a7002dfd762f42
INFO: [CTest-Version 3.x (default)] - 1 test report file(s) were found with the pattern 'build/Testing/**/Test.xml' relative to '/var/jenkins/workspace/Kokkos_nightly' for the testing framework 'CTest-Version 3.x (default)'.
$ docker rm -f --volumes 6edd03b9cf434f16e7e88c1b523e2c1e855d3cb0918ef25422a7002dfd762f42
[Pipeline] // withDockerContainer
[Pipeline] }
[Pipeline] // withDockerRegistry
[Pipeline] }
[Pipeline] // withEnv
[Pipeline] }
[Pipeline] // withEnv
[Pipeline] }
[Pipeline] // node
[Pipeline] }
[Pipeline] // stage
[Pipeline] }
wrapper script does not seem to be touching the log file in /var/jenkins/workspace/Kokkos_nightly@tmp/durable-ce8ddb9c
This may occur if the durable task process was terminated externally, for example by interrupting an interactive terminal session running the agent since the interrupt can terminate forked durable task processes.
(JENKINS-48300: if on an extremely laggy filesystem, consider -Dorg.jenkinsci.plugins.durabletask.BourneShellScript.HEARTBEAT_CHECK_INTERVAL=86400)
waffle_02 seems to be removed or offline (java.io.IOException: Disk quota exceeded); will wait for 5 min 0 sec for it to come back online
waffle_02 is back online
wrapper script does not seem to be touching the log file in /var/jenkins/workspace/Kokkos_nightly@tmp/durable-ce8ddb9c
This may occur if the durable task process was terminated externally, for example by interrupting an interactive terminal session running the agent since the interrupt can terminate forked durable task processes.
(JENKINS-48300: if on an extremely laggy filesystem, consider -Dorg.jenkinsci.plugins.durabletask.BourneShellScript.HEARTBEAT_CHECK_INTERVAL=86400)
waffle_02 seems to be removed or offline (java.io.IOException: Disk quota exceeded); will wait for 5 min 0 sec for it to come back online
waffle_02 is back online
wrapper script does not seem to be touching the log file in /var/jenkins/workspace/Kokkos_nightly@tmp/durable-ce8ddb9c
This may occur if the durable task process was terminated externally, for example by interrupting an interactive terminal session running the agent since the interrupt can terminate forked durable task processes.
(JENKINS-48300: if on an extremely laggy filesystem, consider -Dorg.jenkinsci.plugins.durabletask.BourneShellScript.HEARTBEAT_CHECK_INTERVAL=86400)
waffle_02 seems to be removed or offline (java.io.IOException: Disk quota exceeded); will wait for 5 min 0 sec for it to come back online
waffle_02 is back online
wrapper script does not seem to be touching the log file in /var/jenkins/workspace/Kokkos_nightly@tmp/durable-ce8ddb9c
This may occur if the durable task process was terminated externally, for example by interrupting an interactive terminal session running the agent since the interrupt can terminate forked durable task processes.
(JENKINS-48300: if on an extremely laggy filesystem, consider -Dorg.jenkinsci.plugins.durabletask.BourneShellScript.HEARTBEAT_CHECK_INTERVAL=86400)
waffle_02 seems to be removed or offline (java.io.IOException: Disk quota exceeded); will wait for 5 min 0 sec for it to come back online
waffle_02 is back online
wrapper script does not seem to be touching the log file in /var/jenkins/workspace/Kokkos_nightly@tmp/durable-ce8ddb9c
This may occur if the durable task process was terminated externally, for example by interrupting an interactive terminal session running the agent since the interrupt can terminate forked durable task processes.
(JENKINS-48300: if on an extremely laggy filesystem, consider -Dorg.jenkinsci.plugins.durabletask.BourneShellScript.HEARTBEAT_CHECK_INTERVAL=86400)
waffle_02 seems to be removed or offline (java.io.IOException: Disk quota exceeded); will wait for 5 min 0 sec for it to come back online
waffle_02 is back online
wrapper script does not seem to be touching the log file in /var/jenkins/workspace/Kokkos_nightly@tmp/durable-ce8ddb9c
This may occur if the durable task process was terminated externally, for example by interrupting an interactive terminal session running the agent since the interrupt can terminate forked durable task processes.
(JENKINS-48300: if on an extremely laggy filesystem, consider -Dorg.jenkinsci.plugins.durabletask.BourneShellScript.HEARTBEAT_CHECK_INTERVAL=86400)
waffle_02 seems to be removed or offline (java.io.IOException: Disk quota exceeded); will wait for 5 min 0 sec for it to come back online
waffle_02 is back online
wrapper script does not seem to be touching the log file in /var/jenkins/workspace/Kokkos_nightly@tmp/durable-ce8ddb9c
This may occur if the durable task process was terminated externally, for example by interrupting an interactive terminal session running the agent since the interrupt can terminate forked durable task processes.
(JENKINS-48300: if on an extremely laggy filesystem, consider -Dorg.jenkinsci.plugins.durabletask.BourneShellScript.HEARTBEAT_CHECK_INTERVAL=86400)
waffle_02 seems to be removed or offline (java.io.IOException: Disk quota exceeded); will wait for 5 min 0 sec for it to come back online
waffle_02 is back online
wrapper script does not seem to be touching the log file in /var/jenkins/workspace/Kokkos_nightly@tmp/durable-ce8ddb9c
This may occur if the durable task process was terminated externally, for example by interrupting an interactive terminal session running the agent since the interrupt can terminate forked durable task processes.
(JENKINS-48300: if on an extremely laggy filesystem, consider -Dorg.jenkinsci.plugins.durabletask.BourneShellScript.HEARTBEAT_CHECK_INTERVAL=86400)
waffle_02 seems to be removed or offline (java.io.IOException: Disk quota exceeded); will wait for 5 min 0 sec for it to come back online
waffle_02 is back online
wrapper script does not seem to be touching the log file in /var/jenkins/workspace/Kokkos_nightly@tmp/durable-ce8ddb9c
This may occur if the durable task process was terminated externally, for example by interrupting an interactive terminal session running the agent since the interrupt can terminate forked durable task processes.
(JENKINS-48300: if on an extremely laggy filesystem, consider -Dorg.jenkinsci.plugins.durabletask.BourneShellScript.HEARTBEAT_CHECK_INTERVAL=86400)
waffle_02 seems to be removed or offline (java.io.IOException: Disk quota exceeded); will wait for 5 min 0 sec for it to come back online
waffle_02 is back online
wrapper script does not seem to be touching the log file in /var/jenkins/workspace/Kokkos_nightly@tmp/durable-ce8ddb9c
This may occur if the durable task process was terminated externally, for example by interrupting an interactive terminal session running the agent since the interrupt can terminate forked durable task processes.
(JENKINS-48300: if on an extremely laggy filesystem, consider -Dorg.jenkinsci.plugins.durabletask.BourneShellScript.HEARTBEAT_CHECK_INTERVAL=86400)
waffle_02 seems to be removed or offline (java.io.IOException: Disk quota exceeded); will wait for 5 min 0 sec for it to come back online
waffle_02 is back online
wrapper script does not seem to be touching the log file in /var/jenkins/workspace/Kokkos_nightly@tmp/durable-ce8ddb9c
This may occur if the durable task process was terminated externally, for example by interrupting an interactive terminal session running the agent since the interrupt can terminate forked durable task processes.
(JENKINS-48300: if on an extremely laggy filesystem, consider -Dorg.jenkinsci.plugins.durabletask.BourneShellScript.HEARTBEAT_CHECK_INTERVAL=86400)
waffle_02 seems to be removed or offline (java.io.IOException: Disk quota exceeded); will wait for 5 min 0 sec for it to come back online
waffle_02 is back online
wrapper script does not seem to be touching the log file in /var/jenkins/workspace/Kokkos_nightly@tmp/durable-ce8ddb9c
This may occur if the durable task process was terminated externally, for example by interrupting an interactive terminal session running the agent since the interrupt can terminate forked durable task processes.
(JENKINS-48300: if on an extremely laggy filesystem, consider -Dorg.jenkinsci.plugins.durabletask.BourneShellScript.HEARTBEAT_CHECK_INTERVAL=86400)
waffle_02 seems to be removed or offline (java.io.IOException: Disk quota exceeded); will wait for 5 min 0 sec for it to come back online
waffle_02 is back online
wrapper script does not seem to be touching the log file in /var/jenkins/workspace/Kokkos_nightly@tmp/durable-ce8ddb9c
This may occur if the durable task process was terminated externally, for example by interrupting an interactive terminal session running the agent since the interrupt can terminate forked durable task processes.
(JENKINS-48300: if on an extremely laggy filesystem, consider -Dorg.jenkinsci.plugins.durabletask.BourneShellScript.HEARTBEAT_CHECK_INTERVAL=86400)
waffle_02 seems to be removed or offline (java.io.IOException: Disk quota exceeded); will wait for 5 min 0 sec for it to come back online
waffle_02 is back online
wrapper script does not seem to be touching the log file in /var/jenkins/workspace/Kokkos_nightly@tmp/durable-ce8ddb9c
This may occur if the durable task process was terminated externally, for example by interrupting an interactive terminal session running the agent since the interrupt can terminate forked durable task processes.
(JENKINS-48300: if on an extremely laggy filesystem, consider -Dorg.jenkinsci.plugins.durabletask.BourneShellScript.HEARTBEAT_CHECK_INTERVAL=86400)
waffle_02 seems to be removed or offline (java.io.IOException: Disk quota exceeded); will wait for 5 min 0 sec for it to come back online
waffle_02 is back online
wrapper script does not seem to be touching the log file in /var/jenkins/workspace/Kokkos_nightly@tmp/durable-ce8ddb9c
This may occur if the durable task process was terminated externally, for example by interrupting an interactive terminal session running the agent since the interrupt can terminate forked durable task processes.
(JENKINS-48300: if on an extremely laggy filesystem, consider -Dorg.jenkinsci.plugins.durabletask.BourneShellScript.HEARTBEAT_CHECK_INTERVAL=86400)
waffle_02 seems to be removed or offline (java.io.IOException: Disk quota exceeded); will wait for 5 min 0 sec for it to come back online
waffle_02 is back online
wrapper script does not seem to be touching the log file in /var/jenkins/workspace/Kokkos_nightly@tmp/durable-ce8ddb9c
This may occur if the durable task process was terminated externally, for example by interrupting an interactive terminal session running the agent since the interrupt can terminate forked durable task processes.
(JENKINS-48300: if on an extremely laggy filesystem, consider -Dorg.jenkinsci.plugins.durabletask.BourneShellScript.HEARTBEAT_CHECK_INTERVAL=86400)
waffle_02 seems to be removed or offline (java.io.IOException: Disk quota exceeded); will wait for 5 min 0 sec for it to come back online
waffle_02 is back online
wrapper script does not seem to be touching the log file in /var/jenkins/workspace/Kokkos_nightly@tmp/durable-ce8ddb9c
This may occur if the durable task process was terminated externally, for example by interrupting an interactive terminal session running the agent since the interrupt can terminate forked durable task processes.
(JENKINS-48300: if on an extremely laggy filesystem, consider -Dorg.jenkinsci.plugins.durabletask.BourneShellScript.HEARTBEAT_CHECK_INTERVAL=86400)
waffle_02 seems to be removed or offline (java.io.IOException: Disk quota exceeded); will wait for 5 min 0 sec for it to come back online
waffle_02 is back online
wrapper script does not seem to be touching the log file in /var/jenkins/workspace/Kokkos_nightly@tmp/durable-ce8ddb9c
This may occur if the durable task process was terminated externally, for example by interrupting an interactive terminal session running the agent since the interrupt can terminate forked durable task processes.
(JENKINS-48300: if on an extremely laggy filesystem, consider -Dorg.jenkinsci.plugins.durabletask.BourneShellScript.HEARTBEAT_CHECK_INTERVAL=86400)
waffle_02 seems to be removed or offline (java.io.IOException: Disk quota exceeded); will wait for 5 min 0 sec for it to come back online
waffle_02 is back online
wrapper script does not seem to be touching the log file in /var/jenkins/workspace/Kokkos_nightly@tmp/durable-ce8ddb9c
This may occur if the durable task process was terminated externally, for example by interrupting an interactive terminal session running the agent since the interrupt can terminate forked durable task processes.
(JENKINS-48300: if on an extremely laggy filesystem, consider -Dorg.jenkinsci.plugins.durabletask.BourneShellScript.HEARTBEAT_CHECK_INTERVAL=86400)
waffle_02 seems to be removed or offline (java.io.IOException: Disk quota exceeded); will wait for 5 min 0 sec for it to come back online
waffle_02 is back online
wrapper script does not seem to be touching the log file in /var/jenkins/workspace/Kokkos_nightly@tmp/durable-ce8ddb9c
This may occur if the durable task process was terminated externally, for example by interrupting an interactive terminal session running the agent since the interrupt can terminate forked durable task processes.
(JENKINS-48300: if on an extremely laggy filesystem, consider -Dorg.jenkinsci.plugins.durabletask.BourneShellScript.HEARTBEAT_CHECK_INTERVAL=86400)
waffle_02 seems to be removed or offline (java.io.IOException: Disk quota exceeded); will wait for 5 min 0 sec for it to come back online
waffle_02 is back online
wrapper script does not seem to be touching the log file in /var/jenkins/workspace/Kokkos_nightly@tmp/durable-ce8ddb9c
This may occur if the durable task process was terminated externally, for example by interrupting an interactive terminal session running the agent since the interrupt can terminate forked durable task processes.
(JENKINS-48300: if on an extremely laggy filesystem, consider -Dorg.jenkinsci.plugins.durabletask.BourneShellScript.HEARTBEAT_CHECK_INTERVAL=86400)
waffle_02 seems to be removed or offline (java.io.IOException: Disk quota exceeded); will wait for 5 min 0 sec for it to come back online
waffle_02 is back online
wrapper script does not seem to be touching the log file in /var/jenkins/workspace/Kokkos_nightly@tmp/durable-ce8ddb9c
This may occur if the durable task process was terminated externally, for example by interrupting an interactive terminal session running the agent since the interrupt can terminate forked durable task processes.
(JENKINS-48300: if on an extremely laggy filesystem, consider -Dorg.jenkinsci.plugins.durabletask.BourneShellScript.HEARTBEAT_CHECK_INTERVAL=86400)
waffle_02 seems to be removed or offline (java.io.IOException: Disk quota exceeded); will wait for 5 min 0 sec for it to come back online
waffle_02 is back online
wrapper script does not seem to be touching the log file in /var/jenkins/workspace/Kokkos_nightly@tmp/durable-ce8ddb9c
This may occur if the durable task process was terminated externally, for example by interrupting an interactive terminal session running the agent since the interrupt can terminate forked durable task processes.
(JENKINS-48300: if on an extremely laggy filesystem, consider -Dorg.jenkinsci.plugins.durabletask.BourneShellScript.HEARTBEAT_CHECK_INTERVAL=86400)
waffle_02 seems to be removed or offline (java.io.IOException: Disk quota exceeded); will wait for 5 min 0 sec for it to come back online
waffle_02 is back online
wrapper script does not seem to be touching the log file in /var/jenkins/workspace/Kokkos_nightly@tmp/durable-ce8ddb9c
This may occur if the durable task process was terminated externally, for example by interrupting an interactive terminal session running the agent since the interrupt can terminate forked durable task processes.
(JENKINS-48300: if on an extremely laggy filesystem, consider -Dorg.jenkinsci.plugins.durabletask.BourneShellScript.HEARTBEAT_CHECK_INTERVAL=86400)
waffle_02 seems to be removed or offline (java.io.IOException: Disk quota exceeded); will wait for 5 min 0 sec for it to come back online
waffle_02 is back online
wrapper script does not seem to be touching the log file in /var/jenkins/workspace/Kokkos_nightly@tmp/durable-ce8ddb9c
This may occur if the durable task process was terminated externally, for example by interrupting an interactive terminal session running the agent since the interrupt can terminate forked durable task processes.
(JENKINS-48300: if on an extremely laggy filesystem, consider -Dorg.jenkinsci.plugins.durabletask.BourneShellScript.HEARTBEAT_CHECK_INTERVAL=86400)
waffle_02 seems to be removed or offline (java.io.IOException: Disk quota exceeded); will wait for 5 min 0 sec for it to come back online
waffle_02 is back online
wrapper script does not seem to be touching the log file in /var/jenkins/workspace/Kokkos_nightly@tmp/durable-ce8ddb9c
This may occur if the durable task process was terminated externally, for example by interrupting an interactive terminal session running the agent since the interrupt can terminate forked durable task processes.
(JENKINS-48300: if on an extremely laggy filesystem, consider -Dorg.jenkinsci.plugins.durabletask.BourneShellScript.HEARTBEAT_CHECK_INTERVAL=86400)
waffle_02 seems to be removed or offline (java.io.IOException: Disk quota exceeded); will wait for 5 min 0 sec for it to come back online
waffle_02 is back online
wrapper script does not seem to be touching the log file in /var/jenkins/workspace/Kokkos_nightly@tmp/durable-ce8ddb9c
This may occur if the durable task process was terminated externally, for example by interrupting an interactive terminal session running the agent since the interrupt can terminate forked durable task processes.
(JENKINS-48300: if on an extremely laggy filesystem, consider -Dorg.jenkinsci.plugins.durabletask.BourneShellScript.HEARTBEAT_CHECK_INTERVAL=86400)
waffle_02 seems to be removed or offline (java.io.IOException: Disk quota exceeded); will wait for 5 min 0 sec for it to come back online
waffle_02 is back online
wrapper script does not seem to be touching the log file in /var/jenkins/workspace/Kokkos_nightly@tmp/durable-ce8ddb9c
This may occur if the durable task process was terminated externally, for example by interrupting an interactive terminal session running the agent since the interrupt can terminate forked durable task processes.
(JENKINS-48300: if on an extremely laggy filesystem, consider -Dorg.jenkinsci.plugins.durabletask.BourneShellScript.HEARTBEAT_CHECK_INTERVAL=86400)
waffle_02 seems to be removed or offline (java.io.IOException: Disk quota exceeded); will wait for 5 min 0 sec for it to come back online
waffle_02 is back online
wrapper script does not seem to be touching the log file in /var/jenkins/workspace/Kokkos_nightly@tmp/durable-ce8ddb9c
This may occur if the durable task process was terminated externally, for example by interrupting an interactive terminal session running the agent since the interrupt can terminate forked durable task processes.
(JENKINS-48300: if on an extremely laggy filesystem, consider -Dorg.jenkinsci.plugins.durabletask.BourneShellScript.HEARTBEAT_CHECK_INTERVAL=86400)
waffle_02 seems to be removed or offline (java.io.IOException: Disk quota exceeded); will wait for 5 min 0 sec for it to come back online
waffle_02 is back online
wrapper script does not seem to be touching the log file in /var/jenkins/workspace/Kokkos_nightly@tmp/durable-ce8ddb9c
This may occur if the durable task process was terminated externally, for example by interrupting an interactive terminal session running the agent since the interrupt can terminate forked durable task processes.
(JENKINS-48300: if on an extremely laggy filesystem, consider -Dorg.jenkinsci.plugins.durabletask.BourneShellScript.HEARTBEAT_CHECK_INTERVAL=86400)
waffle_02 seems to be removed or offline (java.io.IOException: Disk quota exceeded); will wait for 5 min 0 sec for it to come back online
waffle_02 is back online
wrapper script does not seem to be touching the log file in /var/jenkins/workspace/Kokkos_nightly@tmp/durable-ce8ddb9c
This may occur if the durable task process was terminated externally, for example by interrupting an interactive terminal session running the agent since the interrupt can terminate forked durable task processes.
(JENKINS-48300: if on an extremely laggy filesystem, consider -Dorg.jenkinsci.plugins.durabletask.BourneShellScript.HEARTBEAT_CHECK_INTERVAL=86400)
waffle_02 seems to be removed or offline (java.io.IOException: Disk quota exceeded); will wait for 5 min 0 sec for it to come back online
waffle_02 is back online
wrapper script does not seem to be touching the log file in /var/jenkins/workspace/Kokkos_nightly@tmp/durable-ce8ddb9c
This may occur if the durable task process was terminated externally, for example by interrupting an interactive terminal session running the agent since the interrupt can terminate forked durable task processes.
(JENKINS-48300: if on an extremely laggy filesystem, consider -Dorg.jenkinsci.plugins.durabletask.BourneShellScript.HEARTBEAT_CHECK_INTERVAL=86400)
waffle_02 seems to be removed or offline (java.io.IOException: Disk quota exceeded); will wait for 5 min 0 sec for it to come back online
waffle_02 is back online
wrapper script does not seem to be touching the log file in /var/jenkins/workspace/Kokkos_nightly@tmp/durable-ce8ddb9c
This may occur if the durable task process was terminated externally, for example by interrupting an interactive terminal session running the agent since the interrupt can terminate forked durable task processes.
(JENKINS-48300: if on an extremely laggy filesystem, consider -Dorg.jenkinsci.plugins.durabletask.BourneShellScript.HEARTBEAT_CHECK_INTERVAL=86400)
waffle_02 seems to be removed or offline (java.io.IOException: Disk quota exceeded); will wait for 5 min 0 sec for it to come back online
waffle_02 is back online
wrapper script does not seem to be touching the log file in /var/jenkins/workspace/Kokkos_nightly@tmp/durable-ce8ddb9c
This may occur if the durable task process was terminated externally, for example by interrupting an interactive terminal session running the agent since the interrupt can terminate forked durable task processes.
(JENKINS-48300: if on an extremely laggy filesystem, consider -Dorg.jenkinsci.plugins.durabletask.BourneShellScript.HEARTBEAT_CHECK_INTERVAL=86400)
waffle_02 seems to be removed or offline (java.io.IOException: Disk quota exceeded); will wait for 5 min 0 sec for it to come back online
waffle_02 is back online
wrapper script does not seem to be touching the log file in /var/jenkins/workspace/Kokkos_nightly@tmp/durable-ce8ddb9c
This may occur if the durable task process was terminated externally, for example by interrupting an interactive terminal session running the agent since the interrupt can terminate forked durable task processes.
(JENKINS-48300: if on an extremely laggy filesystem, consider -Dorg.jenkinsci.plugins.durabletask.BourneShellScript.HEARTBEAT_CHECK_INTERVAL=86400)
waffle_02 seems to be removed or offline (java.io.IOException: Disk quota exceeded); will wait for 5 min 0 sec for it to come back online
waffle_02 is back online
wrapper script does not seem to be touching the log file in /var/jenkins/workspace/Kokkos_nightly@tmp/durable-ce8ddb9c
This may occur if the durable task process was terminated externally, for example by interrupting an interactive terminal session running the agent since the interrupt can terminate forked durable task processes.
(JENKINS-48300: if on an extremely laggy filesystem, consider -Dorg.jenkinsci.plugins.durabletask.BourneShellScript.HEARTBEAT_CHECK_INTERVAL=86400)
waffle_02 seems to be removed or offline (java.io.IOException: Disk quota exceeded); will wait for 5 min 0 sec for it to come back online
waffle_02 is back online
wrapper script does not seem to be touching the log file in /var/jenkins/workspace/Kokkos_nightly@tmp/durable-ce8ddb9c
This may occur if the durable task process was terminated externally, for example by interrupting an interactive terminal session running the agent since the interrupt can terminate forked durable task processes.
(JENKINS-48300: if on an extremely laggy filesystem, consider -Dorg.jenkinsci.plugins.durabletask.BourneShellScript.HEARTBEAT_CHECK_INTERVAL=86400)
waffle_02 seems to be removed or offline (java.io.IOException: Disk quota exceeded); will wait for 5 min 0 sec for it to come back online
waffle_02 is back online
wrapper script does not seem to be touching the log file in /var/jenkins/workspace/Kokkos_nightly@tmp/durable-ce8ddb9c
This may occur if the durable task process was terminated externally, for example by interrupting an interactive terminal session running the agent since the interrupt can terminate forked durable task processes.
(JENKINS-48300: if on an extremely laggy filesystem, consider -Dorg.jenkinsci.plugins.durabletask.BourneShellScript.HEARTBEAT_CHECK_INTERVAL=86400)
waffle_02 seems to be removed or offline (java.io.IOException: Disk quota exceeded); will wait for 5 min 0 sec for it to come back online
waffle_02 is back online
wrapper script does not seem to be touching the log file in /var/jenkins/workspace/Kokkos_nightly@tmp/durable-ce8ddb9c
This may occur if the durable task process was terminated externally, for example by interrupting an interactive terminal session running the agent since the interrupt can terminate forked durable task processes.
(JENKINS-48300: if on an extremely laggy filesystem, consider -Dorg.jenkinsci.plugins.durabletask.BourneShellScript.HEARTBEAT_CHECK_INTERVAL=86400)
waffle_02 seems to be removed or offline (java.io.IOException: Disk quota exceeded); will wait for 5 min 0 sec for it to come back online
waffle_02 is back online
wrapper script does not seem to be touching the log file in /var/jenkins/workspace/Kokkos_nightly@tmp/durable-ce8ddb9c
This may occur if the durable task process was terminated externally, for example by interrupting an interactive terminal session running the agent since the interrupt can terminate forked durable task processes.
(JENKINS-48300: if on an extremely laggy filesystem, consider -Dorg.jenkinsci.plugins.durabletask.BourneShellScript.HEARTBEAT_CHECK_INTERVAL=86400)
waffle_02 seems to be removed or offline (java.io.IOException: Disk quota exceeded); will wait for 5 min 0 sec for it to come back online
waffle_02 is back online
wrapper script does not seem to be touching the log file in /var/jenkins/workspace/Kokkos_nightly@tmp/durable-ce8ddb9c
This may occur if the durable task process was terminated externally, for example by interrupting an interactive terminal session running the agent since the interrupt can terminate forked durable task processes.
(JENKINS-48300: if on an extremely laggy filesystem, consider -Dorg.jenkinsci.plugins.durabletask.BourneShellScript.HEARTBEAT_CHECK_INTERVAL=86400)
waffle_02 seems to be removed or offline (java.io.IOException: Disk quota exceeded); will wait for 5 min 0 sec for it to come back online
waffle_02 is back online
wrapper script does not seem to be touching the log file in /var/jenkins/workspace/Kokkos_nightly@tmp/durable-ce8ddb9c
This may occur if the durable task process was terminated externally, for example by interrupting an interactive terminal session running the agent since the interrupt can terminate forked durable task processes.
(JENKINS-48300: if on an extremely laggy filesystem, consider -Dorg.jenkinsci.plugins.durabletask.BourneShellScript.HEARTBEAT_CHECK_INTERVAL=86400)
waffle_02 seems to be removed or offline (java.io.IOException: Disk quota exceeded); will wait for 5 min 0 sec for it to come back online
waffle_02 is back online
wrapper script does not seem to be touching the log file in /var/jenkins/workspace/Kokkos_nightly@tmp/durable-ce8ddb9c
This may occur if the durable task process was terminated externally, for example by interrupting an interactive terminal session running the agent since the interrupt can terminate forked durable task processes.
(JENKINS-48300: if on an extremely laggy filesystem, consider -Dorg.jenkinsci.plugins.durabletask.BourneShellScript.HEARTBEAT_CHECK_INTERVAL=86400)
waffle_02 seems to be removed or offline (java.io.IOException: Disk quota exceeded); will wait for 5 min 0 sec for it to come back online
waffle_02 is back online
wrapper script does not seem to be touching the log file in /var/jenkins/workspace/Kokkos_nightly@tmp/durable-ce8ddb9c
This may occur if the durable task process was terminated externally, for example by interrupting an interactive terminal session running the agent since the interrupt can terminate forked durable task processes.
(JENKINS-48300: if on an extremely laggy filesystem, consider -Dorg.jenkinsci.plugins.durabletask.BourneShellScript.HEARTBEAT_CHECK_INTERVAL=86400)
waffle_02 seems to be removed or offline (java.io.IOException: Disk quota exceeded); will wait for 5 min 0 sec for it to come back online
waffle_02 is back online
wrapper script does not seem to be touching the log file in /var/jenkins/workspace/Kokkos_nightly@tmp/durable-ce8ddb9c
This may occur if the durable task process was terminated externally, for example by interrupting an interactive terminal session running the agent since the interrupt can terminate forked durable task processes.
(JENKINS-48300: if on an extremely laggy filesystem, consider -Dorg.jenkinsci.plugins.durabletask.BourneShellScript.HEARTBEAT_CHECK_INTERVAL=86400)
waffle_02 seems to be removed or offline (java.io.IOException: Disk quota exceeded); will wait for 5 min 0 sec for it to come back online
waffle_02 is back online
wrapper script does not seem to be touching the log file in /var/jenkins/workspace/Kokkos_nightly@tmp/durable-ce8ddb9c
This may occur if the durable task process was terminated externally, for example by interrupting an interactive terminal session running the agent since the interrupt can terminate forked durable task processes.
(JENKINS-48300: if on an extremely laggy filesystem, consider -Dorg.jenkinsci.plugins.durabletask.BourneShellScript.HEARTBEAT_CHECK_INTERVAL=86400)
waffle_02 seems to be removed or offline (java.io.IOException: Disk quota exceeded); will wait for 5 min 0 sec for it to come back online
waffle_02 is back online
wrapper script does not seem to be touching the log file in /var/jenkins/workspace/Kokkos_nightly@tmp/durable-ce8ddb9c
This may occur if the durable task process was terminated externally, for example by interrupting an interactive terminal session running the agent since the interrupt can terminate forked durable task processes.
(JENKINS-48300: if on an extremely laggy filesystem, consider -Dorg.jenkinsci.plugins.durabletask.BourneShellScript.HEARTBEAT_CHECK_INTERVAL=86400)
waffle_02 seems to be removed or offline (java.io.IOException: Disk quota exceeded); will wait for 5 min 0 sec for it to come back online
waffle_02 is back online
wrapper script does not seem to be touching the log file in /var/jenkins/workspace/Kokkos_nightly@tmp/durable-ce8ddb9c
This may occur if the durable task process was terminated externally, for example by interrupting an interactive terminal session running the agent since the interrupt can terminate forked durable task processes.
(JENKINS-48300: if on an extremely laggy filesystem, consider -Dorg.jenkinsci.plugins.durabletask.BourneShellScript.HEARTBEAT_CHECK_INTERVAL=86400)
waffle_02 seems to be removed or offline (java.io.IOException: Disk quota exceeded); will wait for 5 min 0 sec for it to come back online
waffle_02 is back online
wrapper script does not seem to be touching the log file in /var/jenkins/workspace/Kokkos_nightly@tmp/durable-ce8ddb9c
This may occur if the durable task process was terminated externally, for example by interrupting an interactive terminal session running the agent since the interrupt can terminate forked durable task processes.
(JENKINS-48300: if on an extremely laggy filesystem, consider -Dorg.jenkinsci.plugins.durabletask.BourneShellScript.HEARTBEAT_CHECK_INTERVAL=86400)
waffle_02 seems to be removed or offline (java.io.IOException: Disk quota exceeded); will wait for 5 min 0 sec for it to come back online
waffle_02 is back online
wrapper script does not seem to be touching the log file in /var/jenkins/workspace/Kokkos_nightly@tmp/durable-ce8ddb9c
This may occur if the durable task process was terminated externally, for example by interrupting an interactive terminal session running the agent since the interrupt can terminate forked durable task processes.
(JENKINS-48300: if on an extremely laggy filesystem, consider -Dorg.jenkinsci.plugins.durabletask.BourneShellScript.HEARTBEAT_CHECK_INTERVAL=86400)
waffle_02 seems to be removed or offline (java.io.IOException: Disk quota exceeded); will wait for 5 min 0 sec for it to come back online
waffle_02 is back online
wrapper script does not seem to be touching the log file in /var/jenkins/workspace/Kokkos_nightly@tmp/durable-ce8ddb9c
This may occur if the durable task process was terminated externally, for example by interrupting an interactive terminal session running the agent since the interrupt can terminate forked durable task processes.
(JENKINS-48300: if on an extremely laggy filesystem, consider -Dorg.jenkinsci.plugins.durabletask.BourneShellScript.HEARTBEAT_CHECK_INTERVAL=86400)
waffle_02 seems to be removed or offline (java.io.IOException: Disk quota exceeded); will wait for 5 min 0 sec for it to come back online
waffle_02 is back online
wrapper script does not seem to be touching the log file in /var/jenkins/workspace/Kokkos_nightly@tmp/durable-ce8ddb9c
This may occur if the durable task process was terminated externally, for example by interrupting an interactive terminal session running the agent since the interrupt can terminate forked durable task processes.
(JENKINS-48300: if on an extremely laggy filesystem, consider -Dorg.jenkinsci.plugins.durabletask.BourneShellScript.HEARTBEAT_CHECK_INTERVAL=86400)
waffle_02 seems to be removed or offline (java.io.IOException: Disk quota exceeded); will wait for 5 min 0 sec for it to come back online
waffle_02 is back online
wrapper script does not seem to be touching the log file in /var/jenkins/workspace/Kokkos_nightly@tmp/durable-ce8ddb9c
This may occur if the durable task process was terminated externally, for example by interrupting an interactive terminal session running the agent since the interrupt can terminate forked durable task processes.
(JENKINS-48300: if on an extremely laggy filesystem, consider -Dorg.jenkinsci.plugins.durabletask.BourneShellScript.HEARTBEAT_CHECK_INTERVAL=86400)
waffle_02 seems to be removed or offline (java.io.IOException: Disk quota exceeded); will wait for 5 min 0 sec for it to come back online
waffle_02 is back online
wrapper script does not seem to be touching the log file in /var/jenkins/workspace/Kokkos_nightly@tmp/durable-ce8ddb9c
This may occur if the durable task process was terminated externally, for example by interrupting an interactive terminal session running the agent since the interrupt can terminate forked durable task processes.
(JENKINS-48300: if on an extremely laggy filesystem, consider -Dorg.jenkinsci.plugins.durabletask.BourneShellScript.HEARTBEAT_CHECK_INTERVAL=86400)
waffle_02 seems to be removed or offline (java.io.IOException: Disk quota exceeded); will wait for 5 min 0 sec for it to come back online
waffle_02 is back online
wrapper script does not seem to be touching the log file in /var/jenkins/workspace/Kokkos_nightly@tmp/durable-ce8ddb9c
This may occur if the durable task process was terminated externally, for example by interrupting an interactive terminal session running the agent since the interrupt can terminate forked durable task processes.
(JENKINS-48300: if on an extremely laggy filesystem, consider -Dorg.jenkinsci.plugins.durabletask.BourneShellScript.HEARTBEAT_CHECK_INTERVAL=86400)
waffle_02 seems to be removed or offline (java.io.IOException: Disk quota exceeded); will wait for 5 min 0 sec for it to come back online
waffle_02 is back online
wrapper script does not seem to be touching the log file in /var/jenkins/workspace/Kokkos_nightly@tmp/durable-ce8ddb9c
This may occur if the durable task process was terminated externally, for example by interrupting an interactive terminal session running the agent since the interrupt can terminate forked durable task processes.
(JENKINS-48300: if on an extremely laggy filesystem, consider -Dorg.jenkinsci.plugins.durabletask.BourneShellScript.HEARTBEAT_CHECK_INTERVAL=86400)
waffle_02 seems to be removed or offline (java.io.IOException: Disk quota exceeded); will wait for 5 min 0 sec for it to come back online
waffle_02 is back online
wrapper script does not seem to be touching the log file in /var/jenkins/workspace/Kokkos_nightly@tmp/durable-ce8ddb9c
This may occur if the durable task process was terminated externally, for example by interrupting an interactive terminal session running the agent since the interrupt can terminate forked durable task processes.
(JENKINS-48300: if on an extremely laggy filesystem, consider -Dorg.jenkinsci.plugins.durabletask.BourneShellScript.HEARTBEAT_CHECK_INTERVAL=86400)
waffle_02 seems to be removed or offline (java.io.IOException: Disk quota exceeded); will wait for 5 min 0 sec for it to come back online
waffle_02 is back online
wrapper script does not seem to be touching the log file in /var/jenkins/workspace/Kokkos_nightly@tmp/durable-ce8ddb9c
This may occur if the durable task process was terminated externally, for example by interrupting an interactive terminal session running the agent since the interrupt can terminate forked durable task processes.
(JENKINS-48300: if on an extremely laggy filesystem, consider -Dorg.jenkinsci.plugins.durabletask.BourneShellScript.HEARTBEAT_CHECK_INTERVAL=86400)
waffle_02 seems to be removed or offline (java.io.IOException: Disk quota exceeded); will wait for 5 min 0 sec for it to come back online
waffle_02 is back online
wrapper script does not seem to be touching the log file in /var/jenkins/workspace/Kokkos_nightly@tmp/durable-ce8ddb9c
This may occur if the durable task process was terminated externally, for example by interrupting an interactive terminal session running the agent since the interrupt can terminate forked durable task processes.
(JENKINS-48300: if on an extremely laggy filesystem, consider -Dorg.jenkinsci.plugins.durabletask.BourneShellScript.HEARTBEAT_CHECK_INTERVAL=86400)
waffle_02 seems to be removed or offline (java.io.IOException: Disk quota exceeded); will wait for 5 min 0 sec for it to come back online
waffle_02 is back online
wrapper script does not seem to be touching the log file in /var/jenkins/workspace/Kokkos_nightly@tmp/durable-ce8ddb9c
This may occur if the durable task process was terminated externally, for example by interrupting an interactive terminal session running the agent since the interrupt can terminate forked durable task processes.
(JENKINS-48300: if on an extremely laggy filesystem, consider -Dorg.jenkinsci.plugins.durabletask.BourneShellScript.HEARTBEAT_CHECK_INTERVAL=86400)
waffle_02 seems to be removed or offline (java.io.IOException: Disk quota exceeded); will wait for 5 min 0 sec for it to come back online
waffle_02 is back online
wrapper script does not seem to be touching the log file in /var/jenkins/workspace/Kokkos_nightly@tmp/durable-ce8ddb9c
This may occur if the durable task process was terminated externally, for example by interrupting an interactive terminal session running the agent since the interrupt can terminate forked durable task processes.
(JENKINS-48300: if on an extremely laggy filesystem, consider -Dorg.jenkinsci.plugins.durabletask.BourneShellScript.HEARTBEAT_CHECK_INTERVAL=86400)
waffle_02 seems to be removed or offline (java.io.IOException: Disk quota exceeded); will wait for 5 min 0 sec for it to come back online
waffle_02 is back online
wrapper script does not seem to be touching the log file in /var/jenkins/workspace/Kokkos_nightly@tmp/durable-ce8ddb9c
This may occur if the durable task process was terminated externally, for example by interrupting an interactive terminal session running the agent since the interrupt can terminate forked durable task processes.
(JENKINS-48300: if on an extremely laggy filesystem, consider -Dorg.jenkinsci.plugins.durabletask.BourneShellScript.HEARTBEAT_CHECK_INTERVAL=86400)
waffle_02 seems to be removed or offline (java.io.IOException: Disk quota exceeded); will wait for 5 min 0 sec for it to come back online
waffle_02 is back online
wrapper script does not seem to be touching the log file in /var/jenkins/workspace/Kokkos_nightly@tmp/durable-ce8ddb9c
This may occur if the durable task process was terminated externally, for example by interrupting an interactive terminal session running the agent since the interrupt can terminate forked durable task processes.
(JENKINS-48300: if on an extremely laggy filesystem, consider -Dorg.jenkinsci.plugins.durabletask.BourneShellScript.HEARTBEAT_CHECK_INTERVAL=86400)
waffle_02 seems to be removed or offline (java.io.IOException: Disk quota exceeded); will wait for 5 min 0 sec for it to come back online
waffle_02 is back online
Cancelling nested steps due to timeout
Sending interrupt signal to process
Post stage
[Pipeline] cleanWs
[WS-CLEANUP] Deleting project workspace...
[WS-CLEANUP] Deferred wipeout is used...
[WS-CLEANUP] done
[Pipeline] }
$ docker stop --time=1 59e7c6fac16ca13e6d458d9b92228817f697540f9081ca43bb05eefb13181e04
$ docker rm -f --volumes 59e7c6fac16ca13e6d458d9b92228817f697540f9081ca43bb05eefb13181e04
Body did not finish within grace period; terminating with extreme prejudice
[Pipeline] // withDockerContainer
[Pipeline] // parallel
[Pipeline] }
[Pipeline] }
[Pipeline] // stage
[Pipeline] // withDockerRegistry
[Pipeline] }
[Pipeline] }
[Pipeline] // withEnv
[Pipeline] }
[Pipeline] // timeout
[Pipeline] }
[Pipeline] // withEnv
[Pipeline] }
[Pipeline] // withEnv
[Pipeline] // node
[Pipeline] }
[Pipeline] // stage
[Pipeline] }
[Pipeline] End of Pipeline
Finished: ABORTED