Skip to content
Skipping 224 KB.. Full Log
5: Getting the perturbed innovation...
5: Applying the Kalman gain...
5: Getting the perturbed innovation...
5: Applying the Kalman gain...
5: Getting the perturbed innovation...
5: Applying the Kalman gain...
5: Getting the perturbed innovation...
5: Applying the Kalman gain...
5: Getting the perturbed innovation...
5: Applying the Kalman gain...
5: Getting the perturbed innovation...
5: Applying the Kalman gain...
5: Updating the ensemble members...
5: Done.
5: 60% completed
5: Updating the ensemble members...
5: Updating the ensemble members...
5: Done.
5: 60% completed
5: Done.
5: 60% completed
5: Updating the ensemble members...
5: Updating the ensemble members...
5: Updating the ensemble members...
5: Done.
5: 60% completed
5: Done.
5: 60% completed
5: Done.
5: 60% completed
5: 70% completed
5: 70% completed
5: 70% completed
5: 70% completed
5: 70% completed
5: 70% completed
5: 80% completed
5: 80% completed
5: 80% completed
5: 80% completed
5: 80% completed
5: 80% completed
5: 90% completed
5: 90% completed
5: 90% completed
5: 90% completed
5: 90% completed
5: 90% completed
5: 100% completed
5: 100% completed
5: 100% completed
5: 100% completed
5: 
5: *** No errors detected
5: /var/jenkins/workspace/adamantine-nightly/tests/test_integration_da.cc(231): Leaving test case "integration_3D_da_ray_add_material"; testing time: 2356765us
5: Leaving test module "Integration_Data_Assimilation"; testing time: 62650343us
5: 100% completed
5: 100% completed
5: 
5: *** No errors detected
5: 
5: *** No errors detected
5: /var/jenkins/workspace/adamantine-nightly/tests/test_integration_da.cc(231): Leaving test case "integration_3D_da_ray_add_material"; testing time: 2360260us
5: Leaving test module "Integration_Data_Assimilation"; testing time: 62645606us
5: /var/jenkins/workspace/adamantine-nightly/tests/test_integration_da.cc(231): Leaving test case "integration_3D_da_ray_add_material"; testing time: 2388673us
5: Leaving test module "Integration_Data_Assimilation"; testing time: 62637241us
5: 
5: *** No errors detected
5: /var/jenkins/workspace/adamantine-nightly/tests/test_integration_da.cc(231): Leaving test case "integration_3D_da_ray_add_material"; testing time: 2373208us
5: Leaving test module "Integration_Data_Assimilation"; testing time: 62681690us
5: 
5: 
5: *** No errors detected
5: /var/jenkins/workspace/adamantine-nightly/tests/test_integration_da.cc(231): Leaving test case "integration_3D_da_ray_add_material"; testing time: 2369918us
5: Leaving test module "Integration_Data_Assimilation"; testing time: 62693096us
5: /var/jenkins/workspace/adamantine-nightly/tests/test_integration_da.cc(231): Leaving test case "integration_3D_da_ray_add_material"; testing time: 2369488us
5: Leaving test module "Integration_Data_Assimilation"; testing time: 62709806us
5: *** No errors detected
5: 
 4/48 Test  #5: test_integration_da_6 ....................   Passed   64.60 sec
test 6
      Start  6: test_closest_source_point_adaptation_1

6: Test command: /usr/bin/mpiexec "-n" "1" "/var/jenkins/workspace/adamantine-nightly/build/bin/test_closest_source_point_adaptation"
6: Working Directory: /var/jenkins/workspace/adamantine-nightly/build/tests
6: Test timeout computed to be: 7200
6: Running 1 test case...
6: Entering test module "ClosestSourcePointAdaptation"
6: /var/jenkins/workspace/adamantine-nightly/tests/test_closest_source_point_adaptation.cc(124): Entering test case "closest_source_point_adaptation"
6: 
6: *** No errors detected
6: /var/jenkins/workspace/adamantine-nightly/tests/test_closest_source_point_adaptation.cc(124): Leaving test case "closest_source_point_adaptation"; testing time: 11587258us
6: Leaving test module "ClosestSourcePointAdaptation"; testing time: 11587311us
6: 
 5/48 Test  #6: test_closest_source_point_adaptation_1 ...   Passed   12.83 sec
test 7
      Start  7: test_closest_source_point_adaptation_2

7: Test command: /usr/bin/mpiexec "-n" "2" "/var/jenkins/workspace/adamantine-nightly/build/bin/test_closest_source_point_adaptation"
7: Working Directory: /var/jenkins/workspace/adamantine-nightly/build/tests
7: Test timeout computed to be: 7200
7: Running 1 test case...
7: Entering test module "ClosestSourcePointAdaptation"
7: /var/jenkins/workspace/adamantine-nightly/tests/test_closest_source_point_adaptation.cc(124): Entering test case "closest_source_point_adaptation"
7: Running 1 test case...
7: Entering test module "ClosestSourcePointAdaptation"
7: /var/jenkins/workspace/adamantine-nightly/tests/test_closest_source_point_adaptation.cc(124): Entering test case "closest_source_point_adaptation"
7: 
7: *** No errors detected
7: /var/jenkins/workspace/adamantine-nightly/tests/test_closest_source_point_adaptation.cc(124): Leaving test case "closest_source_point_adaptation"; testing time: 8015758us
7: Leaving test module "ClosestSourcePointAdaptation"; testing time: 8015809us
7: 
7: *** No errors detected
7: /var/jenkins/workspace/adamantine-nightly/tests/test_closest_source_point_adaptation.cc(124): Leaving test case "closest_source_point_adaptation"; testing time: 8007412us
7: Leaving test module "ClosestSourcePointAdaptation"; testing time: 8007474us
7: 
 6/48 Test  #7: test_closest_source_point_adaptation_2 ...   Passed    9.13 sec
test 8
      Start  8: test_closest_source_point_adaptation_3

8: Test command: /usr/bin/mpiexec "-n" "3" "/var/jenkins/workspace/adamantine-nightly/build/bin/test_closest_source_point_adaptation"
8: Working Directory: /var/jenkins/workspace/adamantine-nightly/build/tests
8: Test timeout computed to be: 7200
8: Running 1 test case...
8: Entering test module "ClosestSourcePointAdaptation"
8: /var/jenkins/workspace/adamantine-nightly/tests/test_closest_source_point_adaptation.cc(124): Entering test case "closest_source_point_adaptation"
8: Running 1 test case...
8: Entering test module "ClosestSourcePointAdaptation"
8: /var/jenkins/workspace/adamantine-nightly/tests/test_closest_source_point_adaptation.cc(124): Entering test case "closest_source_point_adaptation"
8: Running 1 test case...
8: Entering test module "ClosestSourcePointAdaptation"
8: /var/jenkins/workspace/adamantine-nightly/tests/test_closest_source_point_adaptation.cc(124): Entering test case "closest_source_point_adaptation"
8: /var/jenkins/workspace/adamantine-nightly/tests/test_closest_source_point_adaptation.cc(124): Leaving test case "closest_source_point_adaptation"; testing time: 7203785us
8: Leaving test module "ClosestSourcePointAdaptation"; testing time: 7203836us
8: 
8: *** No errors detected
8: /var/jenkins/workspace/adamantine-nightly/tests/test_closest_source_point_adaptation.cc(124): Leaving test case "closest_source_point_adaptation"; testing time: 7201887us
8: Leaving test module "ClosestSourcePointAdaptation"; testing time: 7201951us
8: /var/jenkins/workspace/adamantine-nightly/tests/test_closest_source_point_adaptation.cc(124): Leaving test case "closest_source_point_adaptation"; testing time: 7201035us
8: Leaving test module "ClosestSourcePointAdaptation"; testing time: 7201087us
8: 
8: *** No errors detected
8: 
8: *** No errors detected
8: 
 7/48 Test  #8: test_closest_source_point_adaptation_3 ...   Passed    8.51 sec
test 9
      Start  9: test_closest_source_point_adaptation_6

9: Test command: /usr/bin/mpiexec "-n" "6" "/var/jenkins/workspace/adamantine-nightly/build/bin/test_closest_source_point_adaptation"
9: Working Directory: /var/jenkins/workspace/adamantine-nightly/build/tests
9: Test timeout computed to be: 7200
9: Running 1 test case...
9: Entering test module "ClosestSourcePointAdaptation"
9: /var/jenkins/workspace/adamantine-nightly/tests/test_closest_source_point_adaptation.cc(124): Entering test case "closest_source_point_adaptation"
9: Running 1 test case...
9: Entering test module "ClosestSourcePointAdaptation"
9: /var/jenkins/workspace/adamantine-nightly/tests/test_closest_source_point_adaptation.cc(124): Entering test case "closest_source_point_adaptation"
9: Running 1 test case...
9: Entering test module "ClosestSourcePointAdaptation"
9: /var/jenkins/workspace/adamantine-nightly/tests/test_closest_source_point_adaptation.cc(124): Entering test case "closest_source_point_adaptation"
9: Running 1 test case...
9: Entering test module "ClosestSourcePointAdaptation"
9: /var/jenkins/workspace/adamantine-nightly/tests/test_closest_source_point_adaptation.cc(124): Entering test case "closest_source_point_adaptation"
9: Running 1 test case...
9: Entering test module "ClosestSourcePointAdaptation"
9: /var/jenkins/workspace/adamantine-nightly/tests/test_closest_source_point_adaptation.cc(124): Entering test case "closest_source_point_adaptation"
9: Running 1 test case...
9: Entering test module "ClosestSourcePointAdaptation"
9: /var/jenkins/workspace/adamantine-nightly/tests/test_closest_source_point_adaptation.cc(124): Entering test case "closest_source_point_adaptation"
9: 
9: *** No errors detected
9: 
9: *** No errors detected
9: /var/jenkins/workspace/adamantine-nightly/tests/test_closest_source_point_adaptation.cc(124): Leaving test case "closest_source_point_adaptation"; testing time: 4484090us
9: Leaving test module "ClosestSourcePointAdaptation"; testing time: 4484138us
9: /var/jenkins/workspace/adamantine-nightly/tests/test_closest_source_point_adaptation.cc(124): Leaving test case "closest_source_point_adaptation"; testing time: 4445857us
9: Leaving test module "ClosestSourcePointAdaptation"; testing time: 4445905us
9: /var/jenkins/workspace/adamantine-nightly/tests/test_closest_source_point_adaptation.cc(124): Leaving test case "closest_source_point_adaptation"; testing time: 4447309us
9: Leaving test module "ClosestSourcePointAdaptation"; testing time: 4447361us
9: 
9: *** No errors detected
9: /var/jenkins/workspace/adamantine-nightly/tests/test_closest_source_point_adaptation.cc(124): Leaving test case "closest_source_point_adaptation"; testing time: 4455086us
9: Leaving test module "ClosestSourcePointAdaptation"; testing time: 4455140us
9: /var/jenkins/workspace/adamantine-nightly/tests/test_closest_source_point_adaptation.cc(124): Leaving test case "closest_source_point_adaptation"; testing time: 4446984us
9: Leaving test module "ClosestSourcePointAdaptation"; testing time: 4447039us
9: 
9: *** No errors detected
9: 
9: *** No errors detected
9: /var/jenkins/workspace/adamantine-nightly/tests/test_closest_source_point_adaptation.cc(124): Leaving test case "closest_source_point_adaptation"; testing time: 4459150us
9: Leaving test module "ClosestSourcePointAdaptation"; testing time: 4459203us
9: 
9: *** No errors detected
9: 
 8/48 Test  #9: test_closest_source_point_adaptation_6 ...   Passed    6.41 sec
test 10
      Start 10: test_data_assimilator_1

10: Test command: /usr/bin/mpiexec "-n" "1" "/var/jenkins/workspace/adamantine-nightly/build/bin/test_data_assimilator"
10: Working Directory: /var/jenkins/workspace/adamantine-nightly/build/tests
10: Test timeout computed to be: 7200
10: Running 1 test case...
10: Entering test module "DataAssimilator"
10: /var/jenkins/workspace/adamantine-nightly/tests/test_data_assimilator.cc(948): Entering test case "data_assimilator"
10: Getting the perturbed innovation...
10: Applying the Kalman gain...
10: Updating the ensemble members...
10: Getting the perturbed innovation...
10: Applying the Kalman gain...
10: Updating the ensemble members...
10: /var/jenkins/workspace/adamantine-nightly/tests/test_data_assimilator.cc(948): Leaving test case "data_assimilator"; testing time: 155990us
10: Leaving test module "DataAssimilator"; testing time: 156024us
10: 
10: *** No errors detected
10: 
 9/48 Test #10: test_data_assimilator_1 ..................   Passed    1.40 sec
test 11
      Start 11: test_experimental_data_1

11: Test command: /usr/bin/mpiexec "-n" "1" "/var/jenkins/workspace/adamantine-nightly/build/bin/test_experimental_data"
11: Working Directory: /var/jenkins/workspace/adamantine-nightly/build/tests
11: Test timeout computed to be: 7200
11: Running 6 test cases...
11: Entering test module "ExperimentaData"
11: /var/jenkins/workspace/adamantine-nightly/tests/test_experimental_data.cc(22): Entering test case "read_experimental_data_point_cloud_from_file"
11: /var/jenkins/workspace/adamantine-nightly/tests/test_experimental_data.cc(22): Leaving test case "read_experimental_data_point_cloud_from_file"; testing time: 16509us
11: /var/jenkins/workspace/adamantine-nightly/tests/test_experimental_data.cc(75): Entering test case "set_vector_with_experimental_data_point_cloud"
11: /var/jenkins/workspace/adamantine-nightly/tests/test_experimental_data.cc(75): Leaving test case "set_vector_with_experimental_data_point_cloud"; testing time: 10100us
11: /var/jenkins/workspace/adamantine-nightly/tests/test_experimental_data.cc(138): Entering test case "read_experimental_data_ray_tracing_from_file"
11: /var/jenkins/workspace/adamantine-nightly/tests/test_experimental_data.cc(138): Leaving test case "read_experimental_data_ray_tracing_from_file"; testing time: 7909us
11: /var/jenkins/workspace/adamantine-nightly/tests/test_experimental_data.cc(199): Entering test case "timestamp"
11: /var/jenkins/workspace/adamantine-nightly/tests/test_experimental_data.cc(199): Leaving test case "timestamp"; testing time: 1048us
11: /var/jenkins/workspace/adamantine-nightly/tests/test_experimental_data.cc(225): Entering test case "project_ray_data_on_mesh"
32: 10% completed
11: /var/jenkins/workspace/adamantine-nightly/tests/test_experimental_data.cc(225): Leaving test case "project_ray_data_on_mesh"; testing time: 35390534us
11: /var/jenkins/workspace/adamantine-nightly/tests/test_experimental_data.cc(302): Entering test case "project_ray_data_on_nonaligned_mesh"
11: 
11: *** No errors detected
11: /var/jenkins/workspace/adamantine-nightly/tests/test_experimental_data.cc(302): Leaving test case "project_ray_data_on_nonaligned_mesh"; testing time: 32456us
11: Leaving test module "ExperimentaData"; testing time: 35459617us
11: 
10/48 Test #11: test_experimental_data_1 .................   Passed   36.70 sec
test 12
      Start 12: test_geometry_1

12: Test command: /usr/bin/mpiexec "-n" "1" "/var/jenkins/workspace/adamantine-nightly/build/bin/test_geometry"
12: Working Directory: /var/jenkins/workspace/adamantine-nightly/build/tests
12: Test timeout computed to be: 7200
12: Running 6 test cases...
12: Entering test module "Geometry"
12: /var/jenkins/workspace/adamantine-nightly/tests/test_geometry.cc(61): Entering test case "geometry_2D"
12: /var/jenkins/workspace/adamantine-nightly/tests/test_geometry.cc(61): Leaving test case "geometry_2D"; testing time: 10937us
12: /var/jenkins/workspace/adamantine-nightly/tests/test_geometry.cc(86): Entering test case "geometry_3D"
12: /var/jenkins/workspace/adamantine-nightly/tests/test_geometry.cc(86): Leaving test case "geometry_3D"; testing time: 13790us
12: /var/jenkins/workspace/adamantine-nightly/tests/test_geometry.cc(113): Entering test case "geometry_shifted_origin"
12: /var/jenkins/workspace/adamantine-nightly/tests/test_geometry.cc(113): Leaving test case "geometry_shifted_origin"; testing time: 11412us
12: /var/jenkins/workspace/adamantine-nightly/tests/test_geometry.cc(148): Entering test case "gmsh"
12: /var/jenkins/workspace/adamantine-nightly/tests/test_geometry.cc(148): Leaving test case "gmsh"; testing time: 112413us
12: /var/jenkins/workspace/adamantine-nightly/tests/test_geometry.cc(171): Entering test case "read_stl"
12: /var/jenkins/workspace/adamantine-nightly/tests/test_geometry.cc(171): Leaving test case "read_stl"; testing time: 12395us
12: /var/jenkins/workspace/adamantine-nightly/tests/test_geometry.cc(232): Entering test case "geometry_stl_mesh"
12: 
12: *** No errors detected
12: /var/jenkins/workspace/adamantine-nightly/tests/test_geometry.cc(232): Leaving test case "geometry_stl_mesh"; testing time: 11404us
12: Leaving test module "Geometry"; testing time: 172939us
12: 
11/48 Test #12: test_geometry_1 ..........................   Passed    1.44 sec
test 13
      Start 13: test_heat_source_1

13: Test command: /usr/bin/mpiexec "-n" "1" "/var/jenkins/workspace/adamantine-nightly/build/bin/test_heat_source"
13: Working Directory: /var/jenkins/workspace/adamantine-nightly/build/tests
13: Test timeout computed to be: 7200
13: Running 6 test cases...
13: Entering test module "HeatSource"
13: /var/jenkins/workspace/adamantine-nightly/tests/test_heat_source.cc(104): Entering test case "gaussian_heat_source_value_2d"
13: /var/jenkins/workspace/adamantine-nightly/tests/test_heat_source.cc(104): Leaving test case "gaussian_heat_source_value_2d"; testing time: 2425us
13: /var/jenkins/workspace/adamantine-nightly/tests/test_heat_source.cc(109): Entering test case "gaussian_heat_source_value_3d"
13: /var/jenkins/workspace/adamantine-nightly/tests/test_heat_source.cc(109): Leaving test case "gaussian_heat_source_value_3d"; testing time: 235us
13: /var/jenkins/workspace/adamantine-nightly/tests/test_heat_source.cc(114): Entering test case "heat_source_value_2d"
13: /var/jenkins/workspace/adamantine-nightly/tests/test_heat_source.cc(114): Leaving test case "heat_source_value_2d"; testing time: 295us
13: /var/jenkins/workspace/adamantine-nightly/tests/test_heat_source.cc(190): Entering test case "heat_source_vectorized_value_2d"
13: /var/jenkins/workspace/adamantine-nightly/tests/test_heat_source.cc(190): Leaving test case "heat_source_vectorized_value_2d"; testing time: 265us
13: /var/jenkins/workspace/adamantine-nightly/tests/test_heat_source.cc(315): Entering test case "heat_source_value_3d"
13: /var/jenkins/workspace/adamantine-nightly/tests/test_heat_source.cc(315): Leaving test case "heat_source_value_3d"; testing time: 287us
13: /var/jenkins/workspace/adamantine-nightly/tests/test_heat_source.cc(381): Entering test case "heat_source_vectorized_value_3d"
13: 
13: *** No errors detected
13: /var/jenkins/workspace/adamantine-nightly/tests/test_heat_source.cc(381): Leaving test case "heat_source_vectorized_value_3d"; testing time: 263us
13: Leaving test module "HeatSource"; testing time: 5045us
13: 
12/48 Test #13: test_heat_source_1 .......................   Passed    1.24 sec
test 14
      Start 14: test_integration_3d_device_1

14: Test command: /usr/bin/mpiexec "-n" "1" "/var/jenkins/workspace/adamantine-nightly/build/bin/test_integration_3d_device"
14: Working Directory: /var/jenkins/workspace/adamantine-nightly/build/tests
14: Test timeout computed to be: 7200
14: Running 2 test cases...
14: Entering test module "Integration_3D_Device"
14: /var/jenkins/workspace/adamantine-nightly/tests/test_integration_3d_device.cc(19): Entering test case "integration_3D_device"
32: 20% completed
14: 10% completed
14: 20% completed
32: 30% completed
14: 30% completed
14: 40% completed
14: 50% completed
32: 40% completed
14: 60% completed
14: 70% completed
32: 50% completed
14: 80% completed
14: 90% completed
32: 60% completed
14: 100% completed
14: /var/jenkins/workspace/adamantine-nightly/tests/test_integration_3d_device.cc(19): Leaving test case "integration_3D_device"; testing time: 416235995us
14: /var/jenkins/workspace/adamantine-nightly/tests/test_integration_3d_device.cc(46): Entering test case "integration_3D_checkpoint_restart_device"
14: 10% completed
14: 20% completed
14: 30% completed
14: 40% completed
14: 50% completed
14: 60% completed
14: 70% completed
32: 70% completed
32: 80% completed
14: Checkpoint reached
14: 80% completed
14: 90% completed
14: 100% completed
32: 90% completed
32: 100% completed
32: /var/jenkins/workspace/adamantine-nightly/tests/test_integration_3d.cc(107): Leaving test case "integration_3D_short"; testing time: 839429108us
32: /var/jenkins/workspace/adamantine-nightly/tests/test_integration_3d.cc(112): Entering test case "integration_3D_five_axis"
14: Restarting from file
14: 80% completed
14: 90% completed
14: 100% completed
14: 
14: *** No errors detected
14: /var/jenkins/workspace/adamantine-nightly/tests/test_integration_3d_device.cc(46): Leaving test case "integration_3D_checkpoint_restart_device"; testing time: 158437928us
14: Leaving test module "Integration_3D_Device"; testing time: 574675033us
14: 
13/48 Test #14: test_integration_3d_device_1 .............   Passed  575.97 sec
test 15
      Start 15: test_material_property_1

15: Test command: /usr/bin/mpiexec "-n" "1" "/var/jenkins/workspace/adamantine-nightly/build/bin/test_material_property"
15: Working Directory: /var/jenkins/workspace/adamantine-nightly/build/tests
15: Test timeout computed to be: 7200
15: Running 4 test cases...
15: Entering test module "MaterialProperty"
15: /var/jenkins/workspace/adamantine-nightly/tests/test_material_property.cc(13): Entering test case "material_property_host"
15: /var/jenkins/workspace/adamantine-nightly/tests/test_material_property.cc(13): Leaving test case "material_property_host"; testing time: 25927us
15: /var/jenkins/workspace/adamantine-nightly/tests/test_material_property.cc(18): Entering test case "ratios_host"
15: /var/jenkins/workspace/adamantine-nightly/tests/test_material_property.cc(18): Leaving test case "ratios_host"; testing time: 10680us
15: /var/jenkins/workspace/adamantine-nightly/tests/test_material_property.cc(20): Entering test case "material_property_table_host"
15: /var/jenkins/workspace/adamantine-nightly/tests/test_material_property.cc(20): Leaving test case "material_property_table_host"; testing time: 15404us
15: /var/jenkins/workspace/adamantine-nightly/tests/test_material_property.cc(25): Entering test case "material_property_polynomials_host"
15: /var/jenkins/workspace/adamantine-nightly/tests/test_material_property.cc(25): Leaving test case "material_property_polynomials_host"; testing time: 15659us
15: Leaving test module "MaterialProperty"; testing time: 67799us
15: 
15: *** No errors detected
15: 
14/48 Test #15: test_material_property_1 .................   Passed    1.29 sec
test 16
      Start 16: test_material_property_device_1

16: Test command: /usr/bin/mpiexec "-n" "1" "/var/jenkins/workspace/adamantine-nightly/build/bin/test_material_property_device"
16: Working Directory: /var/jenkins/workspace/adamantine-nightly/build/tests
16: Test timeout computed to be: 7200
16: Running 4 test cases...
16: Entering test module "MaterialPropertyDevice"
16: /var/jenkins/workspace/adamantine-nightly/tests/test_material_property_device.cc(13): Entering test case "material_property_device"
16: /var/jenkins/workspace/adamantine-nightly/tests/test_material_property_device.cc(13): Leaving test case "material_property_device"; testing time: 42943us
16: /var/jenkins/workspace/adamantine-nightly/tests/test_material_property_device.cc(18): Entering test case "ratios_device"
16: /var/jenkins/workspace/adamantine-nightly/tests/test_material_property_device.cc(18): Leaving test case "ratios_device"; testing time: 22838us
16: /var/jenkins/workspace/adamantine-nightly/tests/test_material_property_device.cc(20): Entering test case "material_property_table_device"
16: /var/jenkins/workspace/adamantine-nightly/tests/test_material_property_device.cc(20): Leaving test case "material_property_table_device"; testing time: 15802us
16: /var/jenkins/workspace/adamantine-nightly/tests/test_material_property_device.cc(25): Entering test case "material_property_polynomials_device"
16: /var/jenkins/workspace/adamantine-nightly/tests/test_material_property_device.cc(25): Leaving test case "material_property_polynomials_device"; testing time: 15499us
16: Leaving test module "MaterialPropertyDevice"; testing time: 97215us
16: 
16: *** No errors detected
16: 
15/48 Test #16: test_material_property_device_1 ..........   Passed    1.30 sec
test 17
      Start 17: test_mechanical_operator_1

17: Test command: /usr/bin/mpiexec "-n" "1" "/var/jenkins/workspace/adamantine-nightly/build/bin/test_mechanical_operator"
17: Working Directory: /var/jenkins/workspace/adamantine-nightly/build/tests
17: Test timeout computed to be: 7200
17: Running 2 test cases...
17: Entering test module "MechanicalOperator"
17: /var/jenkins/workspace/adamantine-nightly/tests/test_mechanical_operator.cc(71): Entering test case "elastostatic"
17: /var/jenkins/workspace/adamantine-nightly/tests/test_mechanical_operator.cc(71): Leaving test case "elastostatic"; testing time: 13993211us
17: /var/jenkins/workspace/adamantine-nightly/tests/test_mechanical_operator.cc(303): Entering test case "thermoelastic"
17: 
17: *** No errors detected
17: /var/jenkins/workspace/adamantine-nightly/tests/test_mechanical_operator.cc(303): Leaving test case "thermoelastic"; testing time: 4141503us
17: Leaving test module "MechanicalOperator"; testing time: 18135326us
17: 
16/48 Test #17: test_mechanical_operator_1 ...............   Passed   19.33 sec
test 18
      Start 18: test_mechanical_physics_1

18: Test command: /usr/bin/mpiexec "-n" "1" "/var/jenkins/workspace/adamantine-nightly/build/bin/test_mechanical_physics"
18: Working Directory: /var/jenkins/workspace/adamantine-nightly/build/tests
18: Test timeout computed to be: 7200
18: Running 7 test cases...
18: Entering test module "MechanicalPhysics"
18: /var/jenkins/workspace/adamantine-nightly/tests/test_mechanical_physics.cc(197): Entering test case "elastostatic"
18: /var/jenkins/workspace/adamantine-nightly/tests/test_mechanical_physics.cc(197): Leaving test case "elastostatic"; testing time: 664076us
18: /var/jenkins/workspace/adamantine-nightly/tests/test_mechanical_physics.cc(267): Entering test case "fe_nothing"
18: /var/jenkins/workspace/adamantine-nightly/tests/test_mechanical_physics.cc(267): Leaving test case "fe_nothing"; testing time: 657233us
18: /var/jenkins/workspace/adamantine-nightly/tests/test_mechanical_physics.cc(534): Entering test case "thermoelastic_eshelby"
18: /var/jenkins/workspace/adamantine-nightly/tests/test_mechanical_physics.cc(534): Leaving test case "thermoelastic_eshelby"; testing time: 60389148us
18: /var/jenkins/workspace/adamantine-nightly/tests/test_mechanical_physics.cc(562): Entering test case "elastoplastic_radial_return"
18: /var/jenkins/workspace/adamantine-nightly/tests/test_mechanical_physics.cc(562): Leaving test case "elastoplastic_radial_return"; testing time: 61378us
18: /var/jenkins/workspace/adamantine-nightly/tests/test_mechanical_physics.cc(668): Entering test case "cell_data_transfer_refine_coarsen"
18: /var/jenkins/workspace/adamantine-nightly/tests/test_mechanical_physics.cc(668): Leaving test case "cell_data_transfer_refine_coarsen"; testing time: 946338us
18: /var/jenkins/workspace/adamantine-nightly/tests/test_mechanical_physics.cc(777): Entering test case "thermoelastic_stress_uniform_heating"
18: /var/jenkins/workspace/adamantine-nightly/tests/test_mechanical_physics.cc(777): Leaving test case "thermoelastic_stress_uniform_heating"; testing time: 69025us
18: /var/jenkins/workspace/adamantine-nightly/tests/test_mechanical_physics.cc(866): Entering test case "thermoelastoplastic_radial_return"
18: 
18: *** No errors detected
18: /var/jenkins/workspace/adamantine-nightly/tests/test_mechanical_physics.cc(866): Leaving test case "thermoelastoplastic_radial_return"; testing time: 75573us
18: Leaving test module "MechanicalPhysics"; testing time: 62863379us
18: 
17/48 Test #18: test_mechanical_physics_1 ................   Passed   64.06 sec
test 19
      Start 19: test_post_processor_1

19: Test command: /usr/bin/mpiexec "-n" "1" "/var/jenkins/workspace/adamantine-nightly/build/bin/test_post_processor"
19: Working Directory: /var/jenkins/workspace/adamantine-nightly/build/tests
19: Test timeout computed to be: 7200
19: Running 2 test cases...
19: Entering test module "PostProcessor"
19: /var/jenkins/workspace/adamantine-nightly/tests/test_post_processor.cc(27): Entering test case "thermal_post_processor"
19: /var/jenkins/workspace/adamantine-nightly/tests/test_post_processor.cc(27): Leaving test case "thermal_post_processor"; testing time: 63327us
19: /var/jenkins/workspace/adamantine-nightly/tests/test_post_processor.cc(149): Entering test case "mechanical_post_processor"
19: 
19: *** No errors detected
19: /var/jenkins/workspace/adamantine-nightly/tests/test_post_processor.cc(149): Leaving test case "mechanical_post_processor"; testing time: 4190145us
19: Leaving test module "PostProcessor"; testing time: 4253545us
19: 
18/48 Test #19: test_post_processor_1 ....................   Passed    5.47 sec
test 20
      Start 20: test_quaternion_1

20: Test command: /usr/bin/mpiexec "-n" "1" "/var/jenkins/workspace/adamantine-nightly/build/bin/test_quaternion"
20: Working Directory: /var/jenkins/workspace/adamantine-nightly/build/tests
20: Test timeout computed to be: 7200
20: Running 1 test case...
20: Entering test module "Quaternion"
20: /var/jenkins/workspace/adamantine-nightly/tests/test_quaternion.cc(11): Entering test case "rotation"
20: 
20: *** No errors detected
20: /var/jenkins/workspace/adamantine-nightly/tests/test_quaternion.cc(11): Leaving test case "rotation"; testing time: 160us
20: Leaving test module "Quaternion"; testing time: 191us
20: 
19/48 Test #20: test_quaternion_1 ........................   Passed    1.25 sec
test 21
      Start 21: test_scan_path_1

21: Test command: /usr/bin/mpiexec "-n" "1" "/var/jenkins/workspace/adamantine-nightly/build/bin/test_scan_path"
21: Working Directory: /var/jenkins/workspace/adamantine-nightly/build/tests
21: Test timeout computed to be: 7200
21: Running 3 test cases...
21: Entering test module "ScanPath"
21: /var/jenkins/workspace/adamantine-nightly/tests/test_scan_path.cc(36): Entering test case "scan_path"
21: /var/jenkins/workspace/adamantine-nightly/tests/test_scan_path.cc(36): Leaving test case "scan_path"; testing time: 1433us
21: /var/jenkins/workspace/adamantine-nightly/tests/test_scan_path.cc(78): Entering test case "scan_path_location"
21: /var/jenkins/workspace/adamantine-nightly/tests/test_scan_path.cc(78): Leaving test case "scan_path_location"; testing time: 173us
21: /var/jenkins/workspace/adamantine-nightly/tests/test_scan_path.cc(106): Entering test case "five_axis"
21: 
21: *** No errors detected
21: /var/jenkins/workspace/adamantine-nightly/tests/test_scan_path.cc(106): Leaving test case "five_axis"; testing time: 1159us
21: Leaving test module "ScanPath"; testing time: 3413us
21: 
20/48 Test #21: test_scan_path_1 .........................   Passed    1.21 sec
test 22
      Start 22: test_thermal_operator_1

22: Test command: /usr/bin/mpiexec "-n" "1" "/var/jenkins/workspace/adamantine-nightly/build/bin/test_thermal_operator"
22: Working Directory: /var/jenkins/workspace/adamantine-nightly/build/tests
22: Test timeout computed to be: 7200
22: Running 6 test cases...
22: Entering test module "ThermalOperator"
22: /var/jenkins/workspace/adamantine-nightly/tests/test_thermal_operator.cc(41): Entering test case "thermal_operator"
22: /var/jenkins/workspace/adamantine-nightly/tests/test_thermal_operator.cc(41): Leaving test case "thermal_operator"; testing time: 46146us
22: /var/jenkins/workspace/adamantine-nightly/tests/test_thermal_operator.cc(148): Entering test case "spmv"
22: /var/jenkins/workspace/adamantine-nightly/tests/test_thermal_operator.cc(148): Leaving test case "spmv"; testing time: 125572us
22: /var/jenkins/workspace/adamantine-nightly/tests/test_thermal_operator.cc(265): Entering test case "spmv_anisotropic"
22: /var/jenkins/workspace/adamantine-nightly/tests/test_thermal_operator.cc(265): Leaving test case "spmv_anisotropic"; testing time: 120696us
22: /var/jenkins/workspace/adamantine-nightly/tests/test_thermal_operator.cc(415): Entering test case "spmv_anisotropic_angle"
22: /var/jenkins/workspace/adamantine-nightly/tests/test_thermal_operator.cc(415): Leaving test case "spmv_anisotropic_angle"; testing time: 666418us
22: /var/jenkins/workspace/adamantine-nightly/tests/test_thermal_operator.cc(580): Entering test case "spmv_rad"
22: /var/jenkins/workspace/adamantine-nightly/tests/test_thermal_operator.cc(580): Leaving test case "spmv_rad"; testing time: 941800us
22: /var/jenkins/workspace/adamantine-nightly/tests/test_thermal_operator.cc(772): Entering test case "spmv_conv"
22: 
22: *** No errors detected
22: /var/jenkins/workspace/adamantine-nightly/tests/test_thermal_operator.cc(772): Leaving test case "spmv_conv"; testing time: 894487us
22: Leaving test module "ThermalOperator"; testing time: 2796995us
22: 
21/48 Test #22: test_thermal_operator_1 ..................   Passed    3.69 sec
test 23
      Start 23: test_thermal_operator_device_1

23: Test command: /usr/bin/mpiexec "-n" "1" "/var/jenkins/workspace/adamantine-nightly/build/bin/test_thermal_operator_device"
23: Working Directory: /var/jenkins/workspace/adamantine-nightly/build/tests
23: Test timeout computed to be: 7200
23: Running 4 test cases...
23: Entering test module "ThermalOperatorDevice"
23: /var/jenkins/workspace/adamantine-nightly/tests/test_thermal_operator_device.cc(31): Entering test case "thermal_operator_dev"
23: /var/jenkins/workspace/adamantine-nightly/tests/test_thermal_operator_device.cc(31): Leaving test case "thermal_operator_dev"; testing time: 95484us
23: /var/jenkins/workspace/adamantine-nightly/tests/test_thermal_operator_device.cc(124): Entering test case "spmv"
23: /var/jenkins/workspace/adamantine-nightly/tests/test_thermal_operator_device.cc(124): Leaving test case "spmv"; testing time: 66975us
23: /var/jenkins/workspace/adamantine-nightly/tests/test_thermal_operator_device.cc(237): Entering test case "mf_spmv"
23: /var/jenkins/workspace/adamantine-nightly/tests/test_thermal_operator_device.cc(237): Leaving test case "mf_spmv"; testing time: 882397us
23: /var/jenkins/workspace/adamantine-nightly/tests/test_thermal_operator_device.cc(375): Entering test case "spmv_anisotropic_angle"
23: 
23: *** No errors detected
23: /var/jenkins/workspace/adamantine-nightly/tests/test_thermal_operator_device.cc(375): Leaving test case "spmv_anisotropic_angle"; testing time: 295667us
23: Leaving test module "ThermalOperatorDevice"; testing time: 1341829us
23: 
22/48 Test #23: test_thermal_operator_device_1 ...........   Passed    2.23 sec
test 24
      Start 24: test_thermal_physics_device_1

24: Test command: /usr/bin/mpiexec "-n" "1" "/var/jenkins/workspace/adamantine-nightly/build/bin/test_thermal_physics_device"
24: Working Directory: /var/jenkins/workspace/adamantine-nightly/build/tests
24: Test timeout computed to be: 7200
24: Running 4 test cases...
24: Entering test module "ThermalPhysicsDevice"
24: /var/jenkins/workspace/adamantine-nightly/tests/test_thermal_physics_device.cc(13): Entering test case "thermal_2d_explicit_device"
24: /var/jenkins/workspace/adamantine-nightly/tests/test_thermal_physics_device.cc(13): Leaving test case "thermal_2d_explicit_device"; testing time: 107024us
24: /var/jenkins/workspace/adamantine-nightly/tests/test_thermal_physics_device.cc(26): Entering test case "thermal_2d_manufactured_solution_device"
24: /var/jenkins/workspace/adamantine-nightly/tests/test_thermal_physics_device.cc(26): Leaving test case "thermal_2d_manufactured_solution_device"; testing time: 32353us
24: /var/jenkins/workspace/adamantine-nightly/tests/test_thermal_physics_device.cc(31): Entering test case "initial_temperature_device"
24: /var/jenkins/workspace/adamantine-nightly/tests/test_thermal_physics_device.cc(31): Leaving test case "initial_temperature_device"; testing time: 7089us
24: /var/jenkins/workspace/adamantine-nightly/tests/test_thermal_physics_device.cc(36): Entering test case "energy_conservation_device"
24: 
24: *** No errors detected
24: /var/jenkins/workspace/adamantine-nightly/tests/test_thermal_physics_device.cc(36): Leaving test case "energy_conservation_device"; testing time: 33641611us
24: Leaving test module "ThermalPhysicsDevice"; testing time: 33788206us
24: 
23/48 Test #24: test_thermal_physics_device_1 ............   Passed   34.66 sec
test 25
      Start 25: test_timer_1

25: Test command: /usr/bin/mpiexec "-n" "1" "/var/jenkins/workspace/adamantine-nightly/build/bin/test_timer"
25: Working Directory: /var/jenkins/workspace/adamantine-nightly/build/tests
25: Test timeout computed to be: 7200
25: Running 1 test case...
25: Entering test module "Timer"
25: /var/jenkins/workspace/adamantine-nightly/tests/test_timer.cc(15): Entering test case "test_timer"
25: /var/jenkins/workspace/adamantine-nightly/tests/test_timer.cc(15): Leaving test case "test_timer"; testing time: 600348us
25: Leaving test module "Timer"; testing time: 600387us
25: 
25: *** No errors detected
25: 
24/48 Test #25: test_timer_1 .............................   Passed    1.81 sec
test 26
      Start 26: test_utils_1

26: Test command: /usr/bin/mpiexec "-n" "1" "/var/jenkins/workspace/adamantine-nightly/build/bin/test_utils"
26: Working Directory: /var/jenkins/workspace/adamantine-nightly/build/tests
26: Test timeout computed to be: 7200
26: Running 1 test case...
26: Entering test module "utils"
26: /var/jenkins/workspace/adamantine-nightly/tests/test_utils.cc(11): Entering test case "utils"
26: 
26: *** No errors detected
26: /var/jenkins/workspace/adamantine-nightly/tests/test_utils.cc(11): Leaving test case "utils"; testing time: 19219us
26: Leaving test module "utils"; testing time: 19266us
26: 
25/48 Test #26: test_utils_1 .............................   Passed    1.22 sec
test 27
      Start 27: test_validate_input_database_1

27: Test command: /usr/bin/mpiexec "-n" "1" "/var/jenkins/workspace/adamantine-nightly/build/bin/test_validate_input_database"
27: Working Directory: /var/jenkins/workspace/adamantine-nightly/build/tests
27: Test timeout computed to be: 7200
27: Running 3 test cases...
27: Entering test module "validate_input_database"
27: /var/jenkins/workspace/adamantine-nightly/tests/test_validate_input_database.cc(14): Entering test case "expected_passes"
27: Test case expected_passes did not check any assertions
27: /var/jenkins/workspace/adamantine-nightly/tests/test_validate_input_database.cc(14): Leaving test case "expected_passes"; testing time: 664us
27: /var/jenkins/workspace/adamantine-nightly/tests/test_validate_input_database.cc(55): Entering test case "parse_test_input_files"
27: Test case parse_test_input_files did not check any assertions
27: /var/jenkins/workspace/adamantine-nightly/tests/test_validate_input_database.cc(55): Leaving test case "parse_test_input_files"; testing time: 4422us
27: /var/jenkins/workspace/adamantine-nightly/tests/test_validate_input_database.cc(76): Entering test case "expected_failures"
27: 
27: *** No errors detected
27: /var/jenkins/workspace/adamantine-nightly/tests/test_validate_input_database.cc(76): Leaving test case "expected_failures"; testing time: 6889us
27: Leaving test module "validate_input_database"; testing time: 12074us
27: 
26/48 Test #27: test_validate_input_database_1 ...........   Passed    0.88 sec
test 28
      Start 28: test_integration_2d_1

28: Test command: /usr/bin/mpiexec "-n" "1" "/var/jenkins/workspace/adamantine-nightly/build/bin/test_integration_2d"
28: Working Directory: /var/jenkins/workspace/adamantine-nightly/build/tests
28: Test timeout computed to be: 7200
28: Running 3 test cases...
28: Entering test module "Integration_2D"
28: /var/jenkins/workspace/adamantine-nightly/tests/test_integration_2d.cc(19): Entering test case "integration_2D"
28: 10% completed
28: 20% completed
28: 30% completed
28: 40% completed
28: 50% completed
28: 60% completed
28: 70% completed
28: 80% completed
28: 90% completed
28: 100% completed
28: /var/jenkins/workspace/adamantine-nightly/tests/test_integration_2d.cc(19): Leaving test case "integration_2D"; testing time: 2026900us
28: /var/jenkins/workspace/adamantine-nightly/tests/test_integration_2d.cc(46): Entering test case "integration_2D_ensemble"
28: Starting the main time stepping loop...
28: 10% completed
28: 20% completed
28: 30% completed
28: 40% completed
28: 50% completed
28: 60% completed
28: 70% completed
28: 80% completed
28: 90% completed
28: 100% completed
28: /var/jenkins/workspace/adamantine-nightly/tests/test_integration_2d.cc(46): Leaving test case "integration_2D_ensemble"; testing time: 6031611us
28: /var/jenkins/workspace/adamantine-nightly/tests/test_integration_2d.cc(78): Entering test case "integration_2D_units"
28: 10% completed
28: 20% completed
28: 30% completed
28: 40% completed
28: 50% completed
28: 60% completed
28: 70% completed
28: 80% completed
28: 90% completed
28: 100% completed
28: 
28: *** No errors detected
28: /var/jenkins/workspace/adamantine-nightly/tests/test_integration_2d.cc(78): Leaving test case "integration_2D_units"; testing time: 2123991us
28: Leaving test module "Integration_2D"; testing time: 10183345us
28: 
27/48 Test #28: test_integration_2d_1 ....................   Passed   11.05 sec
test 29
      Start 29: test_integration_2d_2

29: Test command: /usr/bin/mpiexec "-n" "2" "/var/jenkins/workspace/adamantine-nightly/build/bin/test_integration_2d"
29: Working Directory: /var/jenkins/workspace/adamantine-nightly/build/tests
29: Test timeout computed to be: 7200
29: Running 3 test cases...
29: Entering test module "Integration_2D"
29: /var/jenkins/workspace/adamantine-nightly/tests/test_integration_2d.cc(19): Entering test case "integration_2D"
29: Running 3 test cases...
29: Entering test module "Integration_2D"
29: /var/jenkins/workspace/adamantine-nightly/tests/test_integration_2d.cc(19): Entering test case "integration_2D"
29: 10% completed
29: 20% completed
29: 30% completed
29: 40% completed
29: 50% completed
29: 60% completed
29: 70% completed
29: 80% completed
29: 90% completed
29: 100% completed
29: /var/jenkins/workspace/adamantine-nightly/tests/test_integration_2d.cc(19): Leaving test case "integration_2D"; testing time: 1313700us
29: /var/jenkins/workspace/adamantine-nightly/tests/test_integration_2d.cc(46): Entering test case "integration_2D_ensemble"
29: /var/jenkins/workspace/adamantine-nightly/tests/test_integration_2d.cc(19): Leaving test case "integration_2D"; testing time: 1308149us
29: /var/jenkins/workspace/adamantine-nightly/tests/test_integration_2d.cc(46): Entering test case "integration_2D_ensemble"
29: Starting the main time stepping loop...
29: 10% completed
29: 20% completed
29: 30% completed
29: 40% completed
29: /var/jenkins/workspace/adamantine-nightly/tests/test_integration_2d.cc(46): Leaving test case "integration_2D_ensemble"; testing time: 2053199us
29: /var/jenkins/workspace/adamantine-nightly/tests/test_integration_2d.cc(78): Entering test case "integration_2D_units"
29: 50% completed
29: 60% completed
29: 70% completed
29: 80% completed
29: 90% completed
29: 100% completed
29: /var/jenkins/workspace/adamantine-nightly/tests/test_integration_2d.cc(46): Leaving test case "integration_2D_ensemble"; testing time: 3660997us
29: /var/jenkins/workspace/adamantine-nightly/tests/test_integration_2d.cc(78): Entering test case "integration_2D_units"
29: 10% completed
29: 20% completed
29: 30% completed
29: 40% completed
29: 50% completed
29: 60% completed
29: 70% completed
29: 80% completed
29: 90% completed
29: 100% completed
29: 
29: *** No errors detected
29: /var/jenkins/workspace/adamantine-nightly/tests/test_integration_2d.cc(78): Leaving test case "integration_2D_units"; testing time: 1295852us
29: Leaving test module "Integration_2D"; testing time: 6271434us
29: /var/jenkins/workspace/adamantine-nightly/tests/test_integration_2d.cc(78): Leaving test case "integration_2D_units"; testing time: 2903146us
29: 
29: *** No errors detected
29: Leaving test module "Integration_2D"; testing time: 6265512us
29: 
28/48 Test #29: test_integration_2d_2 ....................   Passed    7.35 sec
test 30
      Start 30: test_integration_2d_device_1

30: Test command: /usr/bin/mpiexec "-n" "1" "/var/jenkins/workspace/adamantine-nightly/build/bin/test_integration_2d_device"
30: Working Directory: /var/jenkins/workspace/adamantine-nightly/build/tests
30: Test timeout computed to be: 7200
30: Running 1 test case...
30: Entering test module "Integration_2D_Device"
30: /var/jenkins/workspace/adamantine-nightly/tests/test_integration_2d_device.cc(19): Entering test case "intregation_2D_device"
30: 10% completed
30: 20% completed
30: 30% completed
30: 40% completed
30: 50% completed
30: 60% completed
30: 70% completed
30: 80% completed
30: 90% completed
30: 100% completed
30: /var/jenkins/workspace/adamantine-nightly/tests/test_integration_2d_device.cc(19): Leaving test case "intregation_2D_device"; testing time: 2816927us
30: Leaving test module "Integration_2D_Device"; testing time: 2817232us
30: 
30: *** No errors detected
30: 
29/48 Test #30: test_integration_2d_device_1 .............   Passed    3.70 sec
test 31
      Start 31: test_integration_2d_device_2

31: Test command: /usr/bin/mpiexec "-n" "2" "/var/jenkins/workspace/adamantine-nightly/build/bin/test_integration_2d_device"
31: Working Directory: /var/jenkins/workspace/adamantine-nightly/build/tests
31: Test timeout computed to be: 7200
31: Running 1 test case...
31: Entering test module "Integration_2D_Device"
31: /var/jenkins/workspace/adamantine-nightly/tests/test_integration_2d_device.cc(19): Entering test case "intregation_2D_device"
31: Running 1 test case...
31: Entering test module "Integration_2D_Device"
31: /var/jenkins/workspace/adamantine-nightly/tests/test_integration_2d_device.cc(19): Entering test case "intregation_2D_device"
31: 10% completed
31: 20% completed
31: 30% completed
31: 40% completed
31: 50% completed
31: 60% completed
31: 70% completed
31: 80% completed
31: 90% completed
31: 100% completed
31: 
31: *** No errors detected
31: /var/jenkins/workspace/adamantine-nightly/tests/test_integration_2d_device.cc(19): Leaving test case "intregation_2D_device"; testing time: 1862356us
31: Leaving test module "Integration_2D_Device"; testing time: 1862638us
31: /var/jenkins/workspace/adamantine-nightly/tests/test_integration_2d_device.cc(19): Leaving test case "intregation_2D_device"; testing time: 1856634us
31: Leaving test module "Integration_2D_Device"; testing time: 1856969us
31: 
31: *** No errors detected
31: 
30/48 Test #31: test_integration_2d_device_2 .............   Passed    2.95 sec
test 32
      Start 32: test_integration_3d_1

32: Test command: /usr/bin/mpiexec "-n" "1" "/var/jenkins/workspace/adamantine-nightly/build/bin/test_integration_3d"
32: Working Directory: /var/jenkins/workspace/adamantine-nightly/build/tests
32: Test timeout computed to be: 7200
32: Running 5 test cases...
32: Entering test module "Integration_3D"
32: /var/jenkins/workspace/adamantine-nightly/tests/test_integration_3d.cc(102): Entering test case "integration_3D"
32: 10% completed
32: 20% completed
32: 30% completed
32: 40% completed
32: 50% completed
32: 60% completed
32: 70% completed
32: 80% completed
32: 90% completed
32: 100% completed
32: /var/jenkins/workspace/adamantine-nightly/tests/test_integration_3d.cc(102): Leaving test case "integration_3D"; testing time: 140390024us
32: /var/jenkins/workspace/adamantine-nightly/tests/test_integration_3d.cc(107): Entering test case "integration_3D_short"
32: 10% completed
32: 20% completed
32: 10% completed
32: 20% completed
32: 30% completed
32: 30% completed
32: 40% completed
32: 40% completed
32: 50% completed
32: 50% completed
32: 60% completed
32: 70% completed
32: 60% completed
32: 80% completed
32: 90% completed
32: 100% completed
32: /var/jenkins/workspace/adamantine-nightly/tests/test_integration_3d.cc(107): Leaving test case "integration_3D_short"; testing time: 1337322111us
32: /var/jenkins/workspace/adamantine-nightly/tests/test_integration_3d.cc(112): Entering test case "integration_3D_five_axis"
32: 70% completed
32: 80% completed
32: 10% completed
32: 90% completed
32: 100% completed
32: /var/jenkins/workspace/adamantine-nightly/tests/test_integration_3d.cc(112): Leaving test case "integration_3D_five_axis"; testing time: 2594128666us
32: /var/jenkins/workspace/adamantine-nightly/tests/test_integration_3d.cc(117): Entering test case "integration_3D_checkpoint_restart"
32: 20% completed
32: 10% completed
32: 20% completed
32: 30% completed
32: 40% completed
32: 50% completed
32: 60% completed
32: 70% completed
32: Checkpoint reached
32: 80% completed
32: 90% completed
32: 100% completed
32: Restarting from file
32: 80% completed
32: 90% completed
32: 100% completed
32: /var/jenkins/workspace/adamantine-nightly/tests/test_integration_3d.cc(117): Leaving test case "integration_3D_checkpoint_restart"; testing time: 103652230us
32: /var/jenkins/workspace/adamantine-nightly/tests/test_integration_3d.cc(167): Entering test case "hourglass"
32: Test case hourglass did not check any assertions
32: /var/jenkins/workspace/adamantine-nightly/tests/test_integration_3d.cc(167): Leaving test case "hourglass"; testing time: 85us
32: Leaving test module "Integration_3D"; testing time: 3622098506us
32: 
32: *** No errors detected
32: 
31/48 Test #32: test_integration_3d_1 ....................   Passed  3622.66 sec
test 33
      Start 33: test_integration_3d_2

33: Test command: /usr/bin/mpiexec "-n" "2" "/var/jenkins/workspace/adamantine-nightly/build/bin/test_integration_3d"
33: Working Directory: /var/jenkins/workspace/adamantine-nightly/build/tests
33: Test timeout computed to be: 7200
33: Running 5 test cases...
33: Running 5 test cases...
33: Entering test module "Integration_3D"
33: Entering test module "Integration_3D"
33: /var/jenkins/workspace/adamantine-nightly/tests/test_integration_3d.cc(102): Entering test case "integration_3D"
33: /var/jenkins/workspace/adamantine-nightly/tests/test_integration_3d.cc(102): Entering test case "integration_3D"
33: 10% completed
33: 20% completed
33: 30% completed
33: 40% completed
33: 50% completed
33: 60% completed
33: 70% completed
33: 80% completed
33: 90% completed
33: 100% completed
33: /var/jenkins/workspace/adamantine-nightly/tests/test_integration_3d.cc(102): Leaving test case "integration_3D"; testing time: 45983535us
33: /var/jenkins/workspace/adamantine-nightly/tests/test_integration_3d.cc(107): Entering test case "integration_3D_short"
33: /var/jenkins/workspace/adamantine-nightly/tests/test_integration_3d.cc(102): Leaving test case "integration_3D"; testing time: 45983736us
33: /var/jenkins/workspace/adamantine-nightly/tests/test_integration_3d.cc(107): Entering test case "integration_3D_short"
33: 10% completed
33: 20% completed
33: 30% completed
33: 40% completed
33: 50% completed
32: 30% completed
33: 60% completed
33: 70% completed
33: 80% completed
33: 90% completed
33: 100% completed
33: /var/jenkins/workspace/adamantine-nightly/tests/test_integration_3d.cc(107): Leaving test case "integration_3D_short"; testing time: 456173059us
33: /var/jenkins/workspace/adamantine-nightly/tests/test_integration_3d.cc(112): Entering test case "integration_3D_five_axis"
33: /var/jenkins/workspace/adamantine-nightly/tests/test_integration_3d.cc(107): Leaving test case "integration_3D_short"; testing time: 456175089us
33: /var/jenkins/workspace/adamantine-nightly/tests/test_integration_3d.cc(112): Entering test case "integration_3D_five_axis"
33: 10% completed
32: 40% completed
33: 20% completed
33: 30% completed
33: 40% completed
33: 50% completed
32: 50% completed
33: 60% completed
33: 70% completed
33: 80% completed
32: 60% completed
33: 90% completed
33: 100% completed
33: /var/jenkins/workspace/adamantine-nightly/tests/test_integration_3d.cc(112): Leaving test case "integration_3D_five_axis"; testing time: 1363405917us
33: /var/jenkins/workspace/adamantine-nightly/tests/test_integration_3d.cc(117): Entering test case "integration_3D_checkpoint_restart"
33: /var/jenkins/workspace/adamantine-nightly/tests/test_integration_3d.cc(112): Leaving test case "integration_3D_five_axis"; testing time: 1363409354us
33: /var/jenkins/workspace/adamantine-nightly/tests/test_integration_3d.cc(117): Entering test case "integration_3D_checkpoint_restart"
33: 10% completed
33: 20% completed
33: 30% completed
33: 40% completed
33: 50% completed
33: 60% completed
33: 70% completed
33: Checkpoint reached
33: 80% completed
33: 90% completed
33: 100% completed
33: Restarting from file
33: 80% completed
33: 90% completed
33: 100% completed
33: /var/jenkins/workspace/adamantine-nightly/tests/test_integration_3d.cc(117): Leaving test case "integration_3D_checkpoint_restart"; testing time: 56968646us
33: /var/jenkins/workspace/adamantine-nightly/tests/test_integration_3d.cc(167): Entering test case "hourglass"
33: /var/jenkins/workspace/adamantine-nightly/tests/test_integration_3d.cc(117): Leaving test case "integration_3D_checkpoint_restart"; testing time: 56967483us
33: /var/jenkins/workspace/adamantine-nightly/tests/test_integration_3d.cc(167): Entering test case "hourglass"
33: n_time_step: 1 time: 0 n_dofs (thermal) after mesh refinement: 1172
33: n_time_step: 100 time: 0.99 n_dofs (thermal) after cell activation: 1178
33: 10% completed
33: n_time_step: 101 time: 1 n_dofs (thermal) after cell activation: 1178
33: n_time_step: 124 time: 1.23 n_dofs (thermal) after cell activation: 1181
33: n_time_step: 147 time: 1.46 n_dofs (thermal) after cell activation: 1184
33: n_time_step: 170 time: 1.69 n_dofs (thermal) after cell activation: 1187
33: n_time_step: 171 time: 1.7 n_dofs (thermal) after cell activation: 1187
33: n_time_step: 194 time: 1.93 n_dofs (thermal) after cell activation: 1190
33: 20% completed
32: 70% completed
33: n_time_step: 217 time: 2.16 n_dofs (thermal) after cell activation: 1193
33: n_time_step: 241 time: 2.4 n_dofs (thermal) after cell activation: 1196
33: n_time_step: 264 time: 2.63 n_dofs (thermal) after cell activation: 1199
33: n_time_step: 287 time: 2.86 n_dofs (thermal) after cell activation: 1202
33: n_time_step: 301 time: 3 n_dofs (thermal) after cell activation: 1204
33: 30% completed
33: n_time_step: 325 time: 3.24 n_dofs (thermal) after cell activation: 1205
33: n_time_step: 348 time: 3.47 n_dofs (thermal) after cell activation: 1206
33: n_time_step: 371 time: 3.7 n_dofs (thermal) after cell activation: 1207
33: n_time_step: 395 time: 3.94 n_dofs (thermal) after cell activation: 1208
33: 40% completed
33: n_time_step: 418 time: 4.17 n_dofs (thermal) after cell activation: 1209
33: n_time_step: 441 time: 4.4 n_dofs (thermal) after cell activation: 1210
33: n_time_step: 465 time: 4.64 n_dofs (thermal) after cell activation: 1211
33: n_time_step: 488 time: 4.87 n_dofs (thermal) after cell activation: 1212
33: 50% completed
32: 80% completed
33: n_time_step: 507 time: 5.06 n_dofs (thermal) after cell activation: 1216
33: n_time_step: 531 time: 5.3 n_dofs (thermal) after cell activation: 1217
33: n_time_step: 554 time: 5.53 n_dofs (thermal) after cell activation: 1218
33: n_time_step: 577 time: 5.76 n_dofs (thermal) after cell activation: 1219
33: n_time_step: 601 time: 6 n_dofs (thermal) after cell activation: 1220
33: 60% completed
33: n_time_step: 624 time: 6.23 n_dofs (thermal) after cell activation: 1221
33: n_time_step: 647 time: 6.46 n_dofs (thermal) after cell activation: 1222
33: n_time_step: 671 time: 6.7 n_dofs (thermal) after cell activation: 1223
33: n_time_step: 694 time: 6.93 n_dofs (thermal) after cell activation: 1224
33: 70% completed
33: n_time_step: 717 time: 7.16 n_dofs (thermal) after cell activation: 1226
33: n_time_step: 740 time: 7.39 n_dofs (thermal) after cell activation: 1227
33: n_time_step: 763 time: 7.62 n_dofs (thermal) after cell activation: 1228
33: n_time_step: 787 time: 7.86 n_dofs (thermal) after cell activation: 1229
33: 80% completed
33: n_time_step: 810 time: 8.09 n_dofs (thermal) after cell activation: 1230
32: 90% completed
33: n_time_step: 833 time: 8.32 n_dofs (thermal) after cell activation: 1231
33: n_time_step: 857 time: 8.56 n_dofs (thermal) after cell activation: 1232
33: n_time_step: 880 time: 8.79 n_dofs (thermal) after cell activation: 1233
33: 90% completed
33: n_time_step: 903 time: 9.02 n_dofs (thermal) after cell activation: 1234
33: n_time_step: 927 time: 9.26 n_dofs (thermal) after cell activation: 1235
33: n_time_step: 928 time: 9.27 n_dofs (thermal) after cell activation: 1238
33: n_time_step: 951 time: 9.5 n_dofs (thermal) after cell activation: 1239
33: n_time_step: 975 time: 9.74 n_dofs (thermal) after cell activation: 1240
33: n_time_step: 998 time: 9.97 n_dofs (thermal) after cell activation: 1241
33: 100% completed
33: Test case hourglass did not check any assertions
33: /var/jenkins/workspace/adamantine-nightly/tests/test_integration_3d.cc(167): Leaving test case "hourglass"; testing time: 1432373697us
33: Leaving test module "Integration_3D"; testing time: 3354909388us
33: 
33: *** No errors detected
33: Test case hourglass did not check any assertions
33: /var/jenkins/workspace/adamantine-nightly/tests/test_integration_3d.cc(167): Leaving test case "hourglass"; testing time: 1432396940us
33: Leaving test module "Integration_3D"; testing time: 3354932432us
33: 
33: *** No errors detected
33: 
32/48 Test #33: test_integration_3d_2 ....................   Passed  3355.53 sec
test 34
      Start 34: test_integration_3d_amr_1

34: Test command: /usr/bin/mpiexec "-n" "1" "/var/jenkins/workspace/adamantine-nightly/build/bin/test_integration_3d_amr"
34: Working Directory: /var/jenkins/workspace/adamantine-nightly/build/tests
34: Test timeout computed to be: 7200
34: Running 2 test cases...
34: Entering test module "Integration_3D_AMR"
34: /var/jenkins/workspace/adamantine-nightly/tests/test_integration_3d_amr.cc(19): Entering test case "integration_3D_amr"
34: 10% completed
34: 20% completed
34: 30% completed
34: 40% completed
34: 50% completed
34: 60% completed
34: 70% completed
34: 80% completed
34: 90% completed
34: 100% completed
34: /var/jenkins/workspace/adamantine-nightly/tests/test_integration_3d_amr.cc(19): Leaving test case "integration_3D_amr"; testing time: 5394301us
34: /var/jenkins/workspace/adamantine-nightly/tests/test_integration_3d_amr.cc(60): Entering test case "integration_3D_amr_refine_coarsen"
34: 10% completed
34: 20% completed
34: 30% completed
34: 40% completed
34: 50% completed
34: 60% completed
34: 70% completed
34: 80% completed
34: 90% completed
34: 100% completed
34: /var/jenkins/workspace/adamantine-nightly/tests/test_integration_3d_amr.cc(60): Leaving test case "integration_3D_amr_refine_coarsen"; testing time: 83654588us
34: Leaving test module "Integration_3D_AMR"; testing time: 89049384us
34: 
34: *** No errors detected
34: 
33/48 Test #34: test_integration_3d_amr_1 ................   Passed   89.62 sec
test 35
      Start 35: test_integration_3d_amr_2

35: Test command: /usr/bin/mpiexec "-n" "2" "/var/jenkins/workspace/adamantine-nightly/build/bin/test_integration_3d_amr"
35: Working Directory: /var/jenkins/workspace/adamantine-nightly/build/tests
35: Test timeout computed to be: 7200
35: Running 2 test cases...
35: Running 2 test cases...
35: Entering test module "Integration_3D_AMR"
35: Entering test module "Integration_3D_AMR"
35: /var/jenkins/workspace/adamantine-nightly/tests/test_integration_3d_amr.cc(19): Entering test case "integration_3D_amr"
35: /var/jenkins/workspace/adamantine-nightly/tests/test_integration_3d_amr.cc(19): Entering test case "integration_3D_amr"
35: 10% completed
35: 20% completed
35: 30% completed
35: 40% completed
35: 50% completed
35: 60% completed
35: 70% completed
35: 80% completed
35: 90% completed
35: 100% completed
35: /var/jenkins/workspace/adamantine-nightly/tests/test_integration_3d_amr.cc(19): Leaving test case "integration_3D_amr"; testing time: 3114630us
35: /var/jenkins/workspace/adamantine-nightly/tests/test_integration_3d_amr.cc(60): Entering test case "integration_3D_amr_refine_coarsen"
35: /var/jenkins/workspace/adamantine-nightly/tests/test_integration_3d_amr.cc(19): Leaving test case "integration_3D_amr"; testing time: 3114621us
35: /var/jenkins/workspace/adamantine-nightly/tests/test_integration_3d_amr.cc(60): Entering test case "integration_3D_amr_refine_coarsen"
35: 10% completed
35: 20% completed
35: 30% completed
35: 40% completed
32: 100% completed
32: /var/jenkins/workspace/adamantine-nightly/tests/test_integration_3d.cc(112): Leaving test case "integration_3D_five_axis"; testing time: 4514932964us
32: /var/jenkins/workspace/adamantine-nightly/tests/test_integration_3d.cc(117): Entering test case "integration_3D_checkpoint_restart"
35: 50% completed
35: 60% completed
35: 70% completed
35: 80% completed
35: 90% completed
35: 100% completed
35: /var/jenkins/workspace/adamantine-nightly/tests/test_integration_3d_amr.cc(60): Leaving test case "integration_3D_amr_refine_coarsen"; testing time: 47339064us
35: Leaving test module "Integration_3D_AMR"; testing time: 50454203us
35: /var/jenkins/workspace/adamantine-nightly/tests/test_integration_3d_amr.cc(60): Leaving test case "integration_3D_amr_refine_coarsen"; testing time: 47339069us
35: 
35: *** No errors detected
35: Leaving test module "Integration_3D_AMR"; testing time: 50454231us
35: 
35: *** No errors detected
35: 
34/48 Test #35: test_integration_3d_amr_2 ................   Passed   51.04 sec
test 36
      Start 36: test_integration_3d_amr_device_1

36: Test command: /usr/bin/mpiexec "-n" "1" "/var/jenkins/workspace/adamantine-nightly/build/bin/test_integration_3d_amr_device"
36: Working Directory: /var/jenkins/workspace/adamantine-nightly/build/tests
36: Test timeout computed to be: 7200
36: Running 1 test case...
36: Entering test module "Integration_3D_AMR"
36: /var/jenkins/workspace/adamantine-nightly/tests/test_integration_3d_amr_device.cc(19): Entering test case "integration_3D_amr_device"
36: 10% completed
32: 10% completed
36: 20% completed
36: 30% completed
36: 40% completed
32: 20% completed
32: 30% completed
36: 50% completed
32: 40% completed
36: 60% completed
36: 70% completed
36: 80% completed
32: 50% completed
36: 90% completed
32: 60% completed
32: 70% completed
36: 100% completed
36: /var/jenkins/workspace/adamantine-nightly/tests/test_integration_3d_amr_device.cc(19): Leaving test case "integration_3D_amr_device"; testing time: 81016829us
36: Leaving test module "Integration_3D_AMR"; testing time: 81017430us
36: 
36: *** No errors detected
36: 
35/48 Test #36: test_integration_3d_amr_device_1 .........   Passed   81.57 sec
test 37
      Start 37: test_integration_3d_amr_device_2

37: Test command: /usr/bin/mpiexec "-n" "2" "/var/jenkins/workspace/adamantine-nightly/build/bin/test_integration_3d_amr_device"
37: Working Directory: /var/jenkins/workspace/adamantine-nightly/build/tests
37: Test timeout computed to be: 7200
37: Running 1 test case...
37: Running 1 test case...
37: Entering test module "Integration_3D_AMR"
37: /var/jenkins/workspace/adamantine-nightly/tests/test_integration_3d_amr_device.cc(19): Entering test case "integration_3D_amr_device"
37: Entering test module "Integration_3D_AMR"
37: /var/jenkins/workspace/adamantine-nightly/tests/test_integration_3d_amr_device.cc(19): Entering test case "integration_3D_amr_device"
37: 10% completed
37: 20% completed
37: 30% completed
37: 40% completed
32: Checkpoint reached
32: 80% completed
37: 50% completed
32: 90% completed
37: 60% completed
37: 70% completed
32: 100% completed
37: 80% completed
37: 90% completed
37: 100% completed
37: /var/jenkins/workspace/adamantine-nightly/tests/test_integration_3d_amr_device.cc(19): Leaving test case "integration_3D_amr_device"; testing time: 43039524us
37: Leaving test module "Integration_3D_AMR"; testing time: 43040140us
37: 
37: *** No errors detected
37: /var/jenkins/workspace/adamantine-nightly/tests/test_integration_3d_amr_device.cc(19): Leaving test case "integration_3D_amr_device"; testing time: 43039583us
37: Leaving test module "Integration_3D_AMR"; testing time: 43040212us
37: 
37: *** No errors detected
37: 
36/48 Test #37: test_integration_3d_amr_device_2 .........   Passed   43.63 sec
test 38
      Start 38: test_integration_da_augmented_1

38: Test command: /usr/bin/mpiexec "-n" "1" "/var/jenkins/workspace/adamantine-nightly/build/bin/test_integration_da_augmented"
38: Working Directory: /var/jenkins/workspace/adamantine-nightly/build/tests
38: Test timeout computed to be: 7200
38: Running 1 test case...
38: Entering test module "Integration_Data_Assimilation_Augmented"
38: /var/jenkins/workspace/adamantine-nightly/tests/test_integration_da_augmented.cc(19): Entering test case "integration_3D_data_assimilation_augmented"
38: Reading the experimental log file...
38: Done. Log entries found for 1 camera(s), with 2 frame(s).
38: Starting the main time stepping loop...
38: 10% completed
38: 20% completed
38: 30% completed
32: Restarting from file
32: 80% completed
38: 40% completed
38: 50% completed
32: 90% completed
38: 60% completed
38: 70% completed
38: Performing data assimilation at time 0.04...
38: Rank: 0 | Old parameters for member 0: 0.413453 
38: Rank: 0 | Old parameters for member 1: 0.385362 
38: Rank: 0 | Old parameters for member 2: 0.446065 
38: Rank: 0 | Number expt sites mapped to DOFs: 2
32: 100% completed
32: /var/jenkins/workspace/adamantine-nightly/tests/test_integration_3d.cc(117): Leaving test case "integration_3D_checkpoint_restart"; testing time: 171214744us
32: /var/jenkins/workspace/adamantine-nightly/tests/test_integration_3d.cc(167): Entering test case "hourglass"
32: Test case hourglass did not check any assertions
32: /var/jenkins/workspace/adamantine-nightly/tests/test_integration_3d.cc(167): Leaving test case "hourglass"; testing time: 112us
32: Leaving test module "Integration_3D"; testing time: 6163865130us
32: 
32: *** No errors detected
32: 
31/48 Test #32: test_integration_3d_1 ....................   Passed  6164.74 sec
test 33
      Start 33: test_integration_3d_2

33: Test command: /usr/bin/mpiexec "-n" "2" "/var/jenkins/workspace/adamantine-nightly/build/bin/test_integration_3d"
33: Working Directory: /var/jenkins/workspace/adamantine-nightly/build/tests
33: Test timeout computed to be: 7200
33: Running 5 test cases...
33: Entering test module "Integration_3D"
33: /var/jenkins/workspace/adamantine-nightly/tests/test_integration_3d.cc(102): Entering test case "integration_3D"
33: Running 5 test cases...
33: Entering test module "Integration_3D"
33: /var/jenkins/workspace/adamantine-nightly/tests/test_integration_3d.cc(102): Entering test case "integration_3D"
38: Getting the perturbed innovation...
38: Applying the Kalman gain...
38: Updating the ensemble members...
38: Done.
38: Rank: 0 | New parameters for member 0: 0.121104 
38: Rank: 0 | New parameters for member 1: 0.142225 
38: Rank: 0 | New parameters for member 2: 0.107206 
38: 80% completed
38: 90% completed
38: 100% completed
38: 
38: *** No errors detected
38: /var/jenkins/workspace/adamantine-nightly/tests/test_integration_da_augmented.cc(19): Leaving test case "integration_3D_data_assimilation_augmented"; testing time: 26050512us
38: Leaving test module "Integration_Data_Assimilation_Augmented"; testing time: 26050784us
38: 
37/48 Test #38: test_integration_da_augmented_1 ..........   Passed   26.61 sec
test 39
      Start 39: test_integration_da_augmented_2

39: Test command: /usr/bin/mpiexec "-n" "2" "/var/jenkins/workspace/adamantine-nightly/build/bin/test_integration_da_augmented"
39: Working Directory: /var/jenkins/workspace/adamantine-nightly/build/tests
39: Test timeout computed to be: 7200
39: Running 1 test case...
39: Running 1 test case...
39: Entering test module "Integration_Data_Assimilation_Augmented"
39: /var/jenkins/workspace/adamantine-nightly/tests/test_integration_da_augmented.cc(19): Entering test case "integration_3D_data_assimilation_augmented"
39: Entering test module "Integration_Data_Assimilation_Augmented"
39: /var/jenkins/workspace/adamantine-nightly/tests/test_integration_da_augmented.cc(19): Entering test case "integration_3D_data_assimilation_augmented"
39: Reading the experimental log file...
39: Done. Log entries found for 1 camera(s), with 2 frame(s).
39: Starting the main time stepping loop...
39: 10% completed
39: 20% completed
39: 30% completed
39: Rank: 1 | Old parameters for member 2: 0.446065 
39: Rank: 1 | Number expt sites mapped to DOFs: 2
39: 40% completed
39: 50% completed
39: 60% completed
39: 70% completed
39: Performing data assimilation at time 0.04...
39: Rank: 0 | Old parameters for member 0: 0.413453 
39: Rank: 0 | Old parameters for member 1: 0.385362 
39: Rank: 0 | Number expt sites mapped to DOFs: 2
39: Getting the perturbed innovation...
39: Applying the Kalman gain...
39: Updating the ensemble members...
39: Rank: 1 | New parameters for member 2: 0.107206 
39: Done.
39: Rank: 0 | New parameters for member 0: 0.121104 
39: Rank: 0 | New parameters for member 1: 0.142225 
39: 80% completed
39: 90% completed
39: 100% completed
39: /var/jenkins/workspace/adamantine-nightly/tests/test_integration_da_augmented.cc(19): Leaving test case "integration_3D_data_assimilation_augmented"; testing time: 18378327us
39: Leaving test module "Integration_Data_Assimilation_Augmented"; testing time: 18378662us
39: /var/jenkins/workspace/adamantine-nightly/tests/test_integration_da_augmented.cc(19): Leaving test case "integration_3D_data_assimilation_augmented"; testing time: 18378362us
39: Leaving test module "Integration_Data_Assimilation_Augmented"; testing time: 18378724us
39: 
39: *** No errors detected
39: 
39: *** No errors detected
39: 
38/48 Test #39: test_integration_da_augmented_2 ..........   Passed   18.97 sec
test 40
      Start 40: test_integration_thermoelastic_1

40: Test command: /usr/bin/mpiexec "-n" "1" "/var/jenkins/workspace/adamantine-nightly/build/bin/test_integration_thermoelastic"
40: Working Directory: /var/jenkins/workspace/adamantine-nightly/build/tests
40: Test timeout computed to be: 7200
40: Running 2 test cases...
40: Entering test module "Integration_Thermoelastic"
40: /var/jenkins/workspace/adamantine-nightly/tests/test_integration_thermoelastic.cc(19): Entering test case "integration_thermoelastic"
33: 10% completed
33: 20% completed
33: 30% completed
33: 40% completed
33: 50% completed
33: 60% completed
33: 70% completed
33: 80% completed
33: 90% completed
33: 100% completed
33: /var/jenkins/workspace/adamantine-nightly/tests/test_integration_3d.cc(102): Leaving test case "integration_3D"; testing time: 74929523us
33: /var/jenkins/workspace/adamantine-nightly/tests/test_integration_3d.cc(107): Entering test case "integration_3D_short"
33: /var/jenkins/workspace/adamantine-nightly/tests/test_integration_3d.cc(102): Leaving test case "integration_3D"; testing time: 74929406us
33: /var/jenkins/workspace/adamantine-nightly/tests/test_integration_3d.cc(107): Entering test case "integration_3D_short"
33: 10% completed
33: 20% completed
40: 10% completed
33: 30% completed
33: 40% completed
33: 50% completed
40: 20% completed
33: 60% completed
33: 70% completed
33: 80% completed
33: 90% completed
33: 100% completed
33: /var/jenkins/workspace/adamantine-nightly/tests/test_integration_3d.cc(107): Leaving test case "integration_3D_short"; testing time: 719425603us
33: /var/jenkins/workspace/adamantine-nightly/tests/test_integration_3d.cc(112): Entering test case "integration_3D_five_axis"
33: /var/jenkins/workspace/adamantine-nightly/tests/test_integration_3d.cc(107): Leaving test case "integration_3D_short"; testing time: 719429595us
33: /var/jenkins/workspace/adamantine-nightly/tests/test_integration_3d.cc(112): Entering test case "integration_3D_five_axis"
40: 30% completed
40: 40% completed
33: 10% completed
40: 50% completed
33: 20% completed
40: 60% completed
33: 30% completed
40: 70% completed
33: 40% completed
40: 80% completed
33: 50% completed
40: 90% completed
33: 60% completed
40: 100% completed
40: /var/jenkins/workspace/adamantine-nightly/tests/test_integration_thermoelastic.cc(19): Leaving test case "integration_thermoelastic"; testing time: 2385862436us
40: /var/jenkins/workspace/adamantine-nightly/tests/test_integration_thermoelastic.cc(47): Entering test case "integration_thermoelastic_add_material"
33: 70% completed
40: 10% completed
33: 80% completed
40: 20% completed
40: 30% completed
33: 90% completed
40: 40% completed
33: 100% completed
33: /var/jenkins/workspace/adamantine-nightly/tests/test_integration_3d.cc(112): Leaving test case "integration_3D_five_axis"; testing time: 2343704984us
33: /var/jenkins/workspace/adamantine-nightly/tests/test_integration_3d.cc(117): Entering test case "integration_3D_checkpoint_restart"
33: /var/jenkins/workspace/adamantine-nightly/tests/test_integration_3d.cc(112): Leaving test case "integration_3D_five_axis"; testing time: 2343707824us
33: /var/jenkins/workspace/adamantine-nightly/tests/test_integration_3d.cc(117): Entering test case "integration_3D_checkpoint_restart"
33: 10% completed
33: 20% completed
33: 30% completed
33: 40% completed
40: 50% completed
33: 50% completed
33: 60% completed
33: 70% completed
33: Checkpoint reached
33: 80% completed
33: 90% completed
33: 100% completed
33: Restarting from file
33: 80% completed
33: 90% completed
33: 100% completed
33: /var/jenkins/workspace/adamantine-nightly/tests/test_integration_3d.cc(117): Leaving test case "integration_3D_checkpoint_restart"; testing time: 92537809us
33: /var/jenkins/workspace/adamantine-nightly/tests/test_integration_3d.cc(167): Entering test case "hourglass"
33: /var/jenkins/workspace/adamantine-nightly/tests/test_integration_3d.cc(117): Leaving test case "integration_3D_checkpoint_restart"; testing time: 92536155us
33: /var/jenkins/workspace/adamantine-nightly/tests/test_integration_3d.cc(167): Entering test case "hourglass"
33: n_time_step: 1 time: 0 n_dofs (thermal) after mesh refinement: 1172
40: 60% completed
33: n_time_step: 100 time: 0.99 n_dofs (thermal) after cell activation: 1178
33: 10% completed
33: n_time_step: 101 time: 1 n_dofs (thermal) after cell activation: 1178
33: n_time_step: 124 time: 1.23 n_dofs (thermal) after cell activation: 1181
40: 70% completed
33: n_time_step: 147 time: 1.46 n_dofs (thermal) after cell activation: 1184
33: n_time_step: 170 time: 1.69 n_dofs (thermal) after cell activation: 1187
33: n_time_step: 171 time: 1.7 n_dofs (thermal) after cell activation: 1187
33: n_time_step: 194 time: 1.93 n_dofs (thermal) after cell activation: 1190
33: 20% completed
40: 80% completed
33: n_time_step: 217 time: 2.16 n_dofs (thermal) after cell activation: 1193
33: n_time_step: 241 time: 2.4 n_dofs (thermal) after cell activation: 1196
33: n_time_step: 264 time: 2.63 n_dofs (thermal) after cell activation: 1199
40: 90% completed
33: n_time_step: 287 time: 2.86 n_dofs (thermal) after cell activation: 1202
33: n_time_step: 301 time: 3 n_dofs (thermal) after cell activation: 1204
33: 30% completed
33: n_time_step: 325 time: 3.24 n_dofs (thermal) after cell activation: 1205
40: 100% completed
40: /var/jenkins/workspace/adamantine-nightly/tests/test_integration_thermoelastic.cc(47): Leaving test case "integration_thermoelastic_add_material"; testing time: 1515608119us
40: Leaving test module "Integration_Thermoelastic"; testing time: 3901471931us
40: 
40: *** No errors detected
40: 
39/48 Test #40: test_integration_thermoelastic_1 .........   Passed  3902.03 sec
test 41
      Start 41: test_integration_thermoelastic_2

41: Test command: /usr/bin/mpiexec "-n" "2" "/var/jenkins/workspace/adamantine-nightly/build/bin/test_integration_thermoelastic"
41: Working Directory: /var/jenkins/workspace/adamantine-nightly/build/tests
41: Test timeout computed to be: 7200
41: Running 2 test cases...
41: Entering test module "Integration_Thermoelastic"
41: /var/jenkins/workspace/adamantine-nightly/tests/test_integration_thermoelastic.cc(19): Entering test case "integration_thermoelastic"
41: Running 2 test cases...
41: Entering test module "Integration_Thermoelastic"
41: /var/jenkins/workspace/adamantine-nightly/tests/test_integration_thermoelastic.cc(19): Entering test case "integration_thermoelastic"
33: n_time_step: 348 time: 3.47 n_dofs (thermal) after cell activation: 1206
33: n_time_step: 371 time: 3.7 n_dofs (thermal) after cell activation: 1207
33: n_time_step: 395 time: 3.94 n_dofs (thermal) after cell activation: 1208
33: 40% completed
41: 10% completed
33: n_time_step: 418 time: 4.17 n_dofs (thermal) after cell activation: 1209
33: n_time_step: 441 time: 4.4 n_dofs (thermal) after cell activation: 1210
33: n_time_step: 465 time: 4.64 n_dofs (thermal) after cell activation: 1211
41: 20% completed
33: n_time_step: 488 time: 4.87 n_dofs (thermal) after cell activation: 1212
33: 50% completed
33: n_time_step: 507 time: 5.06 n_dofs (thermal) after cell activation: 1216
41: 30% completed
33: n_time_step: 531 time: 5.3 n_dofs (thermal) after cell activation: 1217
33: n_time_step: 554 time: 5.53 n_dofs (thermal) after cell activation: 1218
33: n_time_step: 577 time: 5.76 n_dofs (thermal) after cell activation: 1219
41: 40% completed
33: n_time_step: 601 time: 6 n_dofs (thermal) after cell activation: 1220
33: 60% completed
33: n_time_step: 624 time: 6.23 n_dofs (thermal) after cell activation: 1221
41: 50% completed
33: n_time_step: 647 time: 6.46 n_dofs (thermal) after cell activation: 1222
33: n_time_step: 671 time: 6.7 n_dofs (thermal) after cell activation: 1223
33: n_time_step: 694 time: 6.93 n_dofs (thermal) after cell activation: 1224
33: 70% completed
41: 60% completed
33: n_time_step: 717 time: 7.16 n_dofs (thermal) after cell activation: 1226
33: n_time_step: 740 time: 7.39 n_dofs (thermal) after cell activation: 1227
41: 70% completed
33: n_time_step: 763 time: 7.62 n_dofs (thermal) after cell activation: 1228
33: n_time_step: 787 time: 7.86 n_dofs (thermal) after cell activation: 1229
33: 80% completed
33: n_time_step: 810 time: 8.09 n_dofs (thermal) after cell activation: 1230
41: 80% completed
33: n_time_step: 833 time: 8.32 n_dofs (thermal) after cell activation: 1231
33: n_time_step: 857 time: 8.56 n_dofs (thermal) after cell activation: 1232
33: n_time_step: 880 time: 8.79 n_dofs (thermal) after cell activation: 1233
41: 90% completed
33: 90% completed
33: n_time_step: 903 time: 9.02 n_dofs (thermal) after cell activation: 1234
33: n_time_step: 927 time: 9.26 n_dofs (thermal) after cell activation: 1235
41: 100% completed
41: /var/jenkins/workspace/adamantine-nightly/tests/test_integration_thermoelastic.cc(19): Leaving test case "integration_thermoelastic"; testing time: 1298496808us
41: /var/jenkins/workspace/adamantine-nightly/tests/test_integration_thermoelastic.cc(47): Entering test case "integration_thermoelastic_add_material"
41: /var/jenkins/workspace/adamantine-nightly/tests/test_integration_thermoelastic.cc(19): Leaving test case "integration_thermoelastic"; testing time: 1298496492us
41: /var/jenkins/workspace/adamantine-nightly/tests/test_integration_thermoelastic.cc(47): Entering test case "integration_thermoelastic_add_material"
33: n_time_step: 928 time: 9.27 n_dofs (thermal) after cell activation: 1238
33: n_time_step: 951 time: 9.5 n_dofs (thermal) after cell activation: 1239
41: 10% completed
33: n_time_step: 975 time: 9.74 n_dofs (thermal) after cell activation: 1240
33: n_time_step: 998 time: 9.97 n_dofs (thermal) after cell activation: 1241
33: 100% completed
33: Test case hourglass did not check any assertions
33: /var/jenkins/workspace/adamantine-nightly/tests/test_integration_3d.cc(167): Leaving test case "hourglass"; testing time: 2170611329us
33: Leaving test module "Integration_3D"; testing time: 5401218196us
33: 
33: *** No errors detected
33: 
33: *** No errors detected
33: Test case hourglass did not check any assertions
33: /var/jenkins/workspace/adamantine-nightly/tests/test_integration_3d.cc(167): Leaving test case "hourglass"; testing time: 2170638927us
33: Leaving test module "Integration_3D"; testing time: 5401242102us
33: 
32/48 Test #33: test_integration_3d_2 ....................   Passed  5402.65 sec
test 34
      Start 34: test_integration_3d_amr_1

34: Test command: /usr/bin/mpiexec "-n" "1" "/var/jenkins/workspace/adamantine-nightly/build/bin/test_integration_3d_amr"
34: Working Directory: /var/jenkins/workspace/adamantine-nightly/build/tests
34: Test timeout computed to be: 7200
34: Running 2 test cases...
34: Entering test module "Integration_3D_AMR"
34: /var/jenkins/workspace/adamantine-nightly/tests/test_integration_3d_amr.cc(19): Entering test case "integration_3D_amr"
34: 10% completed
34: 20% completed
34: 30% completed
41: 20% completed
34: 40% completed
34: 50% completed
34: 60% completed
34: 70% completed
34: 80% completed
34: 90% completed
34: 100% completed
34: /var/jenkins/workspace/adamantine-nightly/tests/test_integration_3d_amr.cc(19): Leaving test case "integration_3D_amr"; testing time: 10185882us
34: /var/jenkins/workspace/adamantine-nightly/tests/test_integration_3d_amr.cc(60): Entering test case "integration_3D_amr_refine_coarsen"
34: 10% completed
34: 20% completed
34: 30% completed
41: 30% completed
34: 40% completed
34: 50% completed
34: 60% completed
34: 70% completed
34: 80% completed
34: 90% completed
34: 100% completed
34: 
34: *** No errors detected
34: /var/jenkins/workspace/adamantine-nightly/tests/test_integration_3d_amr.cc(60): Leaving test case "integration_3D_amr_refine_coarsen"; testing time: 133981640us
34: Leaving test module "Integration_3D_AMR"; testing time: 144168110us
34: 
33/48 Test #34: test_integration_3d_amr_1 ................   Passed  145.09 sec
test 35
      Start 35: test_integration_3d_amr_2

35: Test command: /usr/bin/mpiexec "-n" "2" "/var/jenkins/workspace/adamantine-nightly/build/bin/test_integration_3d_amr"
35: Working Directory: /var/jenkins/workspace/adamantine-nightly/build/tests
35: Test timeout computed to be: 7200
35: Running 2 test cases...
35: Entering test module "Integration_3D_AMR"
35: /var/jenkins/workspace/adamantine-nightly/tests/test_integration_3d_amr.cc(19): Entering test case "integration_3D_amr"
35: Running 2 test cases...
35: Entering test module "Integration_3D_AMR"
35: /var/jenkins/workspace/adamantine-nightly/tests/test_integration_3d_amr.cc(19): Entering test case "integration_3D_amr"
35: 10% completed
35: 20% completed
35: 30% completed
35: 40% completed
35: 50% completed
35: 60% completed
35: 70% completed
35: 80% completed
35: 90% completed
35: 100% completed
35: /var/jenkins/workspace/adamantine-nightly/tests/test_integration_3d_amr.cc(19): Leaving test case "integration_3D_amr"; testing time: 5845801us
35: /var/jenkins/workspace/adamantine-nightly/tests/test_integration_3d_amr.cc(60): Entering test case "integration_3D_amr_refine_coarsen"
35: /var/jenkins/workspace/adamantine-nightly/tests/test_integration_3d_amr.cc(19): Leaving test case "integration_3D_amr"; testing time: 5848548us
35: /var/jenkins/workspace/adamantine-nightly/tests/test_integration_3d_amr.cc(60): Entering test case "integration_3D_amr_refine_coarsen"
35: 10% completed
41: 40% completed
35: 20% completed
35: 30% completed
35: 40% completed
35: 50% completed
35: 60% completed
35: 70% completed
35: 80% completed
35: 90% completed
35: 100% completed
35: /var/jenkins/workspace/adamantine-nightly/tests/test_integration_3d_amr.cc(60): Leaving test case "integration_3D_amr_refine_coarsen"; testing time: 73926486us
35: Leaving test module "Integration_3D_AMR"; testing time: 79773197us
35: /var/jenkins/workspace/adamantine-nightly/tests/test_integration_3d_amr.cc(60): Leaving test case "integration_3D_amr_refine_coarsen"; testing time: 73926488us
35: Leaving test module "Integration_3D_AMR"; testing time: 79775911us
35: 
35: *** No errors detected
35: 
35: *** No errors detected
35: 
34/48 Test #35: test_integration_3d_amr_2 ................   Passed   80.86 sec
test 36
      Start 36: test_integration_3d_amr_device_1

36: Test command: /usr/bin/mpiexec "-n" "1" "/var/jenkins/workspace/adamantine-nightly/build/bin/test_integration_3d_amr_device"
36: Working Directory: /var/jenkins/workspace/adamantine-nightly/build/tests
36: Test timeout computed to be: 7200
36: Running 1 test case...
36: Entering test module "Integration_3D_AMR"
36: /var/jenkins/workspace/adamantine-nightly/tests/test_integration_3d_amr_device.cc(19): Entering test case "integration_3D_amr_device"
36: 10% completed
36: 20% completed
41: 50% completed
36: 30% completed
36: 40% completed
36: 50% completed
36: 60% completed
36: 70% completed
36: 80% completed
36: 90% completed
41: 60% completed
36: 100% completed
36: 
36: *** No errors detected
36: /var/jenkins/workspace/adamantine-nightly/tests/test_integration_3d_amr_device.cc(19): Leaving test case "integration_3D_amr_device"; testing time: 102169832us
36: Leaving test module "Integration_3D_AMR"; testing time: 102170124us
36: 
35/48 Test #36: test_integration_3d_amr_device_1 .........   Passed  103.08 sec
test 37
      Start 37: test_integration_3d_amr_device_2

37: Test command: /usr/bin/mpiexec "-n" "2" "/var/jenkins/workspace/adamantine-nightly/build/bin/test_integration_3d_amr_device"
37: Working Directory: /var/jenkins/workspace/adamantine-nightly/build/tests
37: Test timeout computed to be: 7200
37: Running 1 test case...
37: Entering test module "Integration_3D_AMR"
37: /var/jenkins/workspace/adamantine-nightly/tests/test_integration_3d_amr_device.cc(19): Entering test case "integration_3D_amr_device"
37: Running 1 test case...
37: Entering test module "Integration_3D_AMR"
37: /var/jenkins/workspace/adamantine-nightly/tests/test_integration_3d_amr_device.cc(19): Entering test case "integration_3D_amr_device"
37: 10% completed
37: 20% completed
37: 30% completed
37: 40% completed
37: 50% completed
37: 60% completed
37: 70% completed
37: 80% completed
37: 90% completed
37: 100% completed
37: 
37: *** No errors detected
37: 
37: *** No errors detected
37: /var/jenkins/workspace/adamantine-nightly/tests/test_integration_3d_amr_device.cc(19): Leaving test case "integration_3D_amr_device"; testing time: 55857961us
37: Leaving test module "Integration_3D_AMR"; testing time: 55858270us
37: /var/jenkins/workspace/adamantine-nightly/tests/test_integration_3d_amr_device.cc(19): Leaving test case "integration_3D_amr_device"; testing time: 55860638us
37: Leaving test module "Integration_3D_AMR"; testing time: 55860940us
37: 
36/48 Test #37: test_integration_3d_amr_device_2 .........   Passed   56.94 sec
test 38
      Start 38: test_integration_da_augmented_1

38: Test command: /usr/bin/mpiexec "-n" "1" "/var/jenkins/workspace/adamantine-nightly/build/bin/test_integration_da_augmented"
38: Working Directory: /var/jenkins/workspace/adamantine-nightly/build/tests
38: Test timeout computed to be: 7200
38: Running 1 test case...
38: Entering test module "Integration_Data_Assimilation_Augmented"
38: /var/jenkins/workspace/adamantine-nightly/tests/test_integration_da_augmented.cc(19): Entering test case "integration_3D_data_assimilation_augmented"
38: Reading the experimental log file...
38: Done. Log entries found for 1 camera(s), with 2 frame(s).
38: Starting the main time stepping loop...
38: 10% completed
38: 20% completed
38: 30% completed
38: 40% completed
38: 50% completed
41: 70% completed
38: 60% completed
38: 70% completed
38: Performing data assimilation at time 0.04...
38: Rank: 0 | Old parameters for member 0: 0.413453 
38: Rank: 0 | Old parameters for member 1: 0.385362 
38: Rank: 0 | Old parameters for member 2: 0.446065 
38: Rank: 0 | Number expt sites mapped to DOFs: 2
38: Getting the perturbed innovation...
38: Applying the Kalman gain...
38: Updating the ensemble members...
38: Done.
38: Rank: 0 | New parameters for member 0: 0.121104 
38: Rank: 0 | New parameters for member 1: 0.142225 
38: Rank: 0 | New parameters for member 2: 0.107206 
38: 80% completed
38: 90% completed
38: 100% completed
38: /var/jenkins/workspace/adamantine-nightly/tests/test_integration_da_augmented.cc(19): Leaving test case "integration_3D_data_assimilation_augmented"; testing time: 46334660us
38: Leaving test module "Integration_Data_Assimilation_Augmented"; testing time: 46335008us
38: 
38: *** No errors detected
38: 
37/48 Test #38: test_integration_da_augmented_1 ..........   Passed   47.23 sec
test 39
      Start 39: test_integration_da_augmented_2

39: Test command: /usr/bin/mpiexec "-n" "2" "/var/jenkins/workspace/adamantine-nightly/build/bin/test_integration_da_augmented"
39: Working Directory: /var/jenkins/workspace/adamantine-nightly/build/tests
39: Test timeout computed to be: 7200
39: Running 1 test case...
39: Entering test module "Integration_Data_Assimilation_Augmented"
39: /var/jenkins/workspace/adamantine-nightly/tests/test_integration_da_augmented.cc(19): Entering test case "integration_3D_data_assimilation_augmented"
39: Running 1 test case...
39: Entering test module "Integration_Data_Assimilation_Augmented"
39: /var/jenkins/workspace/adamantine-nightly/tests/test_integration_da_augmented.cc(19): Entering test case "integration_3D_data_assimilation_augmented"
39: Reading the experimental log file...
39: Done. Log entries found for 1 camera(s), with 2 frame(s).
39: Starting the main time stepping loop...
39: 10% completed
39: 20% completed
39: 30% completed
39: Rank: 1 | Old parameters for member 2: 0.446065 
39: Rank: 1 | Number expt sites mapped to DOFs: 2
39: 40% completed
39: 50% completed
39: 60% completed
39: 70% completed
39: Performing data assimilation at time 0.04...
39: Rank: 0 | Old parameters for member 0: 0.413453 
39: Rank: 0 | Old parameters for member 1: 0.385362 
39: Rank: 0 | Number expt sites mapped to DOFs: 2
39: Getting the perturbed innovation...
39: Applying the Kalman gain...
39: Updating the ensemble members...
39: Rank: 1 | New parameters for member 2: 0.107206 
39: Done.
39: Rank: 0 | New parameters for member 0: 0.121104 
39: Rank: 0 | New parameters for member 1: 0.142225 
39: 80% completed
39: 90% completed
39: 100% completed
39: 
39: *** No errors detected
39: 
39: *** No errors detected
39: /var/jenkins/workspace/adamantine-nightly/tests/test_integration_da_augmented.cc(19): Leaving test case "integration_3D_data_assimilation_augmented"; testing time: 32042556us
39: Leaving test module "Integration_Data_Assimilation_Augmented"; testing time: 32042890us
39: /var/jenkins/workspace/adamantine-nightly/tests/test_integration_da_augmented.cc(19): Leaving test case "integration_3D_data_assimilation_augmented"; testing time: 32045215us
39: Leaving test module "Integration_Data_Assimilation_Augmented"; testing time: 32045579us
39: 
38/48 Test #39: test_integration_da_augmented_2 ..........   Passed   33.12 sec
test 40
      Start 40: test_integration_thermoelastic_1

40: Test command: /usr/bin/mpiexec "-n" "1" "/var/jenkins/workspace/adamantine-nightly/build/bin/test_integration_thermoelastic"
40: Working Directory: /var/jenkins/workspace/adamantine-nightly/build/tests
40: Test timeout computed to be: 7200
40: Running 2 test cases...
40: Entering test module "Integration_Thermoelastic"
40: /var/jenkins/workspace/adamantine-nightly/tests/test_integration_thermoelastic.cc(19): Entering test case "integration_thermoelastic"
41: 80% completed
41: 90% completed
41: 100% completed
41: /var/jenkins/workspace/adamantine-nightly/tests/test_integration_thermoelastic.cc(47): Leaving test case "integration_thermoelastic_add_material"; testing time: 829854896us
41: Leaving test module "Integration_Thermoelastic"; testing time: 2128353078us
41: 
41: *** No errors detected
41: /var/jenkins/workspace/adamantine-nightly/tests/test_integration_thermoelastic.cc(47): Leaving test case "integration_thermoelastic_add_material"; testing time: 829854652us
41: Leaving test module "Integration_Thermoelastic"; testing time: 2128352964us
41: 
41: *** No errors detected
41: 
40/48 Test #41: test_integration_thermoelastic_2 .........   Passed  2128.97 sec
test 42
      Start 42: test_material_deposition_1

42: Test command: /usr/bin/mpiexec "-n" "1" "/var/jenkins/workspace/adamantine-nightly/build/bin/test_material_deposition"
42: Working Directory: /var/jenkins/workspace/adamantine-nightly/build/tests
42: Test timeout computed to be: 7200
42: Running 11 test cases...
42: Entering test module "MaterialDeposition"
42: /var/jenkins/workspace/adamantine-nightly/tests/test_material_deposition.cc(50): Entering test case "read_material_deposition_file_2d"
42: /var/jenkins/workspace/adamantine-nightly/tests/test_material_deposition.cc(50): Leaving test case "read_material_deposition_file_2d"; testing time: 1921us
42: /var/jenkins/workspace/adamantine-nightly/tests/test_material_deposition.cc(92): Entering test case "read_material_deposition_file_3d"
42: /var/jenkins/workspace/adamantine-nightly/tests/test_material_deposition.cc(92): Leaving test case "read_material_deposition_file_3d"; testing time: 1628us
42: /var/jenkins/workspace/adamantine-nightly/tests/test_material_deposition.cc(134): Entering test case "get_elements_to_activate_2d"
42: /var/jenkins/workspace/adamantine-nightly/tests/test_material_deposition.cc(134): Leaving test case "get_elements_to_activate_2d"; testing time: 17194us
42: /var/jenkins/workspace/adamantine-nightly/tests/test_material_deposition.cc(195): Entering test case "get_elements_to_activate_3d"
42: /var/jenkins/workspace/adamantine-nightly/tests/test_material_deposition.cc(195): Leaving test case "get_elements_to_activate_3d"; testing time: 143400us
42: /var/jenkins/workspace/adamantine-nightly/tests/test_material_deposition.cc(262): Entering test case "material_deposition"
42: /var/jenkins/workspace/adamantine-nightly/tests/test_material_deposition.cc(262): Leaving test case "material_deposition"; testing time: 8620352us
42: /var/jenkins/workspace/adamantine-nightly/tests/test_material_deposition.cc(395): Entering test case "deposition_from_scan_path_2d"
42: /var/jenkins/workspace/adamantine-nightly/tests/test_material_deposition.cc(395): Leaving test case "deposition_from_scan_path_2d"; testing time: 670us
42: /var/jenkins/workspace/adamantine-nightly/tests/test_material_deposition.cc(445): Entering test case "deposition_from_scan_path_3d"
42: /var/jenkins/workspace/adamantine-nightly/tests/test_material_deposition.cc(445): Leaving test case "deposition_from_scan_path_3d"; testing time: 171us
42: /var/jenkins/workspace/adamantine-nightly/tests/test_material_deposition.cc(499): Entering test case "deposition_from_L_scan_path_3d"
42: /var/jenkins/workspace/adamantine-nightly/tests/test_material_deposition.cc(499): Leaving test case "deposition_from_L_scan_path_3d"; testing time: 2140us
42: /var/jenkins/workspace/adamantine-nightly/tests/test_material_deposition.cc(586): Entering test case "deposition_from_diagonal_scan_path_3d"
42: /var/jenkins/workspace/adamantine-nightly/tests/test_material_deposition.cc(586): Leaving test case "deposition_from_diagonal_scan_path_3d"; testing time: 996us
42: /var/jenkins/workspace/adamantine-nightly/tests/test_material_deposition.cc(640): Entering test case "merge_multiple_deposition_paths"
42: /var/jenkins/workspace/adamantine-nightly/tests/test_material_deposition.cc(640): Leaving test case "merge_multiple_deposition_paths"; testing time: 104us
42: /var/jenkins/workspace/adamantine-nightly/tests/test_material_deposition.cc(697): Entering test case "deposition_quaternion_straight_line"
42: /var/jenkins/workspace/adamantine-nightly/tests/test_material_deposition.cc(697): Leaving test case "deposition_quaternion_straight_line"; testing time: 2704us
42: Leaving test module "MaterialDeposition"; testing time: 8792959us
42: 
42: *** No errors detected
42: 
41/48 Test #42: test_material_deposition_1 ...............   Passed    9.35 sec
test 43
      Start 43: test_material_deposition_2

43: Test command: /usr/bin/mpiexec "-n" "2" "/var/jenkins/workspace/adamantine-nightly/build/bin/test_material_deposition"
43: Working Directory: /var/jenkins/workspace/adamantine-nightly/build/tests
43: Test timeout computed to be: 7200
43: Running 11 test cases...
43: Entering test module "MaterialDeposition"
43: /var/jenkins/workspace/adamantine-nightly/tests/test_material_deposition.cc(50): Entering test case "read_material_deposition_file_2d"
43: Running 11 test cases...
43: Entering test module "MaterialDeposition"
43: /var/jenkins/workspace/adamantine-nightly/tests/test_material_deposition.cc(50): Entering test case "read_material_deposition_file_2d"
43: /var/jenkins/workspace/adamantine-nightly/tests/test_material_deposition.cc(50): Leaving test case "read_material_deposition_file_2d"; testing time: 299us
43: /var/jenkins/workspace/adamantine-nightly/tests/test_material_deposition.cc(92): Entering test case "read_material_deposition_file_3d"
43: /var/jenkins/workspace/adamantine-nightly/tests/test_material_deposition.cc(92): Leaving test case "read_material_deposition_file_3d"; testing time: 192us
43: /var/jenkins/workspace/adamantine-nightly/tests/test_material_deposition.cc(134): Test case "get_elements_to_activate_2d" is skipped because precondition failed: the test only works in serial
43: /var/jenkins/workspace/adamantine-nightly/tests/test_material_deposition.cc(195): Test case "get_elements_to_activate_3d" is skipped because precondition failed: the test only works in serial
43: /var/jenkins/workspace/adamantine-nightly/tests/test_material_deposition.cc(262): Entering test case "material_deposition"
43: /var/jenkins/workspace/adamantine-nightly/tests/test_material_deposition.cc(50): Leaving test case "read_material_deposition_file_2d"; testing time: 403us
43: /var/jenkins/workspace/adamantine-nightly/tests/test_material_deposition.cc(92): Entering test case "read_material_deposition_file_3d"
43: /var/jenkins/workspace/adamantine-nightly/tests/test_material_deposition.cc(92): Leaving test case "read_material_deposition_file_3d"; testing time: 178us
43: /var/jenkins/workspace/adamantine-nightly/tests/test_material_deposition.cc(134): Test case "get_elements_to_activate_2d" is skipped because precondition failed: the test only works in serial
43: /var/jenkins/workspace/adamantine-nightly/tests/test_material_deposition.cc(195): Test case "get_elements_to_activate_3d" is skipped because precondition failed: the test only works in serial
43: /var/jenkins/workspace/adamantine-nightly/tests/test_material_deposition.cc(262): Entering test case "material_deposition"
43: /var/jenkins/workspace/adamantine-nightly/tests/test_material_deposition.cc(262): Leaving test case "material_deposition"; testing time: 5802073us
43: /var/jenkins/workspace/adamantine-nightly/tests/test_material_deposition.cc(395): Entering test case "deposition_from_scan_path_2d"
43: /var/jenkins/workspace/adamantine-nightly/tests/test_material_deposition.cc(395): Leaving test case "deposition_from_scan_path_2d"; testing time: 246us
43: /var/jenkins/workspace/adamantine-nightly/tests/test_material_deposition.cc(445): Entering test case "deposition_from_scan_path_3d"
43: /var/jenkins/workspace/adamantine-nightly/tests/test_material_deposition.cc(262): Leaving test case "material_deposition"; testing time: 5802444us
43: /var/jenkins/workspace/adamantine-nightly/tests/test_material_deposition.cc(395): Entering test case "deposition_from_scan_path_2d"
43: /var/jenkins/workspace/adamantine-nightly/tests/test_material_deposition.cc(445): Leaving test case "deposition_from_scan_path_3d"; testing time: 182us
43: /var/jenkins/workspace/adamantine-nightly/tests/test_material_deposition.cc(499): Entering test case "deposition_from_L_scan_path_3d"
43: /var/jenkins/workspace/adamantine-nightly/tests/test_material_deposition.cc(499): Leaving test case "deposition_from_L_scan_path_3d"; testing time: 205us
43: /var/jenkins/workspace/adamantine-nightly/tests/test_material_deposition.cc(586): Entering test case "deposition_from_diagonal_scan_path_3d"
43: /var/jenkins/workspace/adamantine-nightly/tests/test_material_deposition.cc(395): Leaving test case "deposition_from_scan_path_2d"; testing time: 303us
43: /var/jenkins/workspace/adamantine-nightly/tests/test_material_deposition.cc(445): Entering test case "deposition_from_scan_path_3d"
43: /var/jenkins/workspace/adamantine-nightly/tests/test_material_deposition.cc(586): Leaving test case "deposition_from_diagonal_scan_path_3d"; testing time: 166us
43: /var/jenkins/workspace/adamantine-nightly/tests/test_material_deposition.cc(640): Entering test case "merge_multiple_deposition_paths"
43: /var/jenkins/workspace/adamantine-nightly/tests/test_material_deposition.cc(445): Leaving test case "deposition_from_scan_path_3d"; testing time: 200us
43: /var/jenkins/workspace/adamantine-nightly/tests/test_material_deposition.cc(499): Entering test case "deposition_from_L_scan_path_3d"
43: /var/jenkins/workspace/adamantine-nightly/tests/test_material_deposition.cc(640): Leaving test case "merge_multiple_deposition_paths"; testing time: 107us
43: /var/jenkins/workspace/adamantine-nightly/tests/test_material_deposition.cc(697): Entering test case "deposition_quaternion_straight_line"
43: /var/jenkins/workspace/adamantine-nightly/tests/test_material_deposition.cc(499): Leaving test case "deposition_from_L_scan_path_3d"; testing time: 198us
43: /var/jenkins/workspace/adamantine-nightly/tests/test_material_deposition.cc(586): Entering test case "deposition_from_diagonal_scan_path_3d"
43: /var/jenkins/workspace/adamantine-nightly/tests/test_material_deposition.cc(586): Leaving test case "deposition_from_diagonal_scan_path_3d"; testing time: 163us
43: /var/jenkins/workspace/adamantine-nightly/tests/test_material_deposition.cc(640): Entering test case "merge_multiple_deposition_paths"
43: /var/jenkins/workspace/adamantine-nightly/tests/test_material_deposition.cc(697): Leaving test case "deposition_quaternion_straight_line"; testing time: 504us
43: Leaving test module "MaterialDeposition"; testing time: 5805658us
43: 
43: *** No errors detected
43: /var/jenkins/workspace/adamantine-nightly/tests/test_material_deposition.cc(640): Leaving test case "merge_multiple_deposition_paths"; testing time: 121us
43: /var/jenkins/workspace/adamantine-nightly/tests/test_material_deposition.cc(697): Entering test case "deposition_quaternion_straight_line"
43: /var/jenkins/workspace/adamantine-nightly/tests/test_material_deposition.cc(697): Leaving test case "deposition_quaternion_straight_line"; testing time: 511us
43: Leaving test module "MaterialDeposition"; testing time: 5806244us
43: 
43: *** No errors detected
43: 
42/48 Test #43: test_material_deposition_2 ...............   Passed    6.42 sec
test 44
      Start 44: test_microstructure_1

44: Test command: /usr/bin/mpiexec "-n" "1" "/var/jenkins/workspace/adamantine-nightly/build/bin/test_microstructure"
44: Working Directory: /var/jenkins/workspace/adamantine-nightly/build/tests
44: Test timeout computed to be: 7200
44: Running 1 test case...
44: Entering test module "MicroStructure"
44: /var/jenkins/workspace/adamantine-nightly/tests/test_microstructure.cc(53): Entering test case "G_and_R"
44: /var/jenkins/workspace/adamantine-nightly/tests/test_microstructure.cc(53): Leaving test case "G_and_R"; testing time: 28437us
44: Leaving test module "MicroStructure"; testing time: 28476us
44: 
44: *** No errors detected
44: 
43/48 Test #44: test_microstructure_1 ....................   Passed    0.59 sec
test 45
      Start 45: test_microstructure_2

45: Test command: /usr/bin/mpiexec "-n" "2" "/var/jenkins/workspace/adamantine-nightly/build/bin/test_microstructure"
45: Working Directory: /var/jenkins/workspace/adamantine-nightly/build/tests
45: Test timeout computed to be: 7200
45: Running 1 test case...
45: Entering test module "MicroStructure"
45: /var/jenkins/workspace/adamantine-nightly/tests/test_microstructure.cc(53): Entering test case "G_and_R"
45: Running 1 test case...
45: Entering test module "MicroStructure"
45: /var/jenkins/workspace/adamantine-nightly/tests/test_microstructure.cc(53): Entering test case "G_and_R"
45: Test case G_and_R did not check any assertions
45: /var/jenkins/workspace/adamantine-nightly/tests/test_microstructure.cc(53): Leaving test case "G_and_R"; testing time: 34610us
45: Leaving test module "MicroStructure"; testing time: 34682us
45: 
45: *** No errors detected
45: /var/jenkins/workspace/adamantine-nightly/tests/test_microstructure.cc(53): Leaving test case "G_and_R"; testing time: 35620us
45: Leaving test module "MicroStructure"; testing time: 35662us
45: 
45: *** No errors detected
45: 
44/48 Test #45: test_microstructure_2 ....................   Passed    0.65 sec
test 46
      Start 46: test_thermal_physics_1

46: Test command: /usr/bin/mpiexec "-n" "1" "/var/jenkins/workspace/adamantine-nightly/build/bin/test_thermal_physics"
46: Working Directory: /var/jenkins/workspace/adamantine-nightly/build/tests
46: Test timeout computed to be: 7200
46: Running 7 test cases...
46: Entering test module "ThermalPhysics"
46: /var/jenkins/workspace/adamantine-nightly/tests/test_thermal_physics.cc(15): Entering test case "thermal_2d_explicit_host"
46: /var/jenkins/workspace/adamantine-nightly/tests/test_thermal_physics.cc(15): Leaving test case "thermal_2d_explicit_host"; testing time: 32400us
46: /var/jenkins/workspace/adamantine-nightly/tests/test_thermal_physics.cc(28): Entering test case "thermal_2d_manufactured_solution_host"
46: /var/jenkins/workspace/adamantine-nightly/tests/test_thermal_physics.cc(28): Leaving test case "thermal_2d_manufactured_solution_host"; testing time: 16632us
46: /var/jenkins/workspace/adamantine-nightly/tests/test_thermal_physics.cc(33): Entering test case "initial_temperature_host"
46: /var/jenkins/workspace/adamantine-nightly/tests/test_thermal_physics.cc(33): Leaving test case "initial_temperature_host"; testing time: 5998us
46: /var/jenkins/workspace/adamantine-nightly/tests/test_thermal_physics.cc(38): Entering test case "energy_conservation_host"
46: /var/jenkins/workspace/adamantine-nightly/tests/test_thermal_physics.cc(38): Leaving test case "energy_conservation_host"; testing time: 2366008us
46: /var/jenkins/workspace/adamantine-nightly/tests/test_thermal_physics.cc(43): Entering test case "radiation_bcs_host"
46: /var/jenkins/workspace/adamantine-nightly/tests/test_thermal_physics.cc(43): Leaving test case "radiation_bcs_host"; testing time: 1082230us
46: /var/jenkins/workspace/adamantine-nightly/tests/test_thermal_physics.cc(48): Entering test case "convection_bcs_host"
46: /var/jenkins/workspace/adamantine-nightly/tests/test_thermal_physics.cc(48): Leaving test case "convection_bcs_host"; testing time: 31408541us
46: /var/jenkins/workspace/adamantine-nightly/tests/test_thermal_physics.cc(53): Entering test case "reference_temperature_host"
46: /var/jenkins/workspace/adamantine-nightly/tests/test_thermal_physics.cc(53): Leaving test case "reference_temperature_host"; testing time: 7928us
46: Leaving test module "ThermalPhysics"; testing time: 34920327us
46: 
46: *** No errors detected
46: 
45/48 Test #46: test_thermal_physics_1 ...................   Passed   35.48 sec
test 47
      Start 47: test_thermal_physics_2

47: Test command: /usr/bin/mpiexec "-n" "2" "/var/jenkins/workspace/adamantine-nightly/build/bin/test_thermal_physics"
47: Working Directory: /var/jenkins/workspace/adamantine-nightly/build/tests
47: Test timeout computed to be: 7200
47: Running 7 test cases...
47: Entering test module "ThermalPhysics"
47: /var/jenkins/workspace/adamantine-nightly/tests/test_thermal_physics.cc(15): Entering test case "thermal_2d_explicit_host"
47: Running 7 test cases...
47: Entering test module "ThermalPhysics"
47: /var/jenkins/workspace/adamantine-nightly/tests/test_thermal_physics.cc(15): Entering test case "thermal_2d_explicit_host"
47: /var/jenkins/workspace/adamantine-nightly/tests/test_thermal_physics.cc(15): Leaving test case "thermal_2d_explicit_host"; testing time: 39826us
47: /var/jenkins/workspace/adamantine-nightly/tests/test_thermal_physics.cc(28): Entering test case "thermal_2d_manufactured_solution_host"
47: /var/jenkins/workspace/adamantine-nightly/tests/test_thermal_physics.cc(15): Leaving test case "thermal_2d_explicit_host"; testing time: 39797us
47: /var/jenkins/workspace/adamantine-nightly/tests/test_thermal_physics.cc(28): Entering test case "thermal_2d_manufactured_solution_host"
47: /var/jenkins/workspace/adamantine-nightly/tests/test_thermal_physics.cc(28): Leaving test case "thermal_2d_manufactured_solution_host"; testing time: 14437us
47: /var/jenkins/workspace/adamantine-nightly/tests/test_thermal_physics.cc(33): Entering test case "initial_temperature_host"
47: /var/jenkins/workspace/adamantine-nightly/tests/test_thermal_physics.cc(28): Leaving test case "thermal_2d_manufactured_solution_host"; testing time: 14214us
47: /var/jenkins/workspace/adamantine-nightly/tests/test_thermal_physics.cc(33): Entering test case "initial_temperature_host"
47: /var/jenkins/workspace/adamantine-nightly/tests/test_thermal_physics.cc(33): Leaving test case "initial_temperature_host"; testing time: 6920us
47: /var/jenkins/workspace/adamantine-nightly/tests/test_thermal_physics.cc(38): Entering test case "energy_conservation_host"
47: /var/jenkins/workspace/adamantine-nightly/tests/test_thermal_physics.cc(33): Leaving test case "initial_temperature_host"; testing time: 6920us
47: /var/jenkins/workspace/adamantine-nightly/tests/test_thermal_physics.cc(38): Entering test case "energy_conservation_host"
47: /var/jenkins/workspace/adamantine-nightly/tests/test_thermal_physics.cc(38): Leaving test case "energy_conservation_host"; testing time: 1269464us
47: /var/jenkins/workspace/adamantine-nightly/tests/test_thermal_physics.cc(43): Entering test case "radiation_bcs_host"
47: /var/jenkins/workspace/adamantine-nightly/tests/test_thermal_physics.cc(38): Leaving test case "energy_conservation_host"; testing time: 1269721us
47: /var/jenkins/workspace/adamantine-nightly/tests/test_thermal_physics.cc(43): Entering test case "radiation_bcs_host"
47: /var/jenkins/workspace/adamantine-nightly/tests/test_thermal_physics.cc(43): Leaving test case "radiation_bcs_host"; testing time: 678213us
47: /var/jenkins/workspace/adamantine-nightly/tests/test_thermal_physics.cc(48): Entering test case "convection_bcs_host"
47: /var/jenkins/workspace/adamantine-nightly/tests/test_thermal_physics.cc(43): Leaving test case "radiation_bcs_host"; testing time: 678177us
47: /var/jenkins/workspace/adamantine-nightly/tests/test_thermal_physics.cc(48): Entering test case "convection_bcs_host"
47: /var/jenkins/workspace/adamantine-nightly/tests/test_thermal_physics.cc(48): Leaving test case "convection_bcs_host"; testing time: 15895885us
47: /var/jenkins/workspace/adamantine-nightly/tests/test_thermal_physics.cc(53): Entering test case "reference_temperature_host"
47: /var/jenkins/workspace/adamantine-nightly/tests/test_thermal_physics.cc(48): Leaving test case "convection_bcs_host"; testing time: 15895942us
47: /var/jenkins/workspace/adamantine-nightly/tests/test_thermal_physics.cc(53): Entering test case "reference_temperature_host"
47: /var/jenkins/workspace/adamantine-nightly/tests/test_thermal_physics.cc(53): Leaving test case "reference_temperature_host"; testing time: 8790us
47: Leaving test module "ThermalPhysics"; testing time: 17914188us
47: 
47: *** No errors detected
47: /var/jenkins/workspace/adamantine-nightly/tests/test_thermal_physics.cc(53): Leaving test case "reference_temperature_host"; testing time: 9927us
47: Leaving test module "ThermalPhysics"; testing time: 17915615us
47: 
47: *** No errors detected
47: 
46/48 Test #47: test_thermal_physics_2 ...................   Passed   18.53 sec
test 48
      Start 48: test_ensemble_management_1

48: Test command: /usr/bin/mpiexec "-n" "1" "/var/jenkins/workspace/adamantine-nightly/build/bin/test_ensemble_management"
48: Working Directory: /var/jenkins/workspace/adamantine-nightly/build/tests
48: Test timeout computed to be: 7200
48: Running 1 test case...
48: Entering test module "EnsembleManagement"
48: /var/jenkins/workspace/adamantine-nightly/tests/test_ensemble_management.cc(17): Entering test case "database_ensemble"
48: /var/jenkins/workspace/adamantine-nightly/tests/test_ensemble_management.cc(17): Leaving test case "database_ensemble"; testing time: 3777us
48: Leaving test module "EnsembleManagement"; testing time: 3804us
48: 
48: *** No errors detected
48: 
47/48 Test #48: test_ensemble_management_1 ...............   Passed    0.56 sec
test 49
      Start 49: test_ensemble_management_2

49: Test command: /usr/bin/mpiexec "-n" "2" "/var/jenkins/workspace/adamantine-nightly/build/bin/test_ensemble_management"
49: Working Directory: /var/jenkins/workspace/adamantine-nightly/build/tests
49: Test timeout computed to be: 7200
49: Running 1 test case...
49: Entering test module "EnsembleManagement"
49: /var/jenkins/workspace/adamantine-nightly/tests/test_ensemble_management.cc(17): Entering test case "database_ensemble"
49: Running 1 test case...
49: Entering test module "EnsembleManagement"
49: /var/jenkins/workspace/adamantine-nightly/tests/test_ensemble_management.cc(17): Entering test case "database_ensemble"
49: /var/jenkins/workspace/adamantine-nightly/tests/test_ensemble_management.cc(17): Leaving test case "database_ensemble"; testing time: 526us
49: Leaving test module "EnsembleManagement"; testing time: 568us
49: 
49: *** No errors detected
49: /var/jenkins/workspace/adamantine-nightly/tests/test_ensemble_management.cc(17): Leaving test case "database_ensemble"; testing time: 2110us
49: Leaving test module "EnsembleManagement"; testing time: 2138us
49: 
49: *** No errors detected
49: 
48/48 Test #49: test_ensemble_management_2 ...............   Passed    0.61 sec

The following tests passed:
	test_integration_da_1
	test_integration_da_2
	test_integration_da_3
	test_integration_da_6
	test_closest_source_point_adaptation_1
	test_closest_source_point_adaptation_2
	test_closest_source_point_adaptation_3
	test_closest_source_point_adaptation_6
	test_data_assimilator_1
	test_experimental_data_1
	test_geometry_1
	test_heat_source_1
	test_integration_3d_device_1
	test_material_property_1
	test_material_property_device_1
	test_mechanical_operator_1
	test_mechanical_physics_1
	test_post_processor_1
	test_quaternion_1
	test_scan_path_1
	test_thermal_operator_1
	test_thermal_operator_device_1
	test_thermal_physics_device_1
	test_timer_1
	test_utils_1
	test_validate_input_database_1
	test_integration_2d_1
	test_integration_2d_2
	test_integration_2d_device_1
	test_integration_2d_device_2
	test_integration_3d_1
	test_integration_3d_2
	test_integration_3d_amr_1
	test_integration_3d_amr_2
	test_integration_3d_amr_device_1
	test_integration_3d_amr_device_2
	test_integration_da_augmented_1
	test_integration_da_augmented_2
	test_integration_thermoelastic_1
	test_integration_thermoelastic_2
	test_material_deposition_1
	test_material_deposition_2
	test_microstructure_1
	test_microstructure_2
	test_thermal_physics_1
	test_thermal_physics_2
	test_ensemble_management_1
	test_ensemble_management_2

100% tests passed, 0 tests failed out of 48

Total Test time (real) = 14184.19 sec
[Pipeline] }
[Pipeline] // dir
Post stage
[Pipeline] xunit
INFO: Processing CTest-Version 3.x (default)
[Pipeline] }
[Pipeline] // withEnv
[Pipeline] }
$ docker stop --time=1 d6cb5f6397fa1664e043fbd816b73629cef08f77e632df88b49053486ed492fa
INFO: [CTest-Version 3.x (default)] - 1 test report file(s) were found with the pattern 'build/Testing/**/Test.xml' relative to '/var/jenkins/workspace/adamantine-nightly' for the testing framework 'CTest-Version 3.x (default)'.
$ docker rm -f --volumes d6cb5f6397fa1664e043fbd816b73629cef08f77e632df88b49053486ed492fa
[Pipeline] // withDockerContainer
[Pipeline] }
[Pipeline] // withEnv
[Pipeline] }
[Pipeline] // node
[Pipeline] }
[Pipeline] // stage
[Pipeline] }
40: 10% completed
40: 20% completed
40: 30% completed
40: 40% completed
40: 50% completed
40: 60% completed
40: 70% completed
waffle_03 seems to be removed or offline (java.lang.InterruptedException); will wait for 5 min 0 sec for it to come back online
waffle_03 is back online
waffle_03 seems to be removed or offline (java.lang.InterruptedException); will wait for 5 min 0 sec for it to come back online
40: 80% completed
waffle_03 is back online
waffle_03 seems to be removed or offline (java.io.IOException: Remote call on JNLP4-connect connection from 10.64.199.41/10.64.199.41:51438 failed); will wait for 5 min 0 sec for it to come back online
waffle_03 is back online
waffle_03 seems to be removed or offline (java.lang.InterruptedException); will wait for 5 min 0 sec for it to come back online
waffle_03 is back online
waffle_03 seems to be removed or offline (java.lang.InterruptedException); will wait for 5 min 0 sec for it to come back online
waffle_03 is back online
waffle_03 seems to be removed or offline (java.lang.InterruptedException); will wait for 5 min 0 sec for it to come back online
waffle_03 is back online
waffle_03 seems to be removed or offline (hudson.remoting.RequestAbortedException: java.nio.channels.ClosedChannelException); will wait for 5 min 0 sec for it to come back online
waffle_03 is back online
waffle_03 seems to be removed or offline (hudson.remoting.ChannelClosedException: Channel "hudson.remoting.Channel@316db5d9:JNLP4-connect connection from 10.64.199.41/10.64.199.41:51438": Remote call on JNLP4-connect connection from 10.64.199.41/10.64.199.41:51438 failed. The channel is closing down or has closed down); will wait for 5 min 0 sec for it to come back online
waffle_03 is back online
waffle_03 seems to be removed or offline (hudson.remoting.ChannelClosedException: Channel "hudson.remoting.Channel@316db5d9:JNLP4-connect connection from 10.64.199.41/10.64.199.41:51438": Remote call on JNLP4-connect connection from 10.64.199.41/10.64.199.41:51438 failed. The channel is closing down or has closed down); will wait for 5 min 0 sec for it to come back online
waffle_03 is back online
waffle_03 seems to be removed or offline (hudson.remoting.ChannelClosedException: Channel "hudson.remoting.Channel@316db5d9:JNLP4-connect connection from 10.64.199.41/10.64.199.41:51438": Remote call on JNLP4-connect connection from 10.64.199.41/10.64.199.41:51438 failed. The channel is closing down or has closed down); will wait for 5 min 0 sec for it to come back online
waffle_03 is back online
waffle_03 seems to be removed or offline (hudson.remoting.ChannelClosedException: Channel "hudson.remoting.Channel@316db5d9:JNLP4-connect connection from 10.64.199.41/10.64.199.41:51438": Remote call on JNLP4-connect connection from 10.64.199.41/10.64.199.41:51438 failed. The channel is closing down or has closed down); will wait for 5 min 0 sec for it to come back online
waffle_03 is back online
waffle_03 seems to be removed or offline (hudson.remoting.ChannelClosedException: Channel "hudson.remoting.Channel@316db5d9:JNLP4-connect connection from 10.64.199.41/10.64.199.41:51438": Remote call on JNLP4-connect connection from 10.64.199.41/10.64.199.41:51438 failed. The channel is closing down or has closed down); will wait for 5 min 0 sec for it to come back online
waffle_03 is back online
waffle_03 seems to be removed or offline (hudson.remoting.ChannelClosedException: Channel "hudson.remoting.Channel@316db5d9:JNLP4-connect connection from 10.64.199.41/10.64.199.41:51438": Remote call on JNLP4-connect connection from 10.64.199.41/10.64.199.41:51438 failed. The channel is closing down or has closed down); will wait for 5 min 0 sec for it to come back online
waffle_03 is back online
waffle_03 seems to be removed or offline (hudson.remoting.ChannelClosedException: Channel "hudson.remoting.Channel@316db5d9:JNLP4-connect connection from 10.64.199.41/10.64.199.41:51438": Remote call on JNLP4-connect connection from 10.64.199.41/10.64.199.41:51438 failed. The channel is closing down or has closed down); will wait for 5 min 0 sec for it to come back online
waffle_03 is back online
waffle_03 seems to be removed or offline (hudson.remoting.ChannelClosedException: Channel "hudson.remoting.Channel@316db5d9:JNLP4-connect connection from 10.64.199.41/10.64.199.41:51438": Remote call on JNLP4-connect connection from 10.64.199.41/10.64.199.41:51438 failed. The channel is closing down or has closed down); will wait for 5 min 0 sec for it to come back online
waffle_03 is back online
waffle_03 seems to be removed or offline (hudson.remoting.ChannelClosedException: Channel "hudson.remoting.Channel@316db5d9:JNLP4-connect connection from 10.64.199.41/10.64.199.41:51438": Remote call on JNLP4-connect connection from 10.64.199.41/10.64.199.41:51438 failed. The channel is closing down or has closed down); will wait for 5 min 0 sec for it to come back online
waffle_03 is back online
waffle_03 seems to be removed or offline (hudson.remoting.ChannelClosedException: Channel "hudson.remoting.Channel@316db5d9:JNLP4-connect connection from 10.64.199.41/10.64.199.41:51438": Remote call on JNLP4-connect connection from 10.64.199.41/10.64.199.41:51438 failed. The channel is closing down or has closed down); will wait for 5 min 0 sec for it to come back online
waffle_03 is back online
waffle_03 seems to be removed or offline (hudson.remoting.ChannelClosedException: Channel "hudson.remoting.Channel@316db5d9:JNLP4-connect connection from 10.64.199.41/10.64.199.41:51438": Remote call on JNLP4-connect connection from 10.64.199.41/10.64.199.41:51438 failed. The channel is closing down or has closed down); will wait for 5 min 0 sec for it to come back online
waffle_03 is back online
waffle_03 seems to be removed or offline (hudson.remoting.ChannelClosedException: Channel "hudson.remoting.Channel@316db5d9:JNLP4-connect connection from 10.64.199.41/10.64.199.41:51438": Remote call on JNLP4-connect connection from 10.64.199.41/10.64.199.41:51438 failed. The channel is closing down or has closed down); will wait for 5 min 0 sec for it to come back online
waffle_03 is back online
waffle_03 seems to be removed or offline (hudson.remoting.ChannelClosedException: Channel "hudson.remoting.Channel@316db5d9:JNLP4-connect connection from 10.64.199.41/10.64.199.41:51438": Remote call on JNLP4-connect connection from 10.64.199.41/10.64.199.41:51438 failed. The channel is closing down or has closed down); will wait for 5 min 0 sec for it to come back online
waffle_03 is back online
waffle_03 seems to be removed or offline (hudson.remoting.ChannelClosedException: Channel "hudson.remoting.Channel@316db5d9:JNLP4-connect connection from 10.64.199.41/10.64.199.41:51438": Remote call on JNLP4-connect connection from 10.64.199.41/10.64.199.41:51438 failed. The channel is closing down or has closed down); will wait for 5 min 0 sec for it to come back online
waffle_03 is back online
waffle_03 seems to be removed or offline (hudson.remoting.ChannelClosedException: Channel "hudson.remoting.Channel@316db5d9:JNLP4-connect connection from 10.64.199.41/10.64.199.41:51438": Remote call on JNLP4-connect connection from 10.64.199.41/10.64.199.41:51438 failed. The channel is closing down or has closed down); will wait for 5 min 0 sec for it to come back online
waffle_03 is back online
waffle_03 seems to be removed or offline (hudson.remoting.ChannelClosedException: Channel "hudson.remoting.Channel@316db5d9:JNLP4-connect connection from 10.64.199.41/10.64.199.41:51438": Remote call on JNLP4-connect connection from 10.64.199.41/10.64.199.41:51438 failed. The channel is closing down or has closed down); will wait for 5 min 0 sec for it to come back online
waffle_03 is back online
waffle_03 seems to be removed or offline (hudson.remoting.ChannelClosedException: Channel "hudson.remoting.Channel@316db5d9:JNLP4-connect connection from 10.64.199.41/10.64.199.41:51438": Remote call on JNLP4-connect connection from 10.64.199.41/10.64.199.41:51438 failed. The channel is closing down or has closed down); will wait for 5 min 0 sec for it to come back online
waffle_03 is back online
waffle_03 seems to be removed or offline (hudson.remoting.ChannelClosedException: Channel "hudson.remoting.Channel@316db5d9:JNLP4-connect connection from 10.64.199.41/10.64.199.41:51438": Remote call on JNLP4-connect connection from 10.64.199.41/10.64.199.41:51438 failed. The channel is closing down or has closed down); will wait for 5 min 0 sec for it to come back online
waffle_03 is back online
waffle_03 is back online
40: 80% completed
40: 90% completed
40: 100% completed
40: /var/jenkins/workspace/adamantine-nightly/tests/test_integration_thermoelastic.cc(19): Leaving test case "integration_thermoelastic"; testing time: 4001958738us
40: /var/jenkins/workspace/adamantine-nightly/tests/test_integration_thermoelastic.cc(47): Entering test case "integration_thermoelastic_add_material"
40: 10% completed
40: 20% completed
40: 30% completed
40: 40% completed
40: 50% completed
40: 60% completed
40: 70% completed
40: 80% completed
40: 90% completed
40: 100% completed
40: 
40: *** No errors detected
40: /var/jenkins/workspace/adamantine-nightly/tests/test_integration_thermoelastic.cc(47): Leaving test case "integration_thermoelastic_add_material"; testing time: 2537280542us
40: Leaving test module "Integration_Thermoelastic"; testing time: 6539240950us
40: 
39/48 Test #40: test_integration_thermoelastic_1 .........   Passed  6540.12 sec
test 41
      Start 41: test_integration_thermoelastic_2

41: Test command: /usr/bin/mpiexec "-n" "2" "/var/jenkins/workspace/adamantine-nightly/build/bin/test_integration_thermoelastic"
41: Working Directory: /var/jenkins/workspace/adamantine-nightly/build/tests
41: Test timeout computed to be: 7200
41: Running 2 test cases...
41: Entering test module "Integration_Thermoelastic"
41: /var/jenkins/workspace/adamantine-nightly/tests/test_integration_thermoelastic.cc(19): Entering test case "integration_thermoelastic"
41: Running 2 test cases...
41: Entering test module "Integration_Thermoelastic"
41: /var/jenkins/workspace/adamantine-nightly/tests/test_integration_thermoelastic.cc(19): Entering test case "integration_thermoelastic"
41: 10% completed
41: 20% completed
41: 30% completed
Cancelling nested steps due to timeout
Sending interrupt signal to process
Sending interrupt signal to process
Terminated
[Pipeline] }
[Pipeline] // dir
Post stage
[Pipeline] xunit
INFO: Processing CTest-Version 3.x (default)
Error when executing always post condition:
Also:   hudson.remoting.Channel$CallSiteStackTrace: Remote call to JNLP4-connect connection from 10.64.199.41/10.64.199.41:59816
		at hudson.remoting.Channel.attachCallSiteStackTrace(Channel.java:1916)
		at hudson.remoting.UserRequest$ExceptionResponse.retrieve(UserRequest.java:384)
		at hudson.remoting.Channel.call(Channel.java:1108)
		at hudson.FilePath.act(FilePath.java:1220)
		at hudson.FilePath.act(FilePath.java:1209)
		at PluginClassLoader for xunit//org.jenkinsci.plugins.xunit.XUnitProcessor.processTestsReport(XUnitProcessor.java:214)
		at PluginClassLoader for xunit//org.jenkinsci.plugins.xunit.XUnitProcessor.process(XUnitProcessor.java:163)
		at PluginClassLoader for xunit//org.jenkinsci.plugins.xunit.pipeline.XUnitResultsStepExecution.run(XUnitResultsStepExecution.java:94)
		at PluginClassLoader for xunit//org.jenkinsci.plugins.xunit.pipeline.XUnitResultsStepExecution.run(XUnitResultsStepExecution.java:53)
		at PluginClassLoader for workflow-step-api//org.jenkinsci.plugins.workflow.steps.SynchronousNonBlockingStepExecution.lambda$start$0(SynchronousNonBlockingStepExecution.java:49)
		at java.base/java.util.concurrent.Executors$RunnableAdapter.call(Unknown Source)
		at java.base/java.util.concurrent.FutureTask.run(Unknown Source)
		at java.base/java.util.concurrent.ThreadPoolExecutor.runWorker(Unknown Source)
		at java.base/java.util.concurrent.ThreadPoolExecutor$Worker.run(Unknown Source)
		at java.base/java.lang.Thread.run(Unknown Source)
Also:   org.jenkinsci.plugins.workflow.actions.ErrorAction$ErrorId: 5b9669f1-ddfa-4a18-8582-71c081a5404b
org.jenkinsci.plugins.xunit.service.NoTestFoundException: [CTest-Version 3.x (default)] - No test report file(s) were found with the pattern 'build/Testing/**/Test.xml' relative to '/var/jenkins/workspace/adamantine-nightly' for the testing framework 'CTest-Version 3.x (default)'.
Did you enter a pattern relative to (and within) the workspace directory?
Did you generate the result report(s) for 'CTest-Version 3.x (default)'?"
	at PluginClassLoader for xunit//org.jenkinsci.plugins.xunit.service.XUnitReportProcessorService.findReports(XUnitReportProcessorService.java:79)
	at PluginClassLoader for xunit//org.jenkinsci.plugins.xunit.service.XUnitTransformerCallable.invoke(XUnitTransformerCallable.java:87)
	at PluginClassLoader for xunit//org.jenkinsci.plugins.xunit.service.XUnitTransformerCallable.invoke(XUnitTransformerCallable.java:39)
	at Jenkins v2.568.3//hudson.FilePath$FileCallableWrapper.call(FilePath.java:3655)
	at hudson.remoting.UserRequest.perform(UserRequest.java:225)
	at hudson.remoting.UserRequest.perform(UserRequest.java:50)
	at hudson.remoting.Request$2.run(Request.java:391)
	at hudson.remoting.InterceptingExecutorService.lambda$wrap$0(InterceptingExecutorService.java:81)
	at java.base/java.util.concurrent.FutureTask.run(FutureTask.java:317)
	at java.base/java.util.concurrent.ThreadPoolExecutor.runWorker(ThreadPoolExecutor.java:1144)
	at java.base/java.util.concurrent.ThreadPoolExecutor$Worker.run(ThreadPoolExecutor.java:642)
	at hudson.remoting.Engine$1.lambda$newThread$0(Engine.java:312)
	at java.base/java.lang.Thread.run(Thread.java:1583)

[Pipeline] }
[Pipeline] // withEnv
[Pipeline] }
$ docker stop --time=1 8ac7d632724dfad14d2342a850a898a644462e1bbcb8854e6bb973d974e8c088
$ docker rm -f --volumes 8ac7d632724dfad14d2342a850a898a644462e1bbcb8854e6bb973d974e8c088
[Pipeline] // withDockerContainer
[Pipeline] }
[Pipeline] // withEnv
[Pipeline] }
[Pipeline] // node
[Pipeline] }
[Pipeline] // stage
[Pipeline] }
Failed in branch CUDA
[Pipeline] // parallel
[Pipeline] }
[Pipeline] // stage
[Pipeline] }
[Pipeline] // timeout
[Pipeline] }
[Pipeline] // withEnv
[Pipeline] End of Pipeline
Timeout has been exceeded
org.jenkinsci.plugins.workflow.actions.ErrorAction$ErrorId: f05353e4-8c14-4bbc-8a9e-63436be62ee1
Finished: ABORTED