Skip to content
Skipping 40 KB.. Full Log
[ 21%] Copying HourGlass_AOP_scan_path.txt
[ 21%] Built target _var_jenkins_workspace_adamantine-nightly_build_bin_HourGlass_AOP_scan_path.txt
[ 22%] Copying integration_2d.info
[ 22%] Built target _var_jenkins_workspace_adamantine-nightly_build_bin_integration_2d.info
[ 22%] Copying integration_2d_ensemble.info
[ 22%] Built target _var_jenkins_workspace_adamantine-nightly_build_bin_integration_2d_ensemble.info
[ 23%] Copying integration_2d_gold.txt
[ 23%] Built target _var_jenkins_workspace_adamantine-nightly_build_bin_integration_2d_gold.txt
[ 23%] Copying integration_2d_units.info
[ 23%] Built target _var_jenkins_workspace_adamantine-nightly_build_bin_integration_2d_units.info
[ 24%] Copying integration_3d_gold.txt
[ 24%] Built target _var_jenkins_workspace_adamantine-nightly_build_bin_integration_3d_gold.txt
[ 25%] Copying integration_3d_gold_0.txt
[ 25%] Built target _var_jenkins_workspace_adamantine-nightly_build_bin_integration_3d_gold_0.txt
[ 25%] Copying integration_3d_gold_1.txt
[ 25%] Built target _var_jenkins_workspace_adamantine-nightly_build_bin_integration_3d_gold_1.txt
[ 26%] Copying integration_3d_gold_five_axis.txt
[ 26%] Built target _var_jenkins_workspace_adamantine-nightly_build_bin_integration_3d_gold_five_axis.txt
[ 26%] Copying integration_3d_gold_five_axis_0.txt
[ 26%] Built target _var_jenkins_workspace_adamantine-nightly_build_bin_integration_3d_gold_five_axis_0.txt
[ 27%] Copying integration_3d_gold_five_axis_1.txt
[ 27%] Built target _var_jenkins_workspace_adamantine-nightly_build_bin_integration_3d_gold_five_axis_1.txt
[ 28%] Copying integration_3d_gold_short.txt
[ 28%] Built target _var_jenkins_workspace_adamantine-nightly_build_bin_integration_3d_gold_short.txt
[ 28%] Copying integration_3d_gold_short_0.txt
[ 28%] Built target _var_jenkins_workspace_adamantine-nightly_build_bin_integration_3d_gold_short_0.txt
[ 29%] Copying integration_3d_gold_short_1.txt
[ 29%] Built target _var_jenkins_workspace_adamantine-nightly_build_bin_integration_3d_gold_short_1.txt
[ 29%] Copying integration_da_add_material.info
[ 29%] Built target _var_jenkins_workspace_adamantine-nightly_build_bin_integration_da_add_material.info
[ 30%] Copying integration_da_add_material_expt_log.txt
[ 30%] Built target _var_jenkins_workspace_adamantine-nightly_build_bin_integration_da_add_material_expt_log.txt
[ 31%] Copying integration_da_add_material_expt_pc_0_0.csv
[ 31%] Built target _var_jenkins_workspace_adamantine-nightly_build_bin_integration_da_add_material_expt_pc_0_0.csv
[ 31%] Copying integration_da_add_material_expt_ray_0_0.csv
[ 31%] Built target _var_jenkins_workspace_adamantine-nightly_build_bin_integration_da_add_material_expt_ray_0_0.csv
[ 32%] Copying integration_da_add_material_sp.txt
[ 32%] Built target _var_jenkins_workspace_adamantine-nightly_build_bin_integration_da_add_material_sp.txt
[ 32%] Copying material_deposition_2d.txt
[ 32%] Built target _var_jenkins_workspace_adamantine-nightly_build_bin_material_deposition_2d.txt
[ 33%] Copying material_deposition_3d.txt
[ 33%] Built target _var_jenkins_workspace_adamantine-nightly_build_bin_material_deposition_3d.txt
[ 34%] Copying material_path_test_material_deposition.txt
[ 34%] Built target _var_jenkins_workspace_adamantine-nightly_build_bin_material_path_test_material_deposition.txt
[ 34%] Copying material_property_polynomial.info
[ 34%] Built target _var_jenkins_workspace_adamantine-nightly_build_bin_material_property_polynomial.info
[ 35%] Copying material_property_table.info
[ 35%] Built target _var_jenkins_workspace_adamantine-nightly_build_bin_material_property_table.info
[ 35%] Copying microstructure_G_R_gold_1.txt
[ 35%] Built target _var_jenkins_workspace_adamantine-nightly_build_bin_microstructure_G_R_gold_1.txt
[ 36%] Copying microstructure_G_R_gold_2.txt
[ 36%] Built target _var_jenkins_workspace_adamantine-nightly_build_bin_microstructure_G_R_gold_2.txt
[ 36%] Copying rays_cam-0-0_test_full.csv
[ 36%] Built target _var_jenkins_workspace_adamantine-nightly_build_bin_rays_cam-0-0_test_full.csv
[ 37%] Copying raytracing_experimental_data_0_0.csv
[ 37%] Building CXX object source/CMakeFiles/Adamantine.dir/MaterialPropertyInstDev.cc.o
[ 37%] Built target _var_jenkins_workspace_adamantine-nightly_build_bin_raytracing_experimental_data_0_0.csv
[ 38%] Copying raytracing_non_AA_cells-0-0.csv
[ 38%] Built target _var_jenkins_workspace_adamantine-nightly_build_bin_raytracing_non_AA_cells-0-0.csv
[ 38%] Copying scan_path.txt
[ 38%] Built target _var_jenkins_workspace_adamantine-nightly_build_bin_scan_path.txt
[ 39%] Copying scan_path_5_axis.txt
[ 39%] Built target _var_jenkins_workspace_adamantine-nightly_build_bin_scan_path_5_axis.txt
[ 40%] Copying scan_path_arcs.txt
[ 40%] Built target _var_jenkins_workspace_adamantine-nightly_build_bin_scan_path_arcs.txt
[ 41%] Copying scan_path_diagonal.txt
[ 41%] Built target _var_jenkins_workspace_adamantine-nightly_build_bin_scan_path_diagonal.txt
[ 41%] Copying scan_path_event_series.inp
[ 41%] Built target _var_jenkins_workspace_adamantine-nightly_build_bin_scan_path_event_series.inp
[ 41%] Copying scan_path_L.txt
[ 41%] Built target _var_jenkins_workspace_adamantine-nightly_build_bin_scan_path_L.txt
[ 42%] Copying scan_path_layers.txt
[ 42%] Built target _var_jenkins_workspace_adamantine-nightly_build_bin_scan_path_layers.txt
[ 42%] Copying scan_path_test_thermal_physics.txt
[ 42%] Built target _var_jenkins_workspace_adamantine-nightly_build_bin_scan_path_test_thermal_physics.txt
[ 43%] Building CXX object source/CMakeFiles/Adamantine.dir/MaterialPropertyInstHost.cc.o
[ 43%] Building CXX object source/CMakeFiles/Adamantine.dir/MechanicalOperator.cc.o
[ 33%] Building CXX object source/CMakeFiles/Adamantine.dir/ThermalPhysicsInstSDev.cc.o
[ 44%] Building CXX object source/CMakeFiles/Adamantine.dir/MechanicalPhysics.cc.o
[ 45%] Building CXX object source/CMakeFiles/Adamantine.dir/Microstructure.cc.o
[ 45%] Building CXX object source/CMakeFiles/Adamantine.dir/PointCloud.cc.o
[ 46%] Building CXX object source/CMakeFiles/Adamantine.dir/PostProcessor.cc.o
[ 46%] Building CXX object source/CMakeFiles/Adamantine.dir/Quaternion.cc.o
[ 47%] Building CXX object source/CMakeFiles/Adamantine.dir/RayTracing.cc.o
[ 48%] Building CXX object source/CMakeFiles/Adamantine.dir/ScanPath.cc.o
[ 33%] Building CXX object source/CMakeFiles/Adamantine.dir/ThermalPhysicsInstSLDev.cc.o
[ 48%] Building CXX object source/CMakeFiles/Adamantine.dir/ThermalOperatorInstSHost.cc.o
[ 49%] Building CXX object source/CMakeFiles/Adamantine.dir/ThermalOperatorInstSLHost.cc.o
[ 49%] Building CXX object source/CMakeFiles/Adamantine.dir/ThermalOperatorInstSLPHost.cc.o
In file included from /var/jenkins/workspace/adamantine-nightly/source/MechanicalOperator.cc:6:
/var/jenkins/workspace/adamantine-nightly/source/instantiation.hh:54:44: fatal error: error writing to /tmp/ccf65OKM.s: No space left on device
   54 |               dealii::MemorySpace::Default>;
      |                                            ^
/usr/include/boost/preprocessor/seq/for_each_product.hpp:62:71: note: in expansion of macro 'ADAMANTINE_D_N_P_M_DEV'
   62 | # define BOOST_PP_SEQ_FOR_EACH_PRODUCT_I_I(r, cset, rset, res, macro) macro(r, BOOST_PP_SEQ_TAIL(res (BOOST_PP_SEQ_HEAD(cset))))
      |                                                                       ^~~~~
/var/jenkins/workspace/adamantine-nightly/source/MechanicalOperator.cc:488:1: note: in expansion of macro 'INSTANTIATE_DIM_NMAT_PORDER_MATERIALSTATES_DEVICE'
  488 | INSTANTIATE_DIM_NMAT_PORDER_MATERIALSTATES_DEVICE(MechanicalOperator)
      | ^~~~~~~~~~~~~~~~~~~~~~~~~~~~~~~~~~~~~~~~~~~~~~~~~
compilation terminated.
make[2]: *** [source/CMakeFiles/Adamantine.dir/build.make:202: source/CMakeFiles/Adamantine.dir/MechanicalOperator.cc.o] Error 1
make[2]: *** Waiting for unfinished jobs....
[ 50%] Copying scan_path_units.txt
[ 50%] Built target _var_jenkins_workspace_adamantine-nightly_build_bin_scan_path_units.txt
[ 50%] Copying Simple_3D_ring.stl
[ 50%] Built target _var_jenkins_workspace_adamantine-nightly_build_bin_Simple_3D_ring.stl
[ 51%] Copying thermoelastic_bare_plate.info
[ 51%] Built target _var_jenkins_workspace_adamantine-nightly_build_bin_thermoelastic_bare_plate.info
[ 51%] Copying thermoelastic_bare_plate_add_material_scan_path.txt
[ 51%] Built target _var_jenkins_workspace_adamantine-nightly_build_bin_thermoelastic_bare_plate_add_material_scan_path.txt
[ 52%] Copying thermoelastic_bare_plate_scan_path.txt
[ 52%] Built target _var_jenkins_workspace_adamantine-nightly_build_bin_thermoelastic_bare_plate_scan_path.txt
[ 52%] Copying within_stl_gold.txt
[ 52%] Built target _var_jenkins_workspace_adamantine-nightly_build_bin_within_stl_gold.txt
/var/jenkins/workspace/adamantine-nightly/source/RayTracing.cc:418:1: fatal error: error writing to /tmp/ccQYneeD.s: No space left on device
  418 | } // namespace adamantine
      | ^
compilation terminated.
make[2]: *** [source/CMakeFiles/Adamantine.dir/build.make:286: source/CMakeFiles/Adamantine.dir/RayTracing.cc.o] Error 1
In file included from /var/jenkins/workspace/adamantine-nightly/source/MaterialPropertyInstDev.cc:6:
/var/jenkins/workspace/adamantine-nightly/source/instantiation.hh:54:44: fatal error: error writing to /tmp/ccl7fIOt.s: No space left on device
   54 |               dealii::MemorySpace::Default>;
      |                                            ^
/usr/include/boost/preprocessor/seq/for_each_product.hpp:62:71: note: in expansion of macro 'ADAMANTINE_D_N_P_M_DEV'
   62 | # define BOOST_PP_SEQ_FOR_EACH_PRODUCT_I_I(r, cset, rset, res, macro) macro(r, BOOST_PP_SEQ_TAIL(res (BOOST_PP_SEQ_HEAD(cset))))
      |                                                                       ^~~~~
/var/jenkins/workspace/adamantine-nightly/source/MaterialPropertyInstDev.cc:8:1: note: in expansion of macro 'INSTANTIATE_DIM_NMAT_PORDER_MATERIALSTATES_DEVICE'
    8 | INSTANTIATE_DIM_NMAT_PORDER_MATERIALSTATES_DEVICE(MaterialProperty)
      | ^~~~~~~~~~~~~~~~~~~~~~~~~~~~~~~~~~~~~~~~~~~~~~~~~
compilation terminated.
make[2]: *** [source/CMakeFiles/Adamantine.dir/build.make:174: source/CMakeFiles/Adamantine.dir/MaterialPropertyInstDev.cc.o] Error 1
In file included from /var/jenkins/workspace/adamantine-nightly/source/MaterialPropertyInstHost.cc:6:
/var/jenkins/workspace/adamantine-nightly/source/instantiation.hh:37:41: fatal error: error writing to /tmp/ccBntbra.s: No space left on device
   37 |               dealii::MemorySpace::Host>;
      |                                         ^
/usr/include/boost/preprocessor/seq/for_each_product.hpp:62:71: note: in expansion of macro 'ADAMANTINE_D_N_P_M_HOST'
   62 | # define BOOST_PP_SEQ_FOR_EACH_PRODUCT_I_I(r, cset, rset, res, macro) macro(r, BOOST_PP_SEQ_TAIL(res (BOOST_PP_SEQ_HEAD(cset))))
      |                                                                       ^~~~~
/var/jenkins/workspace/adamantine-nightly/source/MaterialPropertyInstHost.cc:8:1: note: in expansion of macro 'INSTANTIATE_DIM_NMAT_PORDER_MATERIALSTATES_HOST'
    8 | INSTANTIATE_DIM_NMAT_PORDER_MATERIALSTATES_HOST(MaterialProperty)
      | ^~~~~~~~~~~~~~~~~~~~~~~~~~~~~~~~~~~~~~~~~~~~~~~
compilation terminated.
make[2]: *** [source/CMakeFiles/Adamantine.dir/build.make:188: source/CMakeFiles/Adamantine.dir/MaterialPropertyInstHost.cc.o] Error 1
In file included from /var/jenkins/workspace/adamantine-nightly/source/MechanicalPhysics.cc:6:
/var/jenkins/workspace/adamantine-nightly/source/instantiation.hh:54:44: fatal error: error writing to /tmp/cczW4Rin.s: No space left on device
   54 |               dealii::MemorySpace::Default>;
      |                                            ^
/usr/include/boost/preprocessor/seq/for_each_product.hpp:62:71: note: in expansion of macro 'ADAMANTINE_D_N_P_M_DEV'
   62 | # define BOOST_PP_SEQ_FOR_EACH_PRODUCT_I_I(r, cset, rset, res, macro) macro(r, BOOST_PP_SEQ_TAIL(res (BOOST_PP_SEQ_HEAD(cset))))
      |                                                                       ^~~~~
/var/jenkins/workspace/adamantine-nightly/source/MechanicalPhysics.cc:729:1: note: in expansion of macro 'INSTANTIATE_DIM_NMAT_PORDER_MATERIALSTATES_DEVICE'
  729 | INSTANTIATE_DIM_NMAT_PORDER_MATERIALSTATES_DEVICE(MechanicalPhysics)
      | ^~~~~~~~~~~~~~~~~~~~~~~~~~~~~~~~~~~~~~~~~~~~~~~~~
compilation terminated.
make[2]: *** [source/CMakeFiles/Adamantine.dir/build.make:216: source/CMakeFiles/Adamantine.dir/MechanicalPhysics.cc.o] Error 1
[ 34%] Building CXX object source/CMakeFiles/Adamantine.dir/ThermalPhysicsInstSLPDev.cc.o
[ 35%] Building CXX object source/CMakeFiles/Adamantine.dir/ThermalPhysicsInstSHost.cc.o
In file included from /var/jenkins/workspace/adamantine-nightly/source/ThermalOperatorInstSHost.cc:6:
/var/jenkins/workspace/adamantine-nightly/source/instantiation.hh:74:41: fatal error: error writing to /tmp/ccAcfVYq.s: No space left on device
   74 |               dealii::MemorySpace::Host>;
      |                                         ^
/usr/include/boost/preprocessor/seq/for_each_product.hpp:62:71: note: in expansion of macro 'ADAMANTINE_D_N_U_P_F_S_HOST'
   62 | # define BOOST_PP_SEQ_FOR_EACH_PRODUCT_I_I(r, cset, rset, res, macro) macro(r, BOOST_PP_SEQ_TAIL(res (BOOST_PP_SEQ_HEAD(cset))))
      |                                                                       ^~~~~
/var/jenkins/workspace/adamantine-nightly/source/ThermalOperatorInstSHost.cc:8:1: note: in expansion of macro 'INSTANTIATE_DIM_NMAT_USETABLE_PORDER_FEDEGREE_S_HOST'
    8 | INSTANTIATE_DIM_NMAT_USETABLE_PORDER_FEDEGREE_S_HOST(ThermalOperator)
      | ^~~~~~~~~~~~~~~~~~~~~~~~~~~~~~~~~~~~~~~~~~~~~~~~~~~~
compilation terminated.
make[2]: *** [source/CMakeFiles/Adamantine.dir/build.make:314: source/CMakeFiles/Adamantine.dir/ThermalOperatorInstSHost.cc.o] Error 1
[ 35%] Building CXX object source/CMakeFiles/Adamantine.dir/ThermalPhysicsInstSLHost.cc.o
In file included from /var/jenkins/workspace/adamantine-nightly/source/ThermalOperatorInstSLHost.cc:6:
/var/jenkins/workspace/adamantine-nightly/source/instantiation.hh:94:41: fatal error: error writing to /tmp/ccnx9aQV.s: No space left on device
   94 |               dealii::MemorySpace::Host>;
      |                                         ^
/usr/include/boost/preprocessor/seq/for_each_product.hpp:62:71: note: in expansion of macro 'ADAMANTINE_D_N_U_P_F_SL_HOST'
   62 | # define BOOST_PP_SEQ_FOR_EACH_PRODUCT_I_I(r, cset, rset, res, macro) macro(r, BOOST_PP_SEQ_TAIL(res (BOOST_PP_SEQ_HEAD(cset))))
      |                                                                       ^~~~~
/var/jenkins/workspace/adamantine-nightly/source/ThermalOperatorInstSLHost.cc:8:1: note: in expansion of macro 'INSTANTIATE_DIM_NMAT_USETABLE_PORDER_FEDEGREE_SL_HOST'
    8 | INSTANTIATE_DIM_NMAT_USETABLE_PORDER_FEDEGREE_SL_HOST(ThermalOperator)
      | ^~~~~~~~~~~~~~~~~~~~~~~~~~~~~~~~~~~~~~~~~~~~~~~~~~~~~
compilation terminated.
make[2]: *** [source/CMakeFiles/Adamantine.dir/build.make:328: source/CMakeFiles/Adamantine.dir/ThermalOperatorInstSLHost.cc.o] Error 1
In file included from /var/jenkins/workspace/adamantine-nightly/source/ThermalOperatorInstSLPHost.cc:6:
/var/jenkins/workspace/adamantine-nightly/source/instantiation.hh:114:41: fatal error: error writing to /tmp/ccH0oW0C.s: No space left on device
  114 |               dealii::MemorySpace::Host>;
      |                                         ^
/usr/include/boost/preprocessor/seq/for_each_product.hpp:62:71: note: in expansion of macro 'ADAMANTINE_D_N_U_P_F_SLP_HOST'
   62 | # define BOOST_PP_SEQ_FOR_EACH_PRODUCT_I_I(r, cset, rset, res, macro) macro(r, BOOST_PP_SEQ_TAIL(res (BOOST_PP_SEQ_HEAD(cset))))
      |                                                                       ^~~~~
/var/jenkins/workspace/adamantine-nightly/source/ThermalOperatorInstSLPHost.cc:8:1: note: in expansion of macro 'INSTANTIATE_DIM_NMAT_USETABLE_PORDER_FEDEGREE_SLP_HOST'
    8 | INSTANTIATE_DIM_NMAT_USETABLE_PORDER_FEDEGREE_SLP_HOST(ThermalOperator)
      | ^~~~~~~~~~~~~~~~~~~~~~~~~~~~~~~~~~~~~~~~~~~~~~~~~~~~~~
compilation terminated.
make[2]: *** [source/CMakeFiles/Adamantine.dir/build.make:342: source/CMakeFiles/Adamantine.dir/ThermalOperatorInstSLPHost.cc.o] Error 1
make[1]: *** [CMakeFiles/Makefile2:1143: source/CMakeFiles/Adamantine.dir/all] Error 2
make: *** [Makefile:146: all] Error 2
[Pipeline] }
[Pipeline] // dir
Post stage
[Pipeline] xunit
INFO: Processing CTest-Version 3.x (default)
Error when executing always post condition:
Also:   hudson.remoting.Channel$CallSiteStackTrace: Remote call to JNLP4-connect connection from 10.64.200.57/10.64.200.57:36222
		at hudson.remoting.Channel.attachCallSiteStackTrace(Channel.java:1916)
		at hudson.remoting.UserRequest$ExceptionResponse.retrieve(UserRequest.java:384)
		at hudson.remoting.Channel.call(Channel.java:1108)
		at hudson.FilePath.act(FilePath.java:1220)
		at hudson.FilePath.act(FilePath.java:1209)
		at PluginClassLoader for xunit//org.jenkinsci.plugins.xunit.XUnitProcessor.processTestsReport(XUnitProcessor.java:214)
		at PluginClassLoader for xunit//org.jenkinsci.plugins.xunit.XUnitProcessor.process(XUnitProcessor.java:163)
		at PluginClassLoader for xunit//org.jenkinsci.plugins.xunit.pipeline.XUnitResultsStepExecution.run(XUnitResultsStepExecution.java:94)
		at PluginClassLoader for xunit//org.jenkinsci.plugins.xunit.pipeline.XUnitResultsStepExecution.run(XUnitResultsStepExecution.java:53)
		at PluginClassLoader for workflow-step-api//org.jenkinsci.plugins.workflow.steps.SynchronousNonBlockingStepExecution.lambda$start$0(SynchronousNonBlockingStepExecution.java:49)
		at java.base/java.util.concurrent.Executors$RunnableAdapter.call(Unknown Source)
		at java.base/java.util.concurrent.FutureTask.run(Unknown Source)
		at java.base/java.util.concurrent.ThreadPoolExecutor.runWorker(Unknown Source)
		at java.base/java.util.concurrent.ThreadPoolExecutor$Worker.run(Unknown Source)
		at java.base/java.lang.Thread.run(Unknown Source)
Also:   org.jenkinsci.plugins.workflow.actions.ErrorAction$ErrorId: 6fbcee63-d0b1-494a-b18b-2d0f2aba4dc0
org.jenkinsci.plugins.xunit.service.NoTestFoundException: [CTest-Version 3.x (default)] - No test report file(s) were found with the pattern 'build/Testing/**/Test.xml' relative to '/var/jenkins/workspace/adamantine-nightly' for the testing framework 'CTest-Version 3.x (default)'.
Did you enter a pattern relative to (and within) the workspace directory?
Did you generate the result report(s) for 'CTest-Version 3.x (default)'?"
	at PluginClassLoader for xunit//org.jenkinsci.plugins.xunit.service.XUnitReportProcessorService.findReports(XUnitReportProcessorService.java:79)
	at PluginClassLoader for xunit//org.jenkinsci.plugins.xunit.service.XUnitTransformerCallable.invoke(XUnitTransformerCallable.java:87)
	at PluginClassLoader for xunit//org.jenkinsci.plugins.xunit.service.XUnitTransformerCallable.invoke(XUnitTransformerCallable.java:39)
	at Jenkins v2.568.3//hudson.FilePath$FileCallableWrapper.call(FilePath.java:3655)
	at hudson.remoting.UserRequest.perform(UserRequest.java:225)
	at hudson.remoting.UserRequest.perform(UserRequest.java:50)
	at hudson.remoting.Request$2.run(Request.java:391)
	at hudson.remoting.InterceptingExecutorService.lambda$wrap$0(InterceptingExecutorService.java:81)
	at java.base/java.util.concurrent.FutureTask.run(FutureTask.java:317)
	at java.base/java.util.concurrent.ThreadPoolExecutor.runWorker(ThreadPoolExecutor.java:1144)
	at java.base/java.util.concurrent.ThreadPoolExecutor$Worker.run(ThreadPoolExecutor.java:642)
	at hudson.remoting.Engine$1.lambda$newThread$0(Engine.java:312)
	at java.base/java.lang.Thread.run(Thread.java:1583)

[Pipeline] }
[Pipeline] // withEnv
[Pipeline] }
$ docker stop --time=1 cac9fc351e34acf61085e5a0748765e501edc9fe3516199d9c087dd544b2e20f
$ docker rm -f --volumes cac9fc351e34acf61085e5a0748765e501edc9fe3516199d9c087dd544b2e20f
[Pipeline] // withDockerContainer
[Pipeline] }
[Pipeline] // withEnv
[Pipeline] }
[Pipeline] // node
[Pipeline] }
[Pipeline] // stage
[Pipeline] }
Failed in branch CPU
[ 36%] Building CXX object source/CMakeFiles/Adamantine.dir/ThermalPhysicsInstSLPHost.cc.o
[ 36%] Building CXX object source/CMakeFiles/Adamantine.dir/Timer.cc.o
[ 37%] Building CXX object source/CMakeFiles/Adamantine.dir/ensemble_management.cc.o
[ 38%] Building CXX object source/CMakeFiles/Adamantine.dir/experimental_data_utils.cc.o
[ 38%] Building CXX object source/CMakeFiles/Adamantine.dir/material_deposition.cc.o
[ 39%] Building CXX object source/CMakeFiles/Adamantine.dir/validate_input_database.cc.o
[ 39%] Copying integration_2d_units.info
[ 39%] Built target _var_jenkins_workspace_adamantine-nightly_build_bin_integration_2d_units.info
[ 40%] Copying integration_3d_gold.txt
[ 40%] Built target _var_jenkins_workspace_adamantine-nightly_build_bin_integration_3d_gold.txt
[ 41%] Copying integration_3d_gold_0.txt
[ 41%] Built target _var_jenkins_workspace_adamantine-nightly_build_bin_integration_3d_gold_0.txt
[ 41%] Copying integration_3d_gold_1.txt
[ 41%] Built target _var_jenkins_workspace_adamantine-nightly_build_bin_integration_3d_gold_1.txt
[ 42%] Copying integration_3d_gold_five_axis.txt
[ 42%] Built target _var_jenkins_workspace_adamantine-nightly_build_bin_integration_3d_gold_five_axis.txt
[ 42%] Copying integration_3d_gold_five_axis_0.txt
[ 42%] Built target _var_jenkins_workspace_adamantine-nightly_build_bin_integration_3d_gold_five_axis_0.txt
[ 43%] Copying integration_3d_gold_five_axis_1.txt
[ 43%] Built target _var_jenkins_workspace_adamantine-nightly_build_bin_integration_3d_gold_five_axis_1.txt
[ 44%] Copying integration_3d_gold_short.txt
[ 44%] Built target _var_jenkins_workspace_adamantine-nightly_build_bin_integration_3d_gold_short.txt
[ 44%] Copying integration_3d_gold_short_0.txt
[ 44%] Built target _var_jenkins_workspace_adamantine-nightly_build_bin_integration_3d_gold_short_0.txt
[ 45%] Copying integration_3d_gold_short_1.txt
[ 45%] Built target _var_jenkins_workspace_adamantine-nightly_build_bin_integration_3d_gold_short_1.txt
[ 45%] Copying integration_da_add_material.info
[ 45%] Built target _var_jenkins_workspace_adamantine-nightly_build_bin_integration_da_add_material.info
[ 46%] Copying integration_da_add_material_expt_log.txt
[ 46%] Built target _var_jenkins_workspace_adamantine-nightly_build_bin_integration_da_add_material_expt_log.txt
[ 47%] Copying integration_da_add_material_expt_pc_0_0.csv
[ 47%] Built target _var_jenkins_workspace_adamantine-nightly_build_bin_integration_da_add_material_expt_pc_0_0.csv
[ 47%] Copying integration_da_add_material_expt_ray_0_0.csv
[ 47%] Built target _var_jenkins_workspace_adamantine-nightly_build_bin_integration_da_add_material_expt_ray_0_0.csv
[ 48%] Copying integration_da_add_material_sp.txt
[ 48%] Built target _var_jenkins_workspace_adamantine-nightly_build_bin_integration_da_add_material_sp.txt
[ 48%] Copying material_deposition_2d.txt
[ 48%] Built target _var_jenkins_workspace_adamantine-nightly_build_bin_material_deposition_2d.txt
[ 49%] Copying material_deposition_3d.txt
[ 49%] Built target _var_jenkins_workspace_adamantine-nightly_build_bin_material_deposition_3d.txt
[ 50%] Copying material_path_test_material_deposition.txt
[ 50%] Built target _var_jenkins_workspace_adamantine-nightly_build_bin_material_path_test_material_deposition.txt
[ 50%] Copying material_property_polynomial.info
[ 50%] Built target _var_jenkins_workspace_adamantine-nightly_build_bin_material_property_polynomial.info
[ 51%] Copying material_property_table.info
[ 51%] Built target _var_jenkins_workspace_adamantine-nightly_build_bin_material_property_table.info
[ 51%] Copying microstructure_G_R_gold_1.txt
[ 51%] Built target _var_jenkins_workspace_adamantine-nightly_build_bin_microstructure_G_R_gold_1.txt
[ 52%] Copying microstructure_G_R_gold_2.txt
[ 52%] Built target _var_jenkins_workspace_adamantine-nightly_build_bin_microstructure_G_R_gold_2.txt
[ 52%] Copying rays_cam-0-0_test_full.csv
[ 52%] Built target _var_jenkins_workspace_adamantine-nightly_build_bin_rays_cam-0-0_test_full.csv
[ 53%] Copying raytracing_experimental_data_0_0.csv
[ 53%] Built target _var_jenkins_workspace_adamantine-nightly_build_bin_raytracing_experimental_data_0_0.csv
[ 54%] Copying raytracing_non_AA_cells-0-0.csv
[ 54%] Built target _var_jenkins_workspace_adamantine-nightly_build_bin_raytracing_non_AA_cells-0-0.csv
[ 54%] Copying scan_path.txt
[ 54%] Built target _var_jenkins_workspace_adamantine-nightly_build_bin_scan_path.txt
[ 55%] Copying scan_path_5_axis.txt
[ 55%] Built target _var_jenkins_workspace_adamantine-nightly_build_bin_scan_path_5_axis.txt
[ 56%] Copying scan_path_arcs.txt
[ 56%] Built target _var_jenkins_workspace_adamantine-nightly_build_bin_scan_path_arcs.txt
[ 57%] Copying scan_path_diagonal.txt
[ 57%] Built target _var_jenkins_workspace_adamantine-nightly_build_bin_scan_path_diagonal.txt
[ 57%] Copying scan_path_event_series.inp
[ 57%] Built target _var_jenkins_workspace_adamantine-nightly_build_bin_scan_path_event_series.inp
[ 57%] Copying scan_path_L.txt
[ 57%] Built target _var_jenkins_workspace_adamantine-nightly_build_bin_scan_path_L.txt
[ 58%] Copying scan_path_layers.txt
[ 58%] Built target _var_jenkins_workspace_adamantine-nightly_build_bin_scan_path_layers.txt
[ 58%] Copying scan_path_test_thermal_physics.txt
[ 58%] Built target _var_jenkins_workspace_adamantine-nightly_build_bin_scan_path_test_thermal_physics.txt
[ 59%] Copying scan_path_units.txt
[ 59%] Built target _var_jenkins_workspace_adamantine-nightly_build_bin_scan_path_units.txt
[ 59%] Copying Simple_3D_ring.stl
[ 59%] Built target _var_jenkins_workspace_adamantine-nightly_build_bin_Simple_3D_ring.stl
[ 60%] Copying thermoelastic_bare_plate.info
[ 60%] Built target _var_jenkins_workspace_adamantine-nightly_build_bin_thermoelastic_bare_plate.info
[ 60%] Copying thermoelastic_bare_plate_add_material_scan_path.txt
[ 60%] Built target _var_jenkins_workspace_adamantine-nightly_build_bin_thermoelastic_bare_plate_add_material_scan_path.txt
[ 61%] Copying thermoelastic_bare_plate_scan_path.txt
[ 61%] Built target _var_jenkins_workspace_adamantine-nightly_build_bin_thermoelastic_bare_plate_scan_path.txt
[ 61%] Copying within_stl_gold.txt
[ 61%] Built target _var_jenkins_workspace_adamantine-nightly_build_bin_within_stl_gold.txt
[ 61%] Built target Adamantine
[ 62%] Building CXX object tests/CMakeFiles/test_integration_da.dir/test_integration_da.cc.o
[ 62%] Building CXX object application/CMakeFiles/adamantine.dir/adamantine.cc.o
[ 62%] Building CXX object tests/CMakeFiles/test_data_assimilator.dir/test_data_assimilator.cc.o
[ 62%] Building CXX object tests/CMakeFiles/test_closest_source_point_adaptation.dir/test_closest_source_point_adaptation.cc.o
[ 62%] Building CXX object tests/CMakeFiles/test_integration_3d_device.dir/test_integration_3d_device.cc.o
[ 62%] Building CXX object tests/CMakeFiles/test_heat_source.dir/test_heat_source.cc.o
[ 63%] Building CXX object tests/CMakeFiles/test_geometry.dir/test_geometry.cc.o
[ 64%] Building CXX object tests/CMakeFiles/test_experimental_data.dir/test_experimental_data.cc.o
[ 65%] Linking CXX executable ../bin/test_heat_source
[ 66%] Linking CXX executable ../bin/test_closest_source_point_adaptation
[ 66%] Built target test_heat_source
[ 66%] Building CXX object tests/CMakeFiles/test_material_property.dir/test_material_property.cc.o
[ 66%] Linking CXX executable ../bin/test_experimental_data
[ 67%] Linking CXX executable ../bin/test_data_assimilator
[ 67%] Built target test_closest_source_point_adaptation
[ 67%] Building CXX object tests/CMakeFiles/test_material_property_device.dir/test_material_property_device.cc.o
[ 68%] Linking CXX executable ../bin/test_geometry
[ 68%] Built target test_experimental_data
[ 69%] Building CXX object tests/CMakeFiles/test_mechanical_operator.dir/test_mechanical_operator.cc.o
[ 69%] Built target test_data_assimilator
[ 70%] Building CXX object tests/CMakeFiles/test_mechanical_physics.dir/test_mechanical_physics.cc.o
[ 71%] Linking CXX executable ../bin/test_integration_3d_device
[ 72%] Linking CXX executable ../bin/test_integration_da
[ 72%] Built target test_geometry
[ 72%] Building CXX object tests/CMakeFiles/test_post_processor.dir/test_post_processor.cc.o
[ 73%] Linking CXX executable ../bin/test_material_property
[ 73%] Built target test_integration_3d_device
[ 73%] Building CXX object tests/CMakeFiles/test_quaternion.dir/test_quaternion.cc.o
[ 73%] Built target test_integration_da
[ 74%] Building CXX object tests/CMakeFiles/test_scan_path.dir/test_scan_path.cc.o
[ 75%] Linking CXX executable ../bin/test_material_property_device
[ 75%] Built target test_material_property
[ 76%] Building CXX object tests/CMakeFiles/test_thermal_operator.dir/test_thermal_operator.cc.o
[ 77%] Linking CXX executable ../bin/test_quaternion
[ 77%] Linking CXX executable ../bin/test_mechanical_operator
[ 77%] Linking CXX executable ../bin/test_scan_path
[ 77%] Built target test_material_property_device
[ 78%] Building CXX object tests/CMakeFiles/test_thermal_operator_device.dir/test_thermal_operator_device.cc.o
[ 78%] Linking CXX executable ../bin/test_mechanical_physics
[ 78%] Built target test_quaternion
[ 78%] Building CXX object tests/CMakeFiles/test_thermal_physics_device.dir/test_thermal_physics_device.cc.o
[ 79%] Linking CXX executable ../bin/test_post_processor
[ 79%] Built target test_mechanical_operator
[ 80%] Building CXX object tests/CMakeFiles/test_timer.dir/test_timer.cc.o
[ 80%] Built target test_scan_path
[ 81%] Building CXX object tests/CMakeFiles/test_utils.dir/test_utils.cc.o
[ 81%] Built target test_mechanical_physics
[ 82%] Building CXX object tests/CMakeFiles/test_validate_input_database.dir/test_validate_input_database.cc.o
[ 82%] Built target test_post_processor
[ 82%] Building CXX object tests/CMakeFiles/test_integration_2d.dir/test_integration_2d.cc.o
[ 82%] Linking CXX executable ../bin/test_timer
[ 82%] Linking CXX executable ../bin/test_utils
[ 82%] Linking CXX executable ../bin/test_thermal_operator
[ 83%] Linking CXX executable ../bin/test_validate_input_database
[ 83%] Built target test_timer
[ 84%] Building CXX object tests/CMakeFiles/test_integration_2d_device.dir/test_integration_2d_device.cc.o
[ 85%] Linking CXX executable ../bin/test_thermal_physics_device
[ 85%] Built target test_utils
[ 86%] Building CXX object tests/CMakeFiles/test_integration_3d.dir/test_integration_3d.cc.o
[ 87%] Linking CXX executable ../bin/test_thermal_operator_device
[ 87%] Built target test_thermal_operator
[ 88%] Building CXX object tests/CMakeFiles/test_integration_3d_amr.dir/test_integration_3d_amr.cc.o
[ 88%] Built target test_validate_input_database
[ 88%] Building CXX object tests/CMakeFiles/test_integration_3d_amr_device.dir/test_integration_3d_amr_device.cc.o
[ 88%] Built target test_thermal_physics_device
[ 89%] Building CXX object tests/CMakeFiles/test_integration_da_augmented.dir/test_integration_da_augmented.cc.o
[ 89%] Built target test_thermal_operator_device
[ 90%] Building CXX object tests/CMakeFiles/test_integration_thermoelastic.dir/test_integration_thermoelastic.cc.o
[ 91%] Linking CXX executable ../bin/test_integration_2d
[ 91%] Built target test_integration_2d
[ 92%] Building CXX object tests/CMakeFiles/test_material_deposition.dir/test_material_deposition.cc.o
[ 92%] Linking CXX executable ../bin/test_integration_2d_device
[ 92%] Linking CXX executable ../bin/test_integration_3d
[ 93%] Linking CXX executable ../bin/test_integration_3d_amr
[ 94%] Linking CXX executable ../bin/test_integration_3d_amr_device
[ 94%] Built target test_integration_2d_device
[ 95%] Building CXX object tests/CMakeFiles/test_microstructure.dir/test_microstructure.cc.o
[ 95%] Linking CXX executable ../bin/test_integration_da_augmented
[ 95%] Linking CXX executable ../bin/test_integration_thermoelastic
[ 95%] Built target test_integration_3d
[ 95%] Building CXX object tests/CMakeFiles/test_thermal_physics.dir/test_thermal_physics.cc.o
[ 95%] Built target test_integration_3d_amr_device
[ 96%] Building CXX object tests/CMakeFiles/test_ensemble_management.dir/test_ensemble_management.cc.o
[ 97%] Linking CXX executable ../bin/adamantine
[ 97%] Built target test_integration_3d_amr
[ 97%] Built target test_integration_da_augmented
[ 97%] Built target test_integration_thermoelastic
[ 98%] Linking CXX executable ../bin/test_material_deposition
[ 98%] Built target adamantine
[ 98%] Linking CXX executable ../bin/test_ensemble_management
[ 98%] Built target test_material_deposition
[ 98%] Built target test_ensemble_management
[ 99%] Linking CXX executable ../bin/test_thermal_physics
[100%] Linking CXX executable ../bin/test_microstructure
[100%] Built target test_microstructure
[100%] Built target test_thermal_physics
[Pipeline] sh
+ ctest -V --timeout 7200 --no-compress-output -R test_ -T Test
UpdateCTestConfiguration  from :/var/jenkins/workspace/adamantine-nightly/build/DartConfiguration.tcl
Parse Config file:/var/jenkins/workspace/adamantine-nightly/build/DartConfiguration.tcl
   Site: 807737b30978
   Build name: Linux-nvcc_wrapper
Create new tag: 20260917-0504 - Experimental
UpdateCTestConfiguration  from :/var/jenkins/workspace/adamantine-nightly/build/DartConfiguration.tcl
Parse Config file:/var/jenkins/workspace/adamantine-nightly/build/DartConfiguration.tcl
Test project /var/jenkins/workspace/adamantine-nightly/build
Constructing a list of tests
Done constructing a list of tests
Updating test list for fixtures
Added 0 tests to meet fixture requirements
Checking test dependency graph...
Checking test dependency graph end
test 2
      Start  2: test_integration_da_1

2: Test command: /usr/bin/mpiexec "-n" "1" "/var/jenkins/workspace/adamantine-nightly/build/bin/test_integration_da"
2: Working Directory: /var/jenkins/workspace/adamantine-nightly/build/tests
2: Test timeout computed to be: 7200
2: Running 3 test cases...
2: Entering test module "Integration_Data_Assimilation"
2: /var/jenkins/workspace/adamantine-nightly/tests/test_integration_da.cc(78): Entering test case "integration_data_assimilation"
2: Reading the experimental log file...
2: Done. Log entries found for 1 camera(s), with 2 frame(s).
2: Starting the main time stepping loop...
2: 10% completed
2: 20% completed
2: 30% completed
2: 40% completed
2: Performing data assimilation at time 0.0211...
2: Rank: 0 | Old parameters for member 0: 
2: Rank: 0 | Old parameters for member 1: 
2: Rank: 0 | Old parameters for member 2: 
2: Rank: 0 | Number expt sites mapped to DOFs: 1
2: Getting the perturbed innovation...
2: Applying the Kalman gain...
2: Updating the ensemble members...
2: Done.
2: 50% completed
2: 60% completed
2: Performing data assimilation at time 0.0316...
2: Rank: 0 | Old parameters for member 0: 
2: Rank: 0 | Old parameters for member 1: 
2: Rank: 0 | Old parameters for member 2: 
2: Rank: 0 | Number expt sites mapped to DOFs: 1
2: Getting the perturbed innovation...
2: Applying the Kalman gain...
2: Updating the ensemble members...
2: Done.
2: 70% completed
2: 80% completed
2: 90% completed
2: 100% completed
2: Reading the experimental log file...
2: Done. Log entries found for 1 camera(s), with 2 frame(s).
2: Starting the main time stepping loop...
2: 10% completed
2: 20% completed
2: 30% completed
2: 40% completed
2: Performing data assimilation at time 0.0211...
2: Rank: 0 | Old parameters for member 0: 
2: Rank: 0 | Old parameters for member 1: 
2: Rank: 0 | Old parameters for member 2: 
2: Rank: 0 | Number expt sites mapped to DOFs: 1
2: Getting the perturbed innovation...
2: Applying the Kalman gain...
2: Updating the ensemble members...
2: Done.
2: 50% completed
2: 60% completed
2: Performing data assimilation at time 0.0316...
2: Rank: 0 | Old parameters for member 0: 
2: Rank: 0 | Old parameters for member 1: 
2: Rank: 0 | Old parameters for member 2: 
2: Rank: 0 | Number expt sites mapped to DOFs: 1
2: Getting the perturbed innovation...
2: Applying the Kalman gain...
2: Updating the ensemble members...
2: Done.
2: 70% completed
2: 80% completed
2: 90% completed
2: 100% completed
2: /var/jenkins/workspace/adamantine-nightly/tests/test_integration_da.cc(78): Leaving test case "integration_data_assimilation"; testing time: 68625170us
2: /var/jenkins/workspace/adamantine-nightly/tests/test_integration_da.cc(148): Entering test case "integration_3D_da_point_cloud_add_material"
2: Reading the experimental log file...
2: Done. Log entries found for 1 camera(s), with 1 frame(s).
2: Starting the main time stepping loop...
2: 10% completed
2: 20% completed
2: 30% completed
2: 40% completed
2: 50% completed
2: Performing data assimilation at time 0.12...
2: Rank: 0 | Old parameters for member 0: 
2: Rank: 0 | Old parameters for member 1: 
2: Rank: 0 | Old parameters for member 2: 
2: Rank: 0 | Number expt sites mapped to DOFs: 1
2: Getting the perturbed innovation...
2: Applying the Kalman gain...
2: Updating the ensemble members...
2: Done.
2: 60% completed
2: 70% completed
2: 80% completed
2: 90% completed
2: 100% completed
2: Reading the experimental log file...
2: Done. Log entries found for 1 camera(s), with 1 frame(s).
2: Starting the main time stepping loop...
2: 10% completed
2: 20% completed
2: 30% completed
2: 40% completed
2: 50% completed
2: Performing data assimilation at time 0.12...
2: Rank: 0 | Old parameters for member 0: 
2: Rank: 0 | Old parameters for member 1: 
2: Rank: 0 | Old parameters for member 2: 
2: Rank: 0 | Number expt sites mapped to DOFs: 1
2: Getting the perturbed innovation...
2: Applying the Kalman gain...
2: Updating the ensemble members...
2: Done.
2: 60% completed
2: 70% completed
2: 80% completed
2: 90% completed
2: 100% completed
2: /var/jenkins/workspace/adamantine-nightly/tests/test_integration_da.cc(148): Leaving test case "integration_3D_da_point_cloud_add_material"; testing time: 2608294us
2: /var/jenkins/workspace/adamantine-nightly/tests/test_integration_da.cc(231): Entering test case "integration_3D_da_ray_add_material"
2: Reading the experimental log file...
2: Done. Log entries found for 1 camera(s), with 1 frame(s).
2: Starting the main time stepping loop...
2: 10% completed
2: 20% completed
2: 30% completed
2: 40% completed
2: 50% completed
2: Performing data assimilation at time 0.12...
2: Rank: 0 | Old parameters for member 0: 
2: Rank: 0 | Old parameters for member 1: 
2: Rank: 0 | Old parameters for member 2: 
2: Rank: 0 | Number expt sites mapped to DOFs: 1
2: Getting the perturbed innovation...
2: Applying the Kalman gain...
2: Updating the ensemble members...
2: Done.
2: 60% completed
2: 70% completed
2: 80% completed
2: 90% completed
2: 100% completed
2: Reading the experimental log file...
2: Done. Log entries found for 1 camera(s), with 1 frame(s).
2: Starting the main time stepping loop...
2: 10% completed
2: 20% completed
2: 30% completed
2: 40% completed
2: 50% completed
2: Performing data assimilation at time 0.12...
2: Rank: 0 | Old parameters for member 0: 
2: Rank: 0 | Old parameters for member 1: 
2: Rank: 0 | Old parameters for member 2: 
2: Rank: 0 | Number expt sites mapped to DOFs: 1
2: Getting the perturbed innovation...
2: Applying the Kalman gain...
2: Updating the ensemble members...
2: Done.
2: 60% completed
2: 70% completed
2: 80% completed
2: 90% completed
2: 100% completed
2: /var/jenkins/workspace/adamantine-nightly/tests/test_integration_da.cc(231): Leaving test case "integration_3D_da_ray_add_material"; testing time: 2762576us
2: Leaving test module "Integration_Data_Assimilation"; testing time: 73996180us
2: 
2: *** No errors detected
2: 
 1/48 Test  #2: test_integration_da_1 ....................   Passed   77.17 sec
test 3
      Start  3: test_integration_da_2

3: Test command: /usr/bin/mpiexec "-n" "2" "/var/jenkins/workspace/adamantine-nightly/build/bin/test_integration_da"
3: Working Directory: /var/jenkins/workspace/adamantine-nightly/build/tests
3: Test timeout computed to be: 7200
3: Running 3 test cases...
3: Entering test module "Integration_Data_Assimilation"
3: /var/jenkins/workspace/adamantine-nightly/tests/test_integration_da.cc(78): Entering test case "integration_data_assimilation"
3: Running 3 test cases...
3: Entering test module "Integration_Data_Assimilation"
3: /var/jenkins/workspace/adamantine-nightly/tests/test_integration_da.cc(78): Entering test case "integration_data_assimilation"
3: Reading the experimental log file...
3: Done. Log entries found for 1 camera(s), with 2 frame(s).
3: Starting the main time stepping loop...
3: 10% completed
3: Rank: 1 | Old parameters for member 2: 
3: Rank: 1 | Number expt sites mapped to DOFs: 1
3: 20% completed
3: 30% completed
3: 40% completed
3: Performing data assimilation at time 0.0211...
3: Rank: 0 | Old parameters for member 0: 
3: Rank: 0 | Old parameters for member 1: 
3: Rank: 0 | Number expt sites mapped to DOFs: 1
3: Getting the perturbed innovation...
3: Applying the Kalman gain...
3: Updating the ensemble members...
3: Done.
3: 50% completed
3: Rank: 1 | Old parameters for member 2: 
3: Rank: 1 | Number expt sites mapped to DOFs: 1
3: 60% completed
3: Performing data assimilation at time 0.0316...
3: Rank: 0 | Old parameters for member 0: 
3: Rank: 0 | Old parameters for member 1: 
3: Rank: 0 | Number expt sites mapped to DOFs: 1
3: Getting the perturbed innovation...
3: Applying the Kalman gain...
3: Updating the ensemble members...
3: Done.
3: 70% completed
3: 80% completed
3: 90% completed
3: 100% completed
3: Reading the experimental log file...
3: Done. Log entries found for 1 camera(s), with 2 frame(s).
3: Reading the experimental log file...
3: Done. Log entries found for 1 camera(s), with 2 frame(s).
3: Starting the main time stepping loop...
3: Starting the main time stepping loop...
3: 10% completed
3: 10% completed
3: 20% completed
3: 20% completed
3: 30% completed
3: 30% completed
3: 40% completed
3: 40% completed
3: Performing data assimilation at time 0.0211...
3: Rank: 0 | Old parameters for member 0: 
3: Rank: 0 | Old parameters for member 1: 
3: Rank: 0 | Old parameters for member 2: 
3: Rank: 0 | Number expt sites mapped to DOFs: 1
3: Performing data assimilation at time 0.0211...
3: Rank: 0 | Old parameters for member 0: 
3: Rank: 0 | Old parameters for member 1: 
3: Rank: 0 | Old parameters for member 2: 
3: Rank: 0 | Number expt sites mapped to DOFs: 1
3: Getting the perturbed innovation...
3: Applying the Kalman gain...
3: Getting the perturbed innovation...
3: Applying the Kalman gain...
3: Updating the ensemble members...
3: Done.
3: Updating the ensemble members...
3: Done.
3: 50% completed
3: 50% completed
3: 60% completed
3: 60% completed
3: Performing data assimilation at time 0.0316...
3: Rank: 0 | Old parameters for member 0: 
3: Rank: 0 | Old parameters for member 1: 
3: Rank: 0 | Old parameters for member 2: 
3: Rank: 0 | Number expt sites mapped to DOFs: 1
3: Performing data assimilation at time 0.0316...
3: Rank: 0 | Old parameters for member 0: 
3: Rank: 0 | Old parameters for member 1: 
3: Rank: 0 | Old parameters for member 2: 
3: Rank: 0 | Number expt sites mapped to DOFs: 1
3: Getting the perturbed innovation...
3: Applying the Kalman gain...
3: Getting the perturbed innovation...
3: Applying the Kalman gain...
3: Updating the ensemble members...
3: Done.
3: Updating the ensemble members...
3: Done.
3: 70% completed
3: 70% completed
3: 80% completed
3: 80% completed
3: 90% completed
3: 90% completed
3: 100% completed
3: 100% completed
3: /var/jenkins/workspace/adamantine-nightly/tests/test_integration_da.cc(78): Leaving test case "integration_data_assimilation"; testing time: 59911425us
3: /var/jenkins/workspace/adamantine-nightly/tests/test_integration_da.cc(148): Entering test case "integration_3D_da_point_cloud_add_material"
3: /var/jenkins/workspace/adamantine-nightly/tests/test_integration_da.cc(78): Leaving test case "integration_data_assimilation"; testing time: 60038267us
3: /var/jenkins/workspace/adamantine-nightly/tests/test_integration_da.cc(148): Entering test case "integration_3D_da_point_cloud_add_material"
3: Reading the experimental log file...
3: Done. Log entries found for 1 camera(s), with 1 frame(s).
3: Starting the main time stepping loop...
3: Rank: 1 | Old parameters for member 2: 
3: Rank: 1 | Number expt sites mapped to DOFs: 1
3: 10% completed
3: 20% completed
3: 30% completed
3: 40% completed
3: 50% completed
3: Performing data assimilation at time 0.12...
3: Rank: 0 | Old parameters for member 0: 
3: Rank: 0 | Old parameters for member 1: 
3: Rank: 0 | Number expt sites mapped to DOFs: 1
3: Getting the perturbed innovation...
3: Applying the Kalman gain...
3: Updating the ensemble members...
3: Done.
3: 60% completed
3: 70% completed
3: 80% completed
3: 90% completed
3: 100% completed
3: Reading the experimental log file...
3: Done. Log entries found for 1 camera(s), with 1 frame(s).
3: Reading the experimental log file...
3: Done. Log entries found for 1 camera(s), with 1 frame(s).
3: Starting the main time stepping loop...
3: Starting the main time stepping loop...
3: 10% completed
3: 10% completed
3: 20% completed
3: 20% completed
3: 30% completed
3: 30% completed
3: 40% completed
3: 40% completed
3: 50% completed
3: 50% completed
3: Performing data assimilation at time 0.12...
3: Rank: 0 | Old parameters for member 0: 
3: Rank: 0 | Old parameters for member 1: 
3: Rank: 0 | Old parameters for member 2: 
3: Performing data assimilation at time 0.12...
3: Rank: 0 | Old parameters for member 0: 
3: Rank: 0 | Old parameters for member 1: 
3: Rank: 0 | Old parameters for member 2: 
3: Rank: 0 | Number expt sites mapped to DOFs: 1
3: Rank: 0 | Number expt sites mapped to DOFs: 1
3: Getting the perturbed innovation...
3: Applying the Kalman gain...
3: Getting the perturbed innovation...
3: Applying the Kalman gain...
3: Updating the ensemble members...
3: Updating the ensemble members...
3: Done.
3: 60% completed
3: Done.
3: 60% completed
3: 70% completed
3: 70% completed
3: 80% completed
3: 80% completed
3: 90% completed
3: 90% completed
3: 100% completed
3: 100% completed
3: /var/jenkins/workspace/adamantine-nightly/tests/test_integration_da.cc(148): Leaving test case "integration_3D_da_point_cloud_add_material"; testing time: 2410308us
3: /var/jenkins/workspace/adamantine-nightly/tests/test_integration_da.cc(231): Entering test case "integration_3D_da_ray_add_material"
3: /var/jenkins/workspace/adamantine-nightly/tests/test_integration_da.cc(148): Leaving test case "integration_3D_da_point_cloud_add_material"; testing time: 2282881us
3: /var/jenkins/workspace/adamantine-nightly/tests/test_integration_da.cc(231): Entering test case "integration_3D_da_ray_add_material"
3: Reading the experimental log file...
3: Done. Log entries found for 1 camera(s), with 1 frame(s).
3: Starting the main time stepping loop...
3: Rank: 1 | Old parameters for member 2: 
3: Rank: 1 | Number expt sites mapped to DOFs: 1
3: 10% completed
3: 20% completed
3: 30% completed
3: 40% completed
3: 50% completed
3: Performing data assimilation at time 0.12...
3: Rank: 0 | Old parameters for member 0: 
3: Rank: 0 | Old parameters for member 1: 
3: Rank: 0 | Number expt sites mapped to DOFs: 1
3: Getting the perturbed innovation...
3: Applying the Kalman gain...
3: Updating the ensemble members...
3: Done.
3: 60% completed
3: 70% completed
3: 80% completed
3: 90% completed
3: 100% completed
3: Reading the experimental log file...
3: Done. Log entries found for 1 camera(s), with 1 frame(s).
3: Reading the experimental log file...
3: Done. Log entries found for 1 camera(s), with 1 frame(s).
3: Starting the main time stepping loop...
3: Starting the main time stepping loop...
3: 10% completed
3: 10% completed
3: 20% completed
3: 20% completed
3: 30% completed
3: 30% completed
3: 40% completed
3: 40% completed
3: 50% completed
3: 50% completed
3: Performing data assimilation at time 0.12...
3: Rank: 0 | Old parameters for member 0: 
3: Rank: 0 | Old parameters for member 1: 
3: Rank: 0 | Old parameters for member 2: 
3: Performing data assimilation at time 0.12...
3: Rank: 0 | Old parameters for member 0: 
3: Rank: 0 | Old parameters for member 1: 
3: Rank: 0 | Old parameters for member 2: 
3: Rank: 0 | Number expt sites mapped to DOFs: 1
3: Rank: 0 | Number expt sites mapped to DOFs: 1
3: Getting the perturbed innovation...
3: Applying the Kalman gain...
3: Getting the perturbed innovation...
3: Applying the Kalman gain...
3: Updating the ensemble members...
3: Updating the ensemble members...
3: Done.
3: 60% completed
3: Done.
3: 60% completed
3: 70% completed
3: 70% completed
3: 80% completed
3: 80% completed
3: 90% completed
3: 90% completed
3: 100% completed
3: 100% completed
3: /var/jenkins/workspace/adamantine-nightly/tests/test_integration_da.cc(231): Leaving test case "integration_3D_da_ray_add_material"; testing time: 2292592us
3: Leaving test module "Integration_Data_Assimilation"; testing time: 64614470us
3: 
3: *** No errors detected
3: /var/jenkins/workspace/adamantine-nightly/tests/test_integration_da.cc(231): Leaving test case "integration_3D_da_ray_add_material"; testing time: 2292543us
3: Leaving test module "Integration_Data_Assimilation"; testing time: 64613847us
3: 
3: *** No errors detected
3: 
 2/48 Test  #3: test_integration_da_2 ....................   Passed   65.68 sec
test 4
      Start  4: test_integration_da_3

4: Test command: /usr/bin/mpiexec "-n" "3" "/var/jenkins/workspace/adamantine-nightly/build/bin/test_integration_da"
4: Working Directory: /var/jenkins/workspace/adamantine-nightly/build/tests
4: Test timeout computed to be: 7200
4: Running 3 test cases...
4: Entering test module "Integration_Data_Assimilation"
4: /var/jenkins/workspace/adamantine-nightly/tests/test_integration_da.cc(78): Entering test case "integration_data_assimilation"
4: Running 3 test cases...
4: Entering test module "Integration_Data_Assimilation"
4: /var/jenkins/workspace/adamantine-nightly/tests/test_integration_da.cc(78): Entering test case "integration_data_assimilation"
4: Running 3 test cases...
4: Entering test module "Integration_Data_Assimilation"
4: /var/jenkins/workspace/adamantine-nightly/tests/test_integration_da.cc(78): Entering test case "integration_data_assimilation"
4: Reading the experimental log file...
4: Done. Log entries found for 1 camera(s), with 2 frame(s).
4: Starting the main time stepping loop...
4: 10% completed
4: 20% completed
4: 30% completed
4: 40% completed
4: Rank: 1 | Old parameters for member 1: 
4: Rank: 2 | Old parameters for member 2: 
4: Performing data assimilation at time 0.0211...
4: Rank: 0 | Old parameters for member 0: 
4: Rank: 1 | Number expt sites mapped to DOFs: 1
4: Rank: 2 | Number expt sites mapped to DOFs: 1
4: Rank: 0 | Number expt sites mapped to DOFs: 1
4: Getting the perturbed innovation...
4: Applying the Kalman gain...
4: Updating the ensemble members...
4: Done.
4: 50% completed
4: 60% completed
4: Rank: 2 | Old parameters for member 2: 
4: Performing data assimilation at time 0.0316...
4: Rank: 0 | Old parameters for member 0: 
4: Rank: 1 | Old parameters for member 1: 
4: Rank: 2 | Number expt sites mapped to DOFs: 1
4: Rank: 0 | Number expt sites mapped to DOFs: 1
4: Rank: 1 | Number expt sites mapped to DOFs: 1
4: Getting the perturbed innovation...
4: Applying the Kalman gain...
4: Updating the ensemble members...
4: Done.
4: 70% completed
4: 80% completed
4: 90% completed
4: 100% completed
4: Reading the experimental log file...
4: Done. Log entries found for 1 camera(s), with 2 frame(s).
4: Reading the experimental log file...
4: Done. Log entries found for 1 camera(s), with 2 frame(s).
4: Reading the experimental log file...
4: Done. Log entries found for 1 camera(s), with 2 frame(s).
4: Starting the main time stepping loop...
4: Starting the main time stepping loop...
4: Starting the main time stepping loop...
4: 10% completed
4: 10% completed
4: 10% completed
4: 20% completed
4: 20% completed
4: 20% completed
4: 30% completed
4: 30% completed
4: 30% completed
4: 40% completed
4: 40% completed
4: 40% completed
4: Performing data assimilation at time 0.0211...
4: Rank: 0 | Old parameters for member 0: 
4: Rank: 0 | Old parameters for member 1: 
4: Rank: 0 | Old parameters for member 2: 
4: Rank: 0 | Number expt sites mapped to DOFs: 1
4: Performing data assimilation at time 0.0211...
4: Rank: 0 | Old parameters for member 0: 
4: Rank: 0 | Old parameters for member 1: 
4: Rank: 0 | Old parameters for member 2: 
4: Rank: 0 | Number expt sites mapped to DOFs: 1
4: Performing data assimilation at time 0.0211...
4: Rank: 0 | Old parameters for member 0: 
4: Rank: 0 | Old parameters for member 1: 
4: Rank: 0 | Old parameters for member 2: 
4: Rank: 0 | Number expt sites mapped to DOFs: 1
4: Getting the perturbed innovation...
4: Applying the Kalman gain...
4: Getting the perturbed innovation...
4: Applying the Kalman gain...
4: Getting the perturbed innovation...
4: Applying the Kalman gain...
4: Updating the ensemble members...
4: Done.
4: Updating the ensemble members...
4: Done.
4: Updating the ensemble members...
4: Done.
4: 50% completed
4: 50% completed
4: 50% completed
4: 60% completed
4: 60% completed
4: 60% completed
4: Performing data assimilation at time 0.0316...
4: Rank: 0 | Old parameters for member 0: 
4: Rank: 0 | Old parameters for member 1: 
4: Rank: 0 | Old parameters for member 2: 
4: Rank: 0 | Number expt sites mapped to DOFs: 1
4: Performing data assimilation at time 0.0316...
4: Rank: 0 | Old parameters for member 0: 
4: Rank: 0 | Old parameters for member 1: 
4: Rank: 0 | Old parameters for member 2: 
4: Rank: 0 | Number expt sites mapped to DOFs: 1
4: Performing data assimilation at time 0.0316...
4: Rank: 0 | Old parameters for member 0: 
4: Rank: 0 | Old parameters for member 1: 
4: Rank: 0 | Old parameters for member 2: 
4: Rank: 0 | Number expt sites mapped to DOFs: 1
4: Getting the perturbed innovation...
4: Applying the Kalman gain...
4: Getting the perturbed innovation...
4: Applying the Kalman gain...
4: Getting the perturbed innovation...
4: Applying the Kalman gain...
4: Updating the ensemble members...
4: Done.
4: Updating the ensemble members...
4: Done.
4: Updating the ensemble members...
4: Done.
4: 70% completed
4: 70% completed
4: 70% completed
4: 80% completed
4: 80% completed
4: 80% completed
4: 90% completed
4: 90% completed
4: 90% completed
4: 100% completed
4: 100% completed
4: /var/jenkins/workspace/adamantine-nightly/tests/test_integration_da.cc(78): Leaving test case "integration_data_assimilation"; testing time: 50653558us
4: /var/jenkins/workspace/adamantine-nightly/tests/test_integration_da.cc(148): Entering test case "integration_3D_da_point_cloud_add_material"
4: /var/jenkins/workspace/adamantine-nightly/tests/test_integration_da.cc(78): Leaving test case "integration_data_assimilation"; testing time: 50688550us
4: /var/jenkins/workspace/adamantine-nightly/tests/test_integration_da.cc(148): Entering test case "integration_3D_da_point_cloud_add_material"
4: 100% completed
4: /var/jenkins/workspace/adamantine-nightly/tests/test_integration_da.cc(78): Leaving test case "integration_data_assimilation"; testing time: 51031630us
4: /var/jenkins/workspace/adamantine-nightly/tests/test_integration_da.cc(148): Entering test case "integration_3D_da_point_cloud_add_material"
4: Reading the experimental log file...
4: Done. Log entries found for 1 camera(s), with 1 frame(s).
4: Starting the main time stepping loop...
4: 10% completed
4: 20% completed
4: 30% completed
4: 40% completed
4: 50% completed
4: Rank: 1 | Old parameters for member 1: 
4: Performing data assimilation at time 0.12...
4: Rank: 0 | Old parameters for member 0: 
4: Rank: 2 | Old parameters for member 2: 
4: Rank: 1 | Number expt sites mapped to DOFs: 1
4: Rank: 0 | Number expt sites mapped to DOFs: 1
4: Rank: 2 | Number expt sites mapped to DOFs: 1
4: Getting the perturbed innovation...
4: Applying the Kalman gain...
4: Updating the ensemble members...
4: Done.
4: 60% completed
4: 70% completed
4: 80% completed
4: 90% completed
4: 100% completed
4: Reading the experimental log file...
4: Done. Log entries found for 1 camera(s), with 1 frame(s).
4: Reading the experimental log file...
4: Done. Log entries found for 1 camera(s), with 1 frame(s).
4: Reading the experimental log file...
4: Done. Log entries found for 1 camera(s), with 1 frame(s).
4: Starting the main time stepping loop...
4: Starting the main time stepping loop...
4: Starting the main time stepping loop...
4: 10% completed
4: 10% completed
4: 10% completed
4: 20% completed
4: 20% completed
4: 20% completed
4: 30% completed
4: 30% completed
4: 30% completed
4: 40% completed
4: 40% completed
4: 40% completed
4: 50% completed
4: 50% completed
4: 50% completed
4: Performing data assimilation at time 0.12...
4: Rank: 0 | Old parameters for member 0: 
4: Rank: 0 | Old parameters for member 1: 
4: Rank: 0 | Old parameters for member 2: 
4: Rank: 0 | Number expt sites mapped to DOFs: 1
4: Performing data assimilation at time 0.12...
4: Rank: 0 | Old parameters for member 0: 
4: Rank: 0 | Old parameters for member 1: 
4: Rank: 0 | Old parameters for member 2: 
4: Rank: 0 | Number expt sites mapped to DOFs: 1
4: Performing data assimilation at time 0.12...
4: Rank: 0 | Old parameters for member 0: 
4: Rank: 0 | Old parameters for member 1: 
4: Rank: 0 | Old parameters for member 2: 
4: Rank: 0 | Number expt sites mapped to DOFs: 1
4: Getting the perturbed innovation...
4: Applying the Kalman gain...
4: Getting the perturbed innovation...
4: Applying the Kalman gain...
4: Getting the perturbed innovation...
4: Applying the Kalman gain...
4: Updating the ensemble members...
4: Done.
4: 60% completed
4: Updating the ensemble members...
4: Done.
4: 60% completed
4: Updating the ensemble members...
4: Done.
4: 60% completed
4: 70% completed
4: 70% completed
4: 70% completed
4: 80% completed
4: 80% completed
4: 80% completed
4: 90% completed
4: 90% completed
4: 90% completed
4: 100% completed
4: 100% completed
4: 100% completed
4: /var/jenkins/workspace/adamantine-nightly/tests/test_integration_da.cc(148): Leaving test case "integration_3D_da_point_cloud_add_material"; testing time: 2119302us
4: /var/jenkins/workspace/adamantine-nightly/tests/test_integration_da.cc(231): Entering test case "integration_3D_da_ray_add_material"
4: /var/jenkins/workspace/adamantine-nightly/tests/test_integration_da.cc(148): Leaving test case "integration_3D_da_point_cloud_add_material"; testing time: 1791601us
4: /var/jenkins/workspace/adamantine-nightly/tests/test_integration_da.cc(231): Entering test case "integration_3D_da_ray_add_material"
4: /var/jenkins/workspace/adamantine-nightly/tests/test_integration_da.cc(148): Leaving test case "integration_3D_da_point_cloud_add_material"; testing time: 2195855us
4: /var/jenkins/workspace/adamantine-nightly/tests/test_integration_da.cc(231): Entering test case "integration_3D_da_ray_add_material"
4: Reading the experimental log file...
4: Done. Log entries found for 1 camera(s), with 1 frame(s).
4: Starting the main time stepping loop...
4: 10% completed
4: 20% completed
4: 30% completed
4: 40% completed
4: 50% completed
4: Performing data assimilation at time 0.12...
4: Rank: 0 | Old parameters for member 0: 
4: Rank: 0 | Number expt sites mapped to DOFs: 1
4: Rank: 2 | Old parameters for member 2: 
4: Rank: 1 | Old parameters for member 1: 
4: Rank: 2 | Number expt sites mapped to DOFs: 1
4: Rank: 1 | Number expt sites mapped to DOFs: 1
4: Getting the perturbed innovation...
4: Applying the Kalman gain...
4: Updating the ensemble members...
4: Done.
4: 60% completed
4: 70% completed
4: 80% completed
4: 90% completed
4: 100% completed
4: Reading the experimental log file...
4: Done. Log entries found for 1 camera(s), with 1 frame(s).
4: Reading the experimental log file...
4: Done. Log entries found for 1 camera(s), with 1 frame(s).
4: Reading the experimental log file...
4: Done. Log entries found for 1 camera(s), with 1 frame(s).
4: Starting the main time stepping loop...
4: Starting the main time stepping loop...
4: Starting the main time stepping loop...
4: 10% completed
4: 10% completed
4: 10% completed
4: 20% completed
4: 20% completed
4: 20% completed
4: 30% completed
4: 30% completed
4: 30% completed
4: 40% completed
4: 40% completed
4: 40% completed
4: 50% completed
4: 50% completed
4: 50% completed
4: Performing data assimilation at time 0.12...
4: Rank: 0 | Old parameters for member 0: 
4: Rank: 0 | Old parameters for member 1: 
4: Rank: 0 | Old parameters for member 2: 
4: Rank: 0 | Number expt sites mapped to DOFs: 1
4: Performing data assimilation at time 0.12...
4: Rank: 0 | Old parameters for member 0: 
4: Rank: 0 | Old parameters for member 1: 
4: Rank: 0 | Old parameters for member 2: 
4: Performing data assimilation at time 0.12...
4: Rank: 0 | Old parameters for member 0: 
4: Rank: 0 | Old parameters for member 1: 
4: Rank: 0 | Old parameters for member 2: 
4: Rank: 0 | Number expt sites mapped to DOFs: 1
4: Rank: 0 | Number expt sites mapped to DOFs: 1
4: Getting the perturbed innovation...
4: Applying the Kalman gain...
4: Getting the perturbed innovation...
4: Applying the Kalman gain...
4: Getting the perturbed innovation...
4: Applying the Kalman gain...
4: Updating the ensemble members...
4: Done.
4: 60% completed
4: Updating the ensemble members...
4: Done.
4: 60% completed
4: Updating the ensemble members...
4: Done.
4: 60% completed
4: 70% completed
4: 70% completed
4: 80% completed
4: 70% completed
4: 80% completed
4: 90% completed
4: 80% completed
4: 90% completed
4: 90% completed
4: 100% completed
4: 100% completed
4: /var/jenkins/workspace/adamantine-nightly/tests/test_integration_da.cc(231): Leaving test case "integration_3D_da_ray_add_material"; testing time: 1798669us
4: Leaving test module "Integration_Data_Assimilation"; testing time: 54606765us
4: 
4: *** No errors detected
4: 100% completed
4: /var/jenkins/workspace/adamantine-nightly/tests/test_integration_da.cc(231): Leaving test case "integration_3D_da_ray_add_material"; testing time: 1805869us
4: Leaving test module "Integration_Data_Assimilation"; testing time: 54655634us
4: 
4: *** No errors detected
4: /var/jenkins/workspace/adamantine-nightly/tests/test_integration_da.cc(231): Leaving test case "integration_3D_da_ray_add_material"; testing time: 1831168us
4: Leaving test module "Integration_Data_Assimilation"; testing time: 54654642us
4: 
4: *** No errors detected
4: 
 3/48 Test  #4: test_integration_da_3 ....................   Passed   55.88 sec
test 5
      Start  5: test_integration_da_6

5: Test command: /usr/bin/mpiexec "-n" "6" "/var/jenkins/workspace/adamantine-nightly/build/bin/test_integration_da"
5: Working Directory: /var/jenkins/workspace/adamantine-nightly/build/tests
5: Test timeout computed to be: 7200
5: Running 3 test cases...
5: Entering test module "Integration_Data_Assimilation"
5: /var/jenkins/workspace/adamantine-nightly/tests/test_integration_da.cc(78): Entering test case "integration_data_assimilation"
5: Running 3 test cases...
5: Entering test module "Integration_Data_Assimilation"
5: /var/jenkins/workspace/adamantine-nightly/tests/test_integration_da.cc(78): Entering test case "integration_data_assimilation"
5: Running 3 test cases...
5: Entering test module "Integration_Data_Assimilation"
5: /var/jenkins/workspace/adamantine-nightly/tests/test_integration_da.cc(78): Entering test case "integration_data_assimilation"
5: Running 3 test cases...
5: Entering test module "Integration_Data_Assimilation"
5: /var/jenkins/workspace/adamantine-nightly/tests/test_integration_da.cc(78): Entering test case "integration_data_assimilation"
5: Running 3 test cases...
5: Entering test module "Integration_Data_Assimilation"
5: /var/jenkins/workspace/adamantine-nightly/tests/test_integration_da.cc(78): Entering test case "integration_data_assimilation"
5: Running 3 test cases...
5: Entering test module "Integration_Data_Assimilation"
5: /var/jenkins/workspace/adamantine-nightly/tests/test_integration_da.cc(78): Entering test case "integration_data_assimilation"
5: Reading the experimental log file...
5: Done. Log entries found for 1 camera(s), with 2 frame(s).
5: Starting the main time stepping loop...
5: 10% completed
5: 20% completed
5: 30% completed
5: 40% completed
5: Rank: 4 | Old parameters for member 2: 
5: Rank: 5 | Old parameters for member 2: 
5: Performing data assimilation at time 0.0211...
5: Rank: 0 | Old parameters for member 0: 
5: Rank: 1 | Old parameters for member 0: 
5: Rank: 3 | Old parameters for member 1: 
5: Rank: 2 | Old parameters for member 1: 
5: Rank: 4 | Number expt sites mapped to DOFs: 1
5: Rank: 5 | Number expt sites mapped to DOFs: 1
5: Rank: 0 | Number expt sites mapped to DOFs: 1
5: Rank: 1 | Number expt sites mapped to DOFs: 1
5: Rank: 2 | Number expt sites mapped to DOFs: 1
5: Rank: 3 | Number expt sites mapped to DOFs: 1
5: Getting the perturbed innovation...
5: Applying the Kalman gain...
5: Updating the ensemble members...
5: Done.
5: 50% completed
5: 60% completed
5: Performing data assimilation at time 0.0316...
5: Rank: 0 | Old parameters for member 0: 
5: Rank: 1 | Old parameters for member 0: 
5: Rank: 4 | Old parameters for member 2: 
5: Rank: 5 | Old parameters for member 2: 
5: Rank: 3 | Old parameters for member 1: 
5: Rank: 2 | Old parameters for member 1: 
5: Rank: 0 | Number expt sites mapped to DOFs: 1
5: Rank: 1 | Number expt sites mapped to DOFs: 1
5: Rank: 4 | Number expt sites mapped to DOFs: 1
5: Rank: 5 | Number expt sites mapped to DOFs: 1
5: Rank: 2 | Number expt sites mapped to DOFs: 1
5: Rank: 3 | Number expt sites mapped to DOFs: 1
5: Getting the perturbed innovation...
5: Applying the Kalman gain...
5: Updating the ensemble members...
5: Done.
5: 70% completed
5: 80% completed
5: 90% completed
5: 100% completed
5: Reading the experimental log file...
5: Done. Log entries found for 1 camera(s), with 2 frame(s).
5: Reading the experimental log file...
5: Done. Log entries found for 1 camera(s), with 2 frame(s).
5: Reading the experimental log file...
5: Done. Log entries found for 1 camera(s), with 2 frame(s).
5: Reading the experimental log file...
5: Done. Log entries found for 1 camera(s), with 2 frame(s).
5: Reading the experimental log file...
5: Done. Log entries found for 1 camera(s), with 2 frame(s).
5: Reading the experimental log file...
5: Done. Log entries found for 1 camera(s), with 2 frame(s).
5: Starting the main time stepping loop...
5: Starting the main time stepping loop...
5: Starting the main time stepping loop...
5: Starting the main time stepping loop...
5: Starting the main time stepping loop...
5: Starting the main time stepping loop...
5: 10% completed
5: 10% completed
5: 10% completed
5: 10% completed
5: 10% completed
5: 10% completed
5: 20% completed
5: 20% completed
5: 20% completed
5: 20% completed
5: 20% completed
5: 20% completed
5: 30% completed
5: 30% completed
5: 30% completed
5: 30% completed
5: 30% completed
5: 30% completed
5: 40% completed
5: 40% completed
5: 40% completed
5: 40% completed
5: 40% completed
5: 40% completed
5: Performing data assimilation at time 0.0211...
5: Rank: 0 | Old parameters for member 0: 
5: Rank: 0 | Old parameters for member 1: 
5: Rank: 0 | Old parameters for member 2: 
5: Rank: 0 | Number expt sites mapped to DOFs: 1
5: Performing data assimilation at time 0.0211...
5: Rank: 0 | Old parameters for member 0: 
5: Rank: 0 | Old parameters for member 1: 
5: Rank: 0 | Old parameters for member 2: 
5: Rank: 0 | Number expt sites mapped to DOFs: 1
5: Performing data assimilation at time 0.0211...
5: Rank: 0 | Old parameters for member 0: 
5: Rank: 0 | Old parameters for member 1: 
5: Rank: 0 | Old parameters for member 2: 
5: Performing data assimilation at time 0.0211...
5: Rank: 0 | Old parameters for member 0: 
5: Rank: 0 | Old parameters for member 1: 
5: Rank: 0 | Old parameters for member 2: 
5: Rank: 0 | Number expt sites mapped to DOFs: 1
5: Rank: 0 | Number expt sites mapped to DOFs: 1
5: Performing data assimilation at time 0.0211...
5: Rank: 0 | Old parameters for member 0: 
5: Rank: 0 | Old parameters for member 1: 
5: Rank: 0 | Old parameters for member 2: 
5: Rank: 0 | Number expt sites mapped to DOFs: 1
5: Performing data assimilation at time 0.0211...
5: Rank: 0 | Old parameters for member 0: 
5: Rank: 0 | Old parameters for member 1: 
5: Rank: 0 | Old parameters for member 2: 
5: Rank: 0 | Number expt sites mapped to DOFs: 1
5: Getting the perturbed innovation...
5: Applying the Kalman gain...
5: Getting the perturbed innovation...
5: Applying the Kalman gain...
5: Getting the perturbed innovation...
5: Applying the Kalman gain...
5: Getting the perturbed innovation...
5: Applying the Kalman gain...
5: Getting the perturbed innovation...
5: Applying the Kalman gain...
5: Getting the perturbed innovation...
5: Applying the Kalman gain...
5: Updating the ensemble members...
5: Done.
5: Updating the ensemble members...
5: Done.
5: Updating the ensemble members...
5: Done.
5: Updating the ensemble members...
5: Done.
5: Updating the ensemble members...
5: Done.
5: Updating the ensemble members...
5: Done.
5: 50% completed
5: 50% completed
5: 50% completed
5: 50% completed
5: 50% completed
5: 50% completed
5: 60% completed
5: 60% completed
5: 60% completed
5: 60% completed
5: 60% completed
5: 60% completed
5: Performing data assimilation at time 0.0316...
5: Rank: 0 | Old parameters for member 0: 
5: Rank: 0 | Old parameters for member 1: 
5: Rank: 0 | Old parameters for member 2: 
5: Rank: 0 | Number expt sites mapped to DOFs: 1
5: Performing data assimilation at time 0.0316...
5: Rank: 0 | Old parameters for member 0: 
5: Rank: 0 | Old parameters for member 1: 
5: Rank: 0 | Old parameters for member 2: 
5: Rank: 0 | Number expt sites mapped to DOFs: 1
5: Performing data assimilation at time 0.0316...
5: Rank: 0 | Old parameters for member 0: 
5: Rank: 0 | Old parameters for member 1: 
5: Rank: 0 | Old parameters for member 2: 
5: Rank: 0 | Number expt sites mapped to DOFs: 1
5: Performing data assimilation at time 0.0316...
5: Rank: 0 | Old parameters for member 0: 
5: Rank: 0 | Old parameters for member 1: 
5: Rank: 0 | Old parameters for member 2: 
5: Rank: 0 | Number expt sites mapped to DOFs: 1
5: Performing data assimilation at time 0.0316...
5: Rank: 0 | Old parameters for member 0: 
5: Rank: 0 | Old parameters for member 1: 
5: Rank: 0 | Old parameters for member 2: 
5: Rank: 0 | Number expt sites mapped to DOFs: 1
5: Performing data assimilation at time 0.0316...
5: Rank: 0 | Old parameters for member 0: 
5: Rank: 0 | Old parameters for member 1: 
5: Rank: 0 | Old parameters for member 2: 
5: Rank: 0 | Number expt sites mapped to DOFs: 1
5: Getting the perturbed innovation...
5: Applying the Kalman gain...
5: Getting the perturbed innovation...
5: Applying the Kalman gain...
5: Getting the perturbed innovation...
5: Applying the Kalman gain...
5: Getting the perturbed innovation...
5: Applying the Kalman gain...
5: Getting the perturbed innovation...
5: Applying the Kalman gain...
5: Getting the perturbed innovation...
5: Applying the Kalman gain...
5: Updating the ensemble members...
5: Done.
5: Updating the ensemble members...
5: Done.
5: Updating the ensemble members...
5: Updating the ensemble members...
5: Done.
5: Done.
5: Updating the ensemble members...
5: Done.
5: Updating the ensemble members...
5: Done.
5: 70% completed
5: 70% completed
5: 70% completed
5: 70% completed
5: 70% completed
5: 70% completed
5: 80% completed
5: 80% completed
5: 80% completed
5: 80% completed
5: 80% completed
5: 80% completed
5: 90% completed
5: 90% completed
5: 90% completed
5: 90% completed
5: 90% completed
5: 90% completed
5: 100% completed
5: 100% completed
5: 100% completed
5: 100% completed
5: /var/jenkins/workspace/adamantine-nightly/tests/test_integration_da.cc(78): Leaving test case "integration_data_assimilation"; testing time: 46935057us
5: /var/jenkins/workspace/adamantine-nightly/tests/test_integration_da.cc(148): Entering test case "integration_3D_da_point_cloud_add_material"
5: 100% completed
5: /var/jenkins/workspace/adamantine-nightly/tests/test_integration_da.cc(78): Leaving test case "integration_data_assimilation"; testing time: 47056845us
5: /var/jenkins/workspace/adamantine-nightly/tests/test_integration_da.cc(148): Entering test case "integration_3D_da_point_cloud_add_material"
5: /var/jenkins/workspace/adamantine-nightly/tests/test_integration_da.cc(78): Leaving test case "integration_data_assimilation"; testing time: 47081006us
5: /var/jenkins/workspace/adamantine-nightly/tests/test_integration_da.cc(148): Entering test case "integration_3D_da_point_cloud_add_material"
5: /var/jenkins/workspace/adamantine-nightly/tests/test_integration_da.cc(78): Leaving test case "integration_data_assimilation"; testing time: 47096741us
5: /var/jenkins/workspace/adamantine-nightly/tests/test_integration_da.cc(148): Entering test case "integration_3D_da_point_cloud_add_material"
5: 100% completed
5: /var/jenkins/workspace/adamantine-nightly/tests/test_integration_da.cc(78): Leaving test case "integration_data_assimilation"; testing time: 47236692us
5: /var/jenkins/workspace/adamantine-nightly/tests/test_integration_da.cc(148): Entering test case "integration_3D_da_point_cloud_add_material"
5: /var/jenkins/workspace/adamantine-nightly/tests/test_integration_da.cc(78): Leaving test case "integration_data_assimilation"; testing time: 47424927us
5: /var/jenkins/workspace/adamantine-nightly/tests/test_integration_da.cc(148): Entering test case "integration_3D_da_point_cloud_add_material"
5: Reading the experimental log file...
5: Done. Log entries found for 1 camera(s), with 1 frame(s).
5: Starting the main time stepping loop...
5: 10% completed
5: 20% completed
5: 30% completed
5: 40% completed
5: 50% completed
5: Rank: 1 | Old parameters for member 0: 
5: Performing data assimilation at time 0.12...
5: Rank: 0 | Old parameters for member 0: 
5: Rank: 1 | Number expt sites mapped to DOFs: 1
5: Rank: 0 | Number expt sites mapped to DOFs: 1
5: Rank: 3 | Old parameters for member 1: 
5: Rank: 2 | Old parameters for member 1: 
5: Rank: 3 | Number expt sites mapped to DOFs: 1
5: Rank: 2 | Number expt sites mapped to DOFs: 1
5: Rank: 4 | Old parameters for member 2: 
5: Rank: 5 | Old parameters for member 2: 
5: Rank: 4 | Number expt sites mapped to DOFs: 1
5: Rank: 5 | Number expt sites mapped to DOFs: 1
5: Getting the perturbed innovation...
5: Applying the Kalman gain...
5: Updating the ensemble members...
5: Done.
5: 60% completed
5: 70% completed
5: 80% completed
5: 90% completed
5: 100% completed
5: Reading the experimental log file...
5: Done. Log entries found for 1 camera(s), with 1 frame(s).
5: Reading the experimental log file...
5: Done. Log entries found for 1 camera(s), with 1 frame(s).
5: Reading the experimental log file...
5: Done. Log entries found for 1 camera(s), with 1 frame(s).
5: Reading the experimental log file...
5: Done. Log entries found for 1 camera(s), with 1 frame(s).
5: Reading the experimental log file...
5: Done. Log entries found for 1 camera(s), with 1 frame(s).
5: Reading the experimental log file...
5: Done. Log entries found for 1 camera(s), with 1 frame(s).
5: Starting the main time stepping loop...
5: Starting the main time stepping loop...
5: Starting the main time stepping loop...
5: Starting the main time stepping loop...
5: Starting the main time stepping loop...
5: Starting the main time stepping loop...
5: 10% completed
5: 10% completed
5: 10% completed
5: 10% completed
5: 10% completed
5: 20% completed
5: 10% completed
5: 20% completed
5: 20% completed
5: 20% completed
5: 30% completed
5: 20% completed
5: 20% completed
5: 30% completed
5: 30% completed
5: 30% completed
5: 40% completed
5: 30% completed
5: 30% completed
5: 40% completed
5: 40% completed
5: 40% completed
5: 50% completed
5: 40% completed
5: 40% completed
5: 50% completed
5: 50% completed
5: 50% completed
5: Performing data assimilation at time 0.12...
5: Rank: 0 | Old parameters for member 0: 
5: Rank: 0 | Old parameters for member 1: 
5: Rank: 0 | Old parameters for member 2: 
5: 50% completed
5: Rank: 0 | Number expt sites mapped to DOFs: 1
5: 50% completed
5: Performing data assimilation at time 0.12...
5: Rank: 0 | Old parameters for member 0: 
5: Rank: 0 | Old parameters for member 1: 
5: Rank: 0 | Old parameters for member 2: 
5: Performing data assimilation at time 0.12...
5: Rank: 0 | Old parameters for member 0: 
5: Rank: 0 | Old parameters for member 1: 
5: Rank: 0 | Old parameters for member 2: 
5: Rank: 0 | Number expt sites mapped to DOFs: 1
5: Rank: 0 | Number expt sites mapped to DOFs: 1
5: Performing data assimilation at time 0.12...
5: Rank: 0 | Old parameters for member 0: 
5: Rank: 0 | Old parameters for member 1: 
5: Rank: 0 | Old parameters for member 2: 
5: Performing data assimilation at time 0.12...
5: Rank: 0 | Old parameters for member 0: 
5: Rank: 0 | Old parameters for member 1: 
5: Rank: 0 | Old parameters for member 2: 
5: Rank: 0 | Number expt sites mapped to DOFs: 1
5: Rank: 0 | Number expt sites mapped to DOFs: 1
5: Performing data assimilation at time 0.12...
5: Rank: 0 | Old parameters for member 0: 
5: Rank: 0 | Old parameters for member 1: 
5: Rank: 0 | Old parameters for member 2: 
5: Rank: 0 | Number expt sites mapped to DOFs: 1
5: Getting the perturbed innovation...
5: Applying the Kalman gain...
5: Getting the perturbed innovation...
5: Applying the Kalman gain...
5: Getting the perturbed innovation...
5: Applying the Kalman gain...
5: Getting the perturbed innovation...
5: Applying the Kalman gain...
5: Getting the perturbed innovation...
5: Applying the Kalman gain...
5: Getting the perturbed innovation...
5: Applying the Kalman gain...
5: Updating the ensemble members...
5: Done.
5: 60% completed
5: Updating the ensemble members...
5: Updating the ensemble members...
5: Done.
5: 60% completed
5: Done.
5: 60% completed
5: Updating the ensemble members...
5: Done.
5: 60% completed
5: 70% completed
5: Updating the ensemble members...
5: Done.
5: 60% completed
5: Updating the ensemble members...
5: Done.
5: 60% completed
5: 70% completed
5: 70% completed
5: 70% completed
5: 80% completed
5: 70% completed
5: 70% completed
5: 80% completed
5: 80% completed
5: 80% completed
5: 90% completed
5: 80% completed
5: 80% completed
5: 90% completed
5: 90% completed
5: 90% completed
5: 90% completed
5: 90% completed
5: 100% completed
5: 100% completed
5: 100% completed
5: 100% completed
5: /var/jenkins/workspace/adamantine-nightly/tests/test_integration_da.cc(148): Leaving test case "integration_3D_da_point_cloud_add_material"; testing time: 2225450us
5: /var/jenkins/workspace/adamantine-nightly/tests/test_integration_da.cc(231): Entering test case "integration_3D_da_ray_add_material"
5: 100% completed
5: 100% completed
5: /var/jenkins/workspace/adamantine-nightly/tests/test_integration_da.cc(148): Leaving test case "integration_3D_da_point_cloud_add_material"; testing time: 2085094us
5: /var/jenkins/workspace/adamantine-nightly/tests/test_integration_da.cc(231): Entering test case "integration_3D_da_ray_add_material"
5: /var/jenkins/workspace/adamantine-nightly/tests/test_integration_da.cc(148): Leaving test case "integration_3D_da_point_cloud_add_material"; testing time: 2134172us
5: /var/jenkins/workspace/adamantine-nightly/tests/test_integration_da.cc(231): Entering test case "integration_3D_da_ray_add_material"
5: /var/jenkins/workspace/adamantine-nightly/tests/test_integration_da.cc(148): Leaving test case "integration_3D_da_point_cloud_add_material"; testing time: 2116849us
5: /var/jenkins/workspace/adamantine-nightly/tests/test_integration_da.cc(231): Entering test case "integration_3D_da_ray_add_material"
5: /var/jenkins/workspace/adamantine-nightly/tests/test_integration_da.cc(148): Leaving test case "integration_3D_da_point_cloud_add_material"; testing time: 1781113us
5: /var/jenkins/workspace/adamantine-nightly/tests/test_integration_da.cc(231): Entering test case "integration_3D_da_ray_add_material"
5: /var/jenkins/workspace/adamantine-nightly/tests/test_integration_da.cc(148): Leaving test case "integration_3D_da_point_cloud_add_material"; testing time: 1969993us
5: /var/jenkins/workspace/adamantine-nightly/tests/test_integration_da.cc(231): Entering test case "integration_3D_da_ray_add_material"
5: Reading the experimental log file...
5: Done. Log entries found for 1 camera(s), with 1 frame(s).
5: Starting the main time stepping loop...
5: 10% completed
5: 20% completed
5: 30% completed
5: 40% completed
5: 50% completed
5: Performing data assimilation at time 0.12...
5: Rank: 0 | Old parameters for member 0: 
5: Rank: 1 | Old parameters for member 0: 
5: Rank: 3 | Old parameters for member 1: 
5: Rank: 2 | Old parameters for member 1: 
5: Rank: 5 | Old parameters for member 2: 
5: Rank: 4 | Old parameters for member 2: 
5: Rank: 1 | Number expt sites mapped to DOFs: 1
5: Rank: 0 | Number expt sites mapped to DOFs: 1
5: Rank: 2 | Number expt sites mapped to DOFs: 1
5: Rank: 3 | Number expt sites mapped to DOFs: 1
5: Rank: 5 | Number expt sites mapped to DOFs: 1
5: Rank: 4 | Number expt sites mapped to DOFs: 1
5: Getting the perturbed innovation...
5: Applying the Kalman gain...
5: Updating the ensemble members...
5: Done.
5: 60% completed
5: 70% completed
5: 80% completed
5: 90% completed
5: 100% completed
5: Reading the experimental log file...
5: Done. Log entries found for 1 camera(s), with 1 frame(s).
5: Reading the experimental log file...
5: Done. Log entries found for 1 camera(s), with 1 frame(s).
5: Reading the experimental log file...
5: Done. Log entries found for 1 camera(s), with 1 frame(s).
5: Reading the experimental log file...
5: Done. Log entries found for 1 camera(s), with 1 frame(s).
5: Reading the experimental log file...
5: Done. Log entries found for 1 camera(s), with 1 frame(s).
5: Reading the experimental log file...
5: Done. Log entries found for 1 camera(s), with 1 frame(s).
5: Starting the main time stepping loop...
5: Starting the main time stepping loop...
5: Starting the main time stepping loop...
5: Starting the main time stepping loop...
5: Starting the main time stepping loop...
5: Starting the main time stepping loop...
5: 10% completed
5: 10% completed
5: 10% completed
5: 10% completed
5: 10% completed
5: 10% completed
5: 20% completed
5: 20% completed
5: 20% completed
5: 20% completed
5: 20% completed
5: 20% completed
5: 30% completed
5: 30% completed
5: 30% completed
5: 30% completed
5: 30% completed
5: 30% completed
5: 40% completed
5: 40% completed
5: 40% completed
5: 40% completed
5: 40% completed
5: 40% completed
5: 50% completed
5: 50% completed
5: 50% completed
5: 50% completed
5: 50% completed
5: 50% completed
5: Performing data assimilation at time 0.12...
5: Performing data assimilation at time 0.12...
5: Rank: 0 | Old parameters for member 0: 
5: Performing data assimilation at time 0.12...
5: Rank: 0 | Old parameters for member 0: 
5: Rank: 0 | Old parameters for member 1: 
5: Rank: 0 | Old parameters for member 2: 
5: Rank: 0 | Old parameters for member 1: 
5: Rank: 0 | Old parameters for member 2: 
5: Rank: 0 | Old parameters for member 0: 
5: Rank: 0 | Old parameters for member 1: 
5: Rank: 0 | Old parameters for member 2: 
5: Performing data assimilation at time 0.12...
5: Rank: 0 | Old parameters for member 0: 
5: Rank: 0 | Old parameters for member 1: 
5: Rank: 0 | Old parameters for member 2: 
5: Rank: 0 | Number expt sites mapped to DOFs: 1
5: Rank: 0 | Number expt sites mapped to DOFs: 1
5: Rank: 0 | Number expt sites mapped to DOFs: 1
5: Rank: 0 | Number expt sites mapped to DOFs: 1
5: Performing data assimilation at time 0.12...
5: Rank: 0 | Old parameters for member 0: 
5: Rank: 0 | Old parameters for member 1: 
5: Rank: 0 | Old parameters for member 2: 
5: Performing data assimilation at time 0.12...
5: Rank: 0 | Old parameters for member 0: 
5: Rank: 0 | Old parameters for member 1: 
5: Rank: 0 | Old parameters for member 2: 
5: Rank: 0 | Number expt sites mapped to DOFs: 1
5: Rank: 0 | Number expt sites mapped to DOFs: 1
5: Getting the perturbed innovation...
5: Getting the perturbed innovation...
5: Applying the Kalman gain...
5: Applying the Kalman gain...
5: Getting the perturbed innovation...
5: Applying the Kalman gain...
5: Getting the perturbed innovation...
5: Applying the Kalman gain...
5: Getting the perturbed innovation...
5: Applying the Kalman gain...
5: Getting the perturbed innovation...
5: Applying the Kalman gain...
5: Updating the ensemble members...
5: Updating the ensemble members...
5: Done.
5: 60% completed
5: Done.
5: 60% completed
5: Updating the ensemble members...
5: Updating the ensemble members...
5: Done.
5: 60% completed
5: Done.
5: 60% completed
5: Updating the ensemble members...
5: Done.
5: 60% completed
5: Updating the ensemble members...
5: Done.
5: 60% completed
5: 70% completed
5: 70% completed
5: 70% completed
5: 70% completed
5: 70% completed
5: 70% completed
5: 80% completed
5: 80% completed
5: 80% completed
5: 80% completed
5: 80% completed
5: 80% completed
5: 90% completed
5: 90% completed
5: 90% completed
5: 90% completed
5: 90% completed
5: 90% completed
5: 100% completed
5: 100% completed
5: 100% completed
5: 100% completed
5: 100% completed
5: 100% completed
5: /var/jenkins/workspace/adamantine-nightly/tests/test_integration_da.cc(231): Leaving test case "integration_3D_da_ray_add_material"; testing time: 1767614us
5: Leaving test module "Integration_Data_Assimilation"; testing time: 50965741us
5: 
5: *** No errors detected
5: /var/jenkins/workspace/adamantine-nightly/tests/test_integration_da.cc(231): Leaving test case "integration_3D_da_ray_add_material"; testing time: 1762849us
5: Leaving test module "Integration_Data_Assimilation"; testing time: 50969823us
5: 
5: *** No errors detected
5: /var/jenkins/workspace/adamantine-nightly/tests/test_integration_da.cc(231): Leaving test case "integration_3D_da_ray_add_material"; testing time: 1818807us
5: Leaving test module "Integration_Data_Assimilation"; testing time: 50979492us
5: 
5: *** No errors detected
5: /var/jenkins/workspace/adamantine-nightly/tests/test_integration_da.cc(231): Leaving test case "integration_3D_da_ray_add_material"; testing time: 1815675us
5: Leaving test module "Integration_Data_Assimilation"; testing time: 50997740us
5: 
5: *** No errors detected
5: /var/jenkins/workspace/adamantine-nightly/tests/test_integration_da.cc(231): Leaving test case "integration_3D_da_ray_add_material"; testing time: 1804683us
5: Leaving test module "Integration_Data_Assimilation"; testing time: 50995962us
5: 
5: *** No errors detected
5: /var/jenkins/workspace/adamantine-nightly/tests/test_integration_da.cc(231): Leaving test case "integration_3D_da_ray_add_material"; testing time: 1796546us
5: Leaving test module "Integration_Data_Assimilation"; testing time: 51002966us
5: 
5: *** No errors detected
5: 
 4/48 Test  #5: test_integration_da_6 ....................   Passed   52.85 sec
test 6
      Start  6: test_closest_source_point_adaptation_1

6: Test command: /usr/bin/mpiexec "-n" "1" "/var/jenkins/workspace/adamantine-nightly/build/bin/test_closest_source_point_adaptation"
6: Working Directory: /var/jenkins/workspace/adamantine-nightly/build/tests
6: Test timeout computed to be: 7200
6: Running 1 test case...
6: Entering test module "ClosestSourcePointAdaptation"
6: /var/jenkins/workspace/adamantine-nightly/tests/test_closest_source_point_adaptation.cc(124): Entering test case "closest_source_point_adaptation"
6: /var/jenkins/workspace/adamantine-nightly/tests/test_closest_source_point_adaptation.cc(124): Leaving test case "closest_source_point_adaptation"; testing time: 9306742us
6: Leaving test module "ClosestSourcePointAdaptation"; testing time: 9306800us
6: 
6: *** No errors detected
6: 
 5/48 Test  #6: test_closest_source_point_adaptation_1 ...   Passed   10.44 sec
test 7
      Start  7: test_closest_source_point_adaptation_2

7: Test command: /usr/bin/mpiexec "-n" "2" "/var/jenkins/workspace/adamantine-nightly/build/bin/test_closest_source_point_adaptation"
7: Working Directory: /var/jenkins/workspace/adamantine-nightly/build/tests
7: Test timeout computed to be: 7200
7: Running 1 test case...
7: Entering test module "ClosestSourcePointAdaptation"
7: /var/jenkins/workspace/adamantine-nightly/tests/test_closest_source_point_adaptation.cc(124): Entering test case "closest_source_point_adaptation"
7: Running 1 test case...
7: Entering test module "ClosestSourcePointAdaptation"
7: /var/jenkins/workspace/adamantine-nightly/tests/test_closest_source_point_adaptation.cc(124): Entering test case "closest_source_point_adaptation"
7: /var/jenkins/workspace/adamantine-nightly/tests/test_closest_source_point_adaptation.cc(124): Leaving test case "closest_source_point_adaptation"; testing time: 6547536us
7: Leaving test module "ClosestSourcePointAdaptation"; testing time: 6547594us
7: 
7: *** No errors detected
7: /var/jenkins/workspace/adamantine-nightly/tests/test_closest_source_point_adaptation.cc(124): Leaving test case "closest_source_point_adaptation"; testing time: 6539594us
7: Leaving test module "ClosestSourcePointAdaptation"; testing time: 6539690us
7: 
7: *** No errors detected
7: 
 6/48 Test  #7: test_closest_source_point_adaptation_2 ...   Passed    7.65 sec
test 8
      Start  8: test_closest_source_point_adaptation_3

8: Test command: /usr/bin/mpiexec "-n" "3" "/var/jenkins/workspace/adamantine-nightly/build/bin/test_closest_source_point_adaptation"
8: Working Directory: /var/jenkins/workspace/adamantine-nightly/build/tests
8: Test timeout computed to be: 7200
8: Running 1 test case...
8: Entering test module "ClosestSourcePointAdaptation"
8: /var/jenkins/workspace/adamantine-nightly/tests/test_closest_source_point_adaptation.cc(124): Entering test case "closest_source_point_adaptation"
8: Running 1 test case...
8: Entering test module "ClosestSourcePointAdaptation"
8: /var/jenkins/workspace/adamantine-nightly/tests/test_closest_source_point_adaptation.cc(124): Entering test case "closest_source_point_adaptation"
8: Running 1 test case...
8: Entering test module "ClosestSourcePointAdaptation"
8: /var/jenkins/workspace/adamantine-nightly/tests/test_closest_source_point_adaptation.cc(124): Entering test case "closest_source_point_adaptation"
8: 
8: *** No errors detected
8: /var/jenkins/workspace/adamantine-nightly/tests/test_closest_source_point_adaptation.cc(124): Leaving test case "closest_source_point_adaptation"; testing time: 5815595us
8: Leaving test module "ClosestSourcePointAdaptation"; testing time: 5815657us
8: /var/jenkins/workspace/adamantine-nightly/tests/test_closest_source_point_adaptation.cc(124): Leaving test case "closest_source_point_adaptation"; testing time: 5817815us
8: Leaving test module "ClosestSourcePointAdaptation"; testing time: 5817867us
8: 
8: *** No errors detected
8: /var/jenkins/workspace/adamantine-nightly/tests/test_closest_source_point_adaptation.cc(124): Leaving test case "closest_source_point_adaptation"; testing time: 5814985us
8: Leaving test module "ClosestSourcePointAdaptation"; testing time: 5815081us
8: 
8: *** No errors detected
8: 
 7/48 Test  #8: test_closest_source_point_adaptation_3 ...   Passed    7.04 sec
test 9
      Start  9: test_closest_source_point_adaptation_6

9: Test command: /usr/bin/mpiexec "-n" "6" "/var/jenkins/workspace/adamantine-nightly/build/bin/test_closest_source_point_adaptation"
9: Working Directory: /var/jenkins/workspace/adamantine-nightly/build/tests
9: Test timeout computed to be: 7200
9: Running 1 test case...
9: Entering test module "ClosestSourcePointAdaptation"
9: /var/jenkins/workspace/adamantine-nightly/tests/test_closest_source_point_adaptation.cc(124): Entering test case "closest_source_point_adaptation"
9: Running 1 test case...
9: Entering test module "ClosestSourcePointAdaptation"
9: /var/jenkins/workspace/adamantine-nightly/tests/test_closest_source_point_adaptation.cc(124): Entering test case "closest_source_point_adaptation"
9: Running 1 test case...
9: Entering test module "ClosestSourcePointAdaptation"
9: /var/jenkins/workspace/adamantine-nightly/tests/test_closest_source_point_adaptation.cc(124): Entering test case "closest_source_point_adaptation"
9: Running 1 test case...
9: Entering test module "ClosestSourcePointAdaptation"
9: /var/jenkins/workspace/adamantine-nightly/tests/test_closest_source_point_adaptation.cc(124): Entering test case "closest_source_point_adaptation"
9: Running 1 test case...
9: Entering test module "ClosestSourcePointAdaptation"
9: /var/jenkins/workspace/adamantine-nightly/tests/test_closest_source_point_adaptation.cc(124): Entering test case "closest_source_point_adaptation"
9: Running 1 test case...
9: Entering test module "ClosestSourcePointAdaptation"
9: /var/jenkins/workspace/adamantine-nightly/tests/test_closest_source_point_adaptation.cc(124): Entering test case "closest_source_point_adaptation"
9: /var/jenkins/workspace/adamantine-nightly/tests/test_closest_source_point_adaptation.cc(124): Leaving test case "closest_source_point_adaptation"; testing time: 3635545us
9: Leaving test module "ClosestSourcePointAdaptation"; testing time: 3635613us
9: 
9: *** No errors detected
9: /var/jenkins/workspace/adamantine-nightly/tests/test_closest_source_point_adaptation.cc(124): Leaving test case "closest_source_point_adaptation"; testing time: 3615552us
9: Leaving test module "ClosestSourcePointAdaptation"; testing time: 3615611us
9: /var/jenkins/workspace/adamantine-nightly/tests/test_closest_source_point_adaptation.cc(124): Leaving test case "closest_source_point_adaptation"; testing time: 3611826us
9: 
9: *** No errors detected
9: Leaving test module "ClosestSourcePointAdaptation"; testing time: 3611891us
9: /var/jenkins/workspace/adamantine-nightly/tests/test_closest_source_point_adaptation.cc(124): Leaving test case "closest_source_point_adaptation"; testing time: 3623402us
9: Leaving test module "ClosestSourcePointAdaptation"; testing time: 3623483us
9: 
9: *** No errors detected
9: /var/jenkins/workspace/adamantine-nightly/tests/test_closest_source_point_adaptation.cc(124): Leaving test case "closest_source_point_adaptation"; testing time: 3609628us
9: 
9: *** No errors detected
9: Leaving test module "ClosestSourcePointAdaptation"; testing time: 3609721us
9: 
9: *** No errors detected
9: /var/jenkins/workspace/adamantine-nightly/tests/test_closest_source_point_adaptation.cc(124): Leaving test case "closest_source_point_adaptation"; testing time: 3611885us
9: Leaving test module "ClosestSourcePointAdaptation"; testing time: 3611955us
9: 
9: *** No errors detected
9: 
 8/48 Test  #9: test_closest_source_point_adaptation_6 ...   Passed    5.39 sec
test 10
      Start 10: test_data_assimilator_1

10: Test command: /usr/bin/mpiexec "-n" "1" "/var/jenkins/workspace/adamantine-nightly/build/bin/test_data_assimilator"
10: Working Directory: /var/jenkins/workspace/adamantine-nightly/build/tests
10: Test timeout computed to be: 7200
10: Running 1 test case...
10: Entering test module "DataAssimilator"
10: /var/jenkins/workspace/adamantine-nightly/tests/test_data_assimilator.cc(948): Entering test case "data_assimilator"
10: Getting the perturbed innovation...
10: Applying the Kalman gain...
10: Updating the ensemble members...
10: Getting the perturbed innovation...
10: Applying the Kalman gain...
10: Updating the ensemble members...
10: /var/jenkins/workspace/adamantine-nightly/tests/test_data_assimilator.cc(948): Leaving test case "data_assimilator"; testing time: 116526us
10: Leaving test module "DataAssimilator"; testing time: 116564us
10: 
10: *** No errors detected
10: 
 9/48 Test #10: test_data_assimilator_1 ..................   Passed    1.24 sec
test 11
      Start 11: test_experimental_data_1

11: Test command: /usr/bin/mpiexec "-n" "1" "/var/jenkins/workspace/adamantine-nightly/build/bin/test_experimental_data"
11: Working Directory: /var/jenkins/workspace/adamantine-nightly/build/tests
11: Test timeout computed to be: 7200
11: Running 6 test cases...
11: Entering test module "ExperimentaData"
11: /var/jenkins/workspace/adamantine-nightly/tests/test_experimental_data.cc(22): Entering test case "read_experimental_data_point_cloud_from_file"
11: /var/jenkins/workspace/adamantine-nightly/tests/test_experimental_data.cc(22): Leaving test case "read_experimental_data_point_cloud_from_file"; testing time: 13095us
11: /var/jenkins/workspace/adamantine-nightly/tests/test_experimental_data.cc(75): Entering test case "set_vector_with_experimental_data_point_cloud"
11: /var/jenkins/workspace/adamantine-nightly/tests/test_experimental_data.cc(75): Leaving test case "set_vector_with_experimental_data_point_cloud"; testing time: 7297us
11: /var/jenkins/workspace/adamantine-nightly/tests/test_experimental_data.cc(138): Entering test case "read_experimental_data_ray_tracing_from_file"
11: /var/jenkins/workspace/adamantine-nightly/tests/test_experimental_data.cc(138): Leaving test case "read_experimental_data_ray_tracing_from_file"; testing time: 5529us
11: /var/jenkins/workspace/adamantine-nightly/tests/test_experimental_data.cc(199): Entering test case "timestamp"
11: /var/jenkins/workspace/adamantine-nightly/tests/test_experimental_data.cc(199): Leaving test case "timestamp"; testing time: 875us
11: /var/jenkins/workspace/adamantine-nightly/tests/test_experimental_data.cc(225): Entering test case "project_ray_data_on_mesh"
11: /var/jenkins/workspace/adamantine-nightly/tests/test_experimental_data.cc(225): Leaving test case "project_ray_data_on_mesh"; testing time: 30842647us
11: /var/jenkins/workspace/adamantine-nightly/tests/test_experimental_data.cc(302): Entering test case "project_ray_data_on_nonaligned_mesh"
11: /var/jenkins/workspace/adamantine-nightly/tests/test_experimental_data.cc(302): Leaving test case "project_ray_data_on_nonaligned_mesh"; testing time: 24760us
11: Leaving test module "ExperimentaData"; testing time: 30895025us
11: 
11: *** No errors detected
11: 
10/48 Test #11: test_experimental_data_1 .................   Passed   32.09 sec
test 12
      Start 12: test_geometry_1

12: Test command: /usr/bin/mpiexec "-n" "1" "/var/jenkins/workspace/adamantine-nightly/build/bin/test_geometry"
12: Working Directory: /var/jenkins/workspace/adamantine-nightly/build/tests
12: Test timeout computed to be: 7200
12: Running 6 test cases...
12: Entering test module "Geometry"
12: /var/jenkins/workspace/adamantine-nightly/tests/test_geometry.cc(61): Entering test case "geometry_2D"
12: /var/jenkins/workspace/adamantine-nightly/tests/test_geometry.cc(61): Leaving test case "geometry_2D"; testing time: 7554us
12: /var/jenkins/workspace/adamantine-nightly/tests/test_geometry.cc(86): Entering test case "geometry_3D"
12: /var/jenkins/workspace/adamantine-nightly/tests/test_geometry.cc(86): Leaving test case "geometry_3D"; testing time: 10003us
12: /var/jenkins/workspace/adamantine-nightly/tests/test_geometry.cc(113): Entering test case "geometry_shifted_origin"
12: /var/jenkins/workspace/adamantine-nightly/tests/test_geometry.cc(113): Leaving test case "geometry_shifted_origin"; testing time: 8108us
12: /var/jenkins/workspace/adamantine-nightly/tests/test_geometry.cc(148): Entering test case "gmsh"
12: /var/jenkins/workspace/adamantine-nightly/tests/test_geometry.cc(148): Leaving test case "gmsh"; testing time: 77821us
12: /var/jenkins/workspace/adamantine-nightly/tests/test_geometry.cc(171): Entering test case "read_stl"
12: /var/jenkins/workspace/adamantine-nightly/tests/test_geometry.cc(171): Leaving test case "read_stl"; testing time: 9373us
12: /var/jenkins/workspace/adamantine-nightly/tests/test_geometry.cc(232): Entering test case "geometry_stl_mesh"
12: /var/jenkins/workspace/adamantine-nightly/tests/test_geometry.cc(232): Leaving test case "geometry_stl_mesh"; testing time: 8008us
12: Leaving test module "Geometry"; testing time: 121511us
12: 
12: *** No errors detected
12: 
11/48 Test #12: test_geometry_1 ..........................   Passed    1.32 sec
test 13
      Start 13: test_heat_source_1

13: Test command: /usr/bin/mpiexec "-n" "1" "/var/jenkins/workspace/adamantine-nightly/build/bin/test_heat_source"
13: Working Directory: /var/jenkins/workspace/adamantine-nightly/build/tests
13: Test timeout computed to be: 7200
13: Running 4 test cases...
13: Entering test module "HeatSource"
13: /var/jenkins/workspace/adamantine-nightly/tests/test_heat_source.cc(19): Entering test case "heat_source_value_2d"
13: /var/jenkins/workspace/adamantine-nightly/tests/test_heat_source.cc(19): Leaving test case "heat_source_value_2d"; testing time: 4793us
13: /var/jenkins/workspace/adamantine-nightly/tests/test_heat_source.cc(95): Entering test case "heat_source_vectorized_value_2d"
13: /var/jenkins/workspace/adamantine-nightly/tests/test_heat_source.cc(95): Leaving test case "heat_source_vectorized_value_2d"; testing time: 215us
13: /var/jenkins/workspace/adamantine-nightly/tests/test_heat_source.cc(220): Entering test case "heat_source_value_3d"
13: /var/jenkins/workspace/adamantine-nightly/tests/test_heat_source.cc(220): Leaving test case "heat_source_value_3d"; testing time: 233us
13: /var/jenkins/workspace/adamantine-nightly/tests/test_heat_source.cc(286): Entering test case "heat_source_vectorized_value_3d"
13: /var/jenkins/workspace/adamantine-nightly/tests/test_heat_source.cc(286): Leaving test case "heat_source_vectorized_value_3d"; testing time: 194us
13: 
13: Leaving test module "HeatSource"; testing time: 6145us
13: *** No errors detected
13: 
12/48 Test #13: test_heat_source_1 .......................   Passed    1.19 sec
test 14
      Start 14: test_integration_3d_device_1

14: Test command: /usr/bin/mpiexec "-n" "1" "/var/jenkins/workspace/adamantine-nightly/build/bin/test_integration_3d_device"
14: Working Directory: /var/jenkins/workspace/adamantine-nightly/build/tests
14: Test timeout computed to be: 7200
14: Running 2 test cases...
14: Entering test module "Integration_3D_Device"
14: /var/jenkins/workspace/adamantine-nightly/tests/test_integration_3d_device.cc(19): Entering test case "integration_3D_device"
14: 10% completed
14: 20% completed
14: 30% completed
14: 40% completed
14: 50% completed
14: 60% completed
14: 70% completed
14: 80% completed
14: 90% completed
14: 100% completed
14: /var/jenkins/workspace/adamantine-nightly/tests/test_integration_3d_device.cc(19): Leaving test case "integration_3D_device"; testing time: 324132357us
14: /var/jenkins/workspace/adamantine-nightly/tests/test_integration_3d_device.cc(46): Entering test case "integration_3D_checkpoint_restart_device"
14: 10% completed
14: 20% completed
14: 30% completed
14: 40% completed
14: 50% completed
14: 60% completed
14: 70% completed
14: Checkpoint reached
14: 80% completed
14: 90% completed
14: 100% completed
14: Restarting from file
14: 80% completed
14: 90% completed
14: 100% completed
14: /var/jenkins/workspace/adamantine-nightly/tests/test_integration_3d_device.cc(46): Leaving test case "integration_3D_checkpoint_restart_device"; testing time: 118236841us
14: Leaving test module "Integration_3D_Device"; testing time: 442369794us
14: 
14: *** No errors detected
14: 
13/48 Test #14: test_integration_3d_device_1 .............   Passed  443.59 sec
test 15
      Start 15: test_material_property_1

15: Test command: /usr/bin/mpiexec "-n" "1" "/var/jenkins/workspace/adamantine-nightly/build/bin/test_material_property"
15: Working Directory: /var/jenkins/workspace/adamantine-nightly/build/tests
15: Test timeout computed to be: 7200
15: Running 4 test cases...
15: Entering test module "MaterialProperty"
15: /var/jenkins/workspace/adamantine-nightly/tests/test_material_property.cc(13): Entering test case "material_property_host"
15: /var/jenkins/workspace/adamantine-nightly/tests/test_material_property.cc(13): Leaving test case "material_property_host"; testing time: 20460us
15: /var/jenkins/workspace/adamantine-nightly/tests/test_material_property.cc(18): Entering test case "ratios_host"
15: /var/jenkins/workspace/adamantine-nightly/tests/test_material_property.cc(18): Leaving test case "ratios_host"; testing time: 7413us
15: /var/jenkins/workspace/adamantine-nightly/tests/test_material_property.cc(20): Entering test case "material_property_table_host"
15: /var/jenkins/workspace/adamantine-nightly/tests/test_material_property.cc(20): Leaving test case "material_property_table_host"; testing time: 10970us
15: /var/jenkins/workspace/adamantine-nightly/tests/test_material_property.cc(25): Entering test case "material_property_polynomials_host"
15: /var/jenkins/workspace/adamantine-nightly/tests/test_material_property.cc(25): Leaving test case "material_property_polynomials_host"; testing time: 10126us
15: Leaving test module "MaterialProperty"; testing time: 49109us
15: 
15: *** No errors detected
15: 
14/48 Test #15: test_material_property_1 .................   Passed    1.20 sec
test 16
      Start 16: test_material_property_device_1

16: Test command: /usr/bin/mpiexec "-n" "1" "/var/jenkins/workspace/adamantine-nightly/build/bin/test_material_property_device"
16: Working Directory: /var/jenkins/workspace/adamantine-nightly/build/tests
16: Test timeout computed to be: 7200
16: Running 4 test cases...
16: Entering test module "MaterialPropertyDevice"
16: /var/jenkins/workspace/adamantine-nightly/tests/test_material_property_device.cc(13): Entering test case "material_property_device"
16: /var/jenkins/workspace/adamantine-nightly/tests/test_material_property_device.cc(13): Leaving test case "material_property_device"; testing time: 37600us
16: /var/jenkins/workspace/adamantine-nightly/tests/test_material_property_device.cc(18): Entering test case "ratios_device"
16: /var/jenkins/workspace/adamantine-nightly/tests/test_material_property_device.cc(18): Leaving test case "ratios_device"; testing time: 16403us
16: /var/jenkins/workspace/adamantine-nightly/tests/test_material_property_device.cc(20): Entering test case "material_property_table_device"
16: /var/jenkins/workspace/adamantine-nightly/tests/test_material_property_device.cc(20): Leaving test case "material_property_table_device"; testing time: 11030us
16: /var/jenkins/workspace/adamantine-nightly/tests/test_material_property_device.cc(25): Entering test case "material_property_polynomials_device"
16: /var/jenkins/workspace/adamantine-nightly/tests/test_material_property_device.cc(25): Leaving test case "material_property_polynomials_device"; testing time: 10904us
16: Leaving test module "MaterialPropertyDevice"; testing time: 76095us
16: 
16: *** No errors detected
16: 
15/48 Test #16: test_material_property_device_1 ..........   Passed    1.06 sec
test 17
      Start 17: test_mechanical_operator_1

17: Test command: /usr/bin/mpiexec "-n" "1" "/var/jenkins/workspace/adamantine-nightly/build/bin/test_mechanical_operator"
17: Working Directory: /var/jenkins/workspace/adamantine-nightly/build/tests
17: Test timeout computed to be: 7200
17: Running 2 test cases...
17: Entering test module "MechanicalOperator"
17: /var/jenkins/workspace/adamantine-nightly/tests/test_mechanical_operator.cc(71): Entering test case "elastostatic"
17: /var/jenkins/workspace/adamantine-nightly/tests/test_mechanical_operator.cc(71): Leaving test case "elastostatic"; testing time: 9772046us
17: /var/jenkins/workspace/adamantine-nightly/tests/test_mechanical_operator.cc(303): Entering test case "thermoelastic"
17: /var/jenkins/workspace/adamantine-nightly/tests/test_mechanical_operator.cc(303): Leaving test case "thermoelastic"; testing time: 2701896us
17: Leaving test module "MechanicalOperator"; testing time: 12474432us
17: 
17: *** No errors detected
17: 
16/48 Test #17: test_mechanical_operator_1 ...............   Passed   13.44 sec
test 18
      Start 18: test_mechanical_physics_1

18: Test command: /usr/bin/mpiexec "-n" "1" "/var/jenkins/workspace/adamantine-nightly/build/bin/test_mechanical_physics"
18: Working Directory: /var/jenkins/workspace/adamantine-nightly/build/tests
18: Test timeout computed to be: 7200
18: Running 7 test cases...
18: Entering test module "MechanicalPhysics"
18: /var/jenkins/workspace/adamantine-nightly/tests/test_mechanical_physics.cc(197): Entering test case "elastostatic"
18: /var/jenkins/workspace/adamantine-nightly/tests/test_mechanical_physics.cc(197): Leaving test case "elastostatic"; testing time: 427150us
18: /var/jenkins/workspace/adamantine-nightly/tests/test_mechanical_physics.cc(267): Entering test case "fe_nothing"
18: /var/jenkins/workspace/adamantine-nightly/tests/test_mechanical_physics.cc(267): Leaving test case "fe_nothing"; testing time: 414384us
18: /var/jenkins/workspace/adamantine-nightly/tests/test_mechanical_physics.cc(534): Entering test case "thermoelastic_eshelby"
18: /var/jenkins/workspace/adamantine-nightly/tests/test_mechanical_physics.cc(534): Leaving test case "thermoelastic_eshelby"; testing time: 38123267us
18: /var/jenkins/workspace/adamantine-nightly/tests/test_mechanical_physics.cc(562): Entering test case "elastoplastic_radial_return"
18: /var/jenkins/workspace/adamantine-nightly/tests/test_mechanical_physics.cc(562): Leaving test case "elastoplastic_radial_return"; testing time: 39538us
18: /var/jenkins/workspace/adamantine-nightly/tests/test_mechanical_physics.cc(668): Entering test case "cell_data_transfer_refine_coarsen"
18: /var/jenkins/workspace/adamantine-nightly/tests/test_mechanical_physics.cc(668): Leaving test case "cell_data_transfer_refine_coarsen"; testing time: 591037us
18: /var/jenkins/workspace/adamantine-nightly/tests/test_mechanical_physics.cc(777): Entering test case "thermoelastic_stress_uniform_heating"
18: /var/jenkins/workspace/adamantine-nightly/tests/test_mechanical_physics.cc(777): Leaving test case "thermoelastic_stress_uniform_heating"; testing time: 45158us
18: /var/jenkins/workspace/adamantine-nightly/tests/test_mechanical_physics.cc(866): Entering test case "thermoelastoplastic_radial_return"
18: /var/jenkins/workspace/adamantine-nightly/tests/test_mechanical_physics.cc(866): Leaving test case "thermoelastoplastic_radial_return"; testing time: 49088us
18: Leaving test module "MechanicalPhysics"; testing time: 39690167us
18: 
18: *** No errors detected
18: 
17/48 Test #18: test_mechanical_physics_1 ................   Passed   40.54 sec
test 19
      Start 19: test_post_processor_1

19: Test command: /usr/bin/mpiexec "-n" "1" "/var/jenkins/workspace/adamantine-nightly/build/bin/test_post_processor"
19: Working Directory: /var/jenkins/workspace/adamantine-nightly/build/tests
19: Test timeout computed to be: 7200
19: Running 2 test cases...
19: Entering test module "PostProcessor"
19: /var/jenkins/workspace/adamantine-nightly/tests/test_post_processor.cc(27): Entering test case "thermal_post_processor"
19: /var/jenkins/workspace/adamantine-nightly/tests/test_post_processor.cc(27): Leaving test case "thermal_post_processor"; testing time: 55194us
19: /var/jenkins/workspace/adamantine-nightly/tests/test_post_processor.cc(149): Entering test case "mechanical_post_processor"
19: /var/jenkins/workspace/adamantine-nightly/tests/test_post_processor.cc(149): Leaving test case "mechanical_post_processor"; testing time: 2759776us
19: Leaving test module "PostProcessor"; testing time: 2815054us
19: 
19: *** No errors detected
19: 
18/48 Test #19: test_post_processor_1 ....................   Passed    3.66 sec
test 20
      Start 20: test_quaternion_1

20: Test command: /usr/bin/mpiexec "-n" "1" "/var/jenkins/workspace/adamantine-nightly/build/bin/test_quaternion"
20: Working Directory: /var/jenkins/workspace/adamantine-nightly/build/tests
20: Test timeout computed to be: 7200
20: Running 1 test case...
20: Entering test module "Quaternion"
20: /var/jenkins/workspace/adamantine-nightly/tests/test_quaternion.cc(11): Entering test case "rotation"
20: /var/jenkins/workspace/adamantine-nightly/tests/test_quaternion.cc(11): Leaving test case "rotation"; testing time: 147us
20: Leaving test module "Quaternion"; testing time: 176us
20: 
20: *** No errors detected
20: 
19/48 Test #20: test_quaternion_1 ........................   Passed    0.99 sec
test 21
      Start 21: test_scan_path_1

21: Test command: /usr/bin/mpiexec "-n" "1" "/var/jenkins/workspace/adamantine-nightly/build/bin/test_scan_path"
21: Working Directory: /var/jenkins/workspace/adamantine-nightly/build/tests
21: Test timeout computed to be: 7200
21: Running 3 test cases...
21: Entering test module "ScanPath"
21: /var/jenkins/workspace/adamantine-nightly/tests/test_scan_path.cc(36): Entering test case "scan_path"
21: /var/jenkins/workspace/adamantine-nightly/tests/test_scan_path.cc(36): Leaving test case "scan_path"; testing time: 1298us
21: /var/jenkins/workspace/adamantine-nightly/tests/test_scan_path.cc(78): Entering test case "scan_path_location"
21: /var/jenkins/workspace/adamantine-nightly/tests/test_scan_path.cc(78): Leaving test case "scan_path_location"; testing time: 131us
21: /var/jenkins/workspace/adamantine-nightly/tests/test_scan_path.cc(106): Entering test case "five_axis"
21: /var/jenkins/workspace/adamantine-nightly/tests/test_scan_path.cc(106): Leaving test case "five_axis"; testing time: 842us
21: Leaving test module "ScanPath"; testing time: 2862us
21: 
21: *** No errors detected
21: 
20/48 Test #21: test_scan_path_1 .........................   Passed    1.02 sec
test 22
      Start 22: test_thermal_operator_1

22: Test command: /usr/bin/mpiexec "-n" "1" "/var/jenkins/workspace/adamantine-nightly/build/bin/test_thermal_operator"
22: Working Directory: /var/jenkins/workspace/adamantine-nightly/build/tests
22: Test timeout computed to be: 7200
22: Running 6 test cases...
22: Entering test module "ThermalOperator"
22: /var/jenkins/workspace/adamantine-nightly/tests/test_thermal_operator.cc(41): Entering test case "thermal_operator"
22: /var/jenkins/workspace/adamantine-nightly/tests/test_thermal_operator.cc(41): Leaving test case "thermal_operator"; testing time: 35846us
22: /var/jenkins/workspace/adamantine-nightly/tests/test_thermal_operator.cc(148): Entering test case "spmv"
22: /var/jenkins/workspace/adamantine-nightly/tests/test_thermal_operator.cc(148): Leaving test case "spmv"; testing time: 100662us
22: /var/jenkins/workspace/adamantine-nightly/tests/test_thermal_operator.cc(265): Entering test case "spmv_anisotropic"
22: /var/jenkins/workspace/adamantine-nightly/tests/test_thermal_operator.cc(265): Leaving test case "spmv_anisotropic"; testing time: 97510us
22: /var/jenkins/workspace/adamantine-nightly/tests/test_thermal_operator.cc(415): Entering test case "spmv_anisotropic_angle"
22: /var/jenkins/workspace/adamantine-nightly/tests/test_thermal_operator.cc(415): Leaving test case "spmv_anisotropic_angle"; testing time: 523574us
22: /var/jenkins/workspace/adamantine-nightly/tests/test_thermal_operator.cc(580): Entering test case "spmv_rad"
22: /var/jenkins/workspace/adamantine-nightly/tests/test_thermal_operator.cc(580): Leaving test case "spmv_rad"; testing time: 647772us
22: /var/jenkins/workspace/adamantine-nightly/tests/test_thermal_operator.cc(772): Entering test case "spmv_conv"
22: /var/jenkins/workspace/adamantine-nightly/tests/test_thermal_operator.cc(772): Leaving test case "spmv_conv"; testing time: 612610us
22: Leaving test module "ThermalOperator"; testing time: 2019673us
22: 
22: *** No errors detected
22: 
21/48 Test #22: test_thermal_operator_1 ..................   Passed    2.88 sec
test 23
      Start 23: test_thermal_operator_device_1

23: Test command: /usr/bin/mpiexec "-n" "1" "/var/jenkins/workspace/adamantine-nightly/build/bin/test_thermal_operator_device"
23: Working Directory: /var/jenkins/workspace/adamantine-nightly/build/tests
23: Test timeout computed to be: 7200
23: Running 4 test cases...
23: Entering test module "ThermalOperatorDevice"
23: /var/jenkins/workspace/adamantine-nightly/tests/test_thermal_operator_device.cc(31): Entering test case "thermal_operator_dev"
23: /var/jenkins/workspace/adamantine-nightly/tests/test_thermal_operator_device.cc(31): Leaving test case "thermal_operator_dev"; testing time: 82168us
23: /var/jenkins/workspace/adamantine-nightly/tests/test_thermal_operator_device.cc(124): Entering test case "spmv"
23: /var/jenkins/workspace/adamantine-nightly/tests/test_thermal_operator_device.cc(124): Leaving test case "spmv"; testing time: 50015us
23: /var/jenkins/workspace/adamantine-nightly/tests/test_thermal_operator_device.cc(237): Entering test case "mf_spmv"
23: /var/jenkins/workspace/adamantine-nightly/tests/test_thermal_operator_device.cc(237): Leaving test case "mf_spmv"; testing time: 740406us
23: /var/jenkins/workspace/adamantine-nightly/tests/test_thermal_operator_device.cc(375): Entering test case "spmv_anisotropic_angle"
23: 
23: *** No errors detected
23: /var/jenkins/workspace/adamantine-nightly/tests/test_thermal_operator_device.cc(375): Leaving test case "spmv_anisotropic_angle"; testing time: 206628us
23: Leaving test module "ThermalOperatorDevice"; testing time: 1080436us
23: 
22/48 Test #23: test_thermal_operator_device_1 ...........   Passed    1.91 sec
test 24
      Start 24: test_thermal_physics_device_1

24: Test command: /usr/bin/mpiexec "-n" "1" "/var/jenkins/workspace/adamantine-nightly/build/bin/test_thermal_physics_device"
24: Working Directory: /var/jenkins/workspace/adamantine-nightly/build/tests
24: Test timeout computed to be: 7200
24: Running 4 test cases...
24: Entering test module "ThermalPhysicsDevice"
24: /var/jenkins/workspace/adamantine-nightly/tests/test_thermal_physics_device.cc(13): Entering test case "thermal_2d_explicit_device"
24: /var/jenkins/workspace/adamantine-nightly/tests/test_thermal_physics_device.cc(13): Leaving test case "thermal_2d_explicit_device"; testing time: 90076us
24: /var/jenkins/workspace/adamantine-nightly/tests/test_thermal_physics_device.cc(26): Entering test case "thermal_2d_manufactured_solution_device"
24: /var/jenkins/workspace/adamantine-nightly/tests/test_thermal_physics_device.cc(26): Leaving test case "thermal_2d_manufactured_solution_device"; testing time: 23345us
24: /var/jenkins/workspace/adamantine-nightly/tests/test_thermal_physics_device.cc(31): Entering test case "initial_temperature_device"
24: /var/jenkins/workspace/adamantine-nightly/tests/test_thermal_physics_device.cc(31): Leaving test case "initial_temperature_device"; testing time: 5428us
24: /var/jenkins/workspace/adamantine-nightly/tests/test_thermal_physics_device.cc(36): Entering test case "energy_conservation_device"
24: /var/jenkins/workspace/adamantine-nightly/tests/test_thermal_physics_device.cc(36): Leaving test case "energy_conservation_device"; testing time: 23960977us
24: Leaving test module "ThermalPhysicsDevice"; testing time: 24080013us
24: 
24: *** No errors detected
24: 
23/48 Test #24: test_thermal_physics_device_1 ............   Passed   24.91 sec
test 25
      Start 25: test_timer_1

25: Test command: /usr/bin/mpiexec "-n" "1" "/var/jenkins/workspace/adamantine-nightly/build/bin/test_timer"
25: Working Directory: /var/jenkins/workspace/adamantine-nightly/build/tests
25: Test timeout computed to be: 7200
25: Running 1 test case...
25: Entering test module "Timer"
25: /var/jenkins/workspace/adamantine-nightly/tests/test_timer.cc(15): Entering test case "test_timer"
25: /var/jenkins/workspace/adamantine-nightly/tests/test_timer.cc(15): Leaving test case "test_timer"; testing time: 600371us
25: Leaving test module "Timer"; testing time: 600422us
25: 
25: *** No errors detected
25: 
24/48 Test #25: test_timer_1 .............................   Passed    1.47 sec
test 26
      Start 26: test_utils_1

26: Test command: /usr/bin/mpiexec "-n" "1" "/var/jenkins/workspace/adamantine-nightly/build/bin/test_utils"
26: Working Directory: /var/jenkins/workspace/adamantine-nightly/build/tests
26: Test timeout computed to be: 7200
26: Running 1 test case...
26: Entering test module "utils"
26: /var/jenkins/workspace/adamantine-nightly/tests/test_utils.cc(11): Entering test case "utils"
26: /var/jenkins/workspace/adamantine-nightly/tests/test_utils.cc(11): Leaving test case "utils"; testing time: 166us
26: Leaving test module "utils"; testing time: 191us
26: 
26: *** No errors detected
26: 
25/48 Test #26: test_utils_1 .............................   Passed    0.84 sec
test 27
      Start 27: test_validate_input_database_1

27: Test command: /usr/bin/mpiexec "-n" "1" "/var/jenkins/workspace/adamantine-nightly/build/bin/test_validate_input_database"
27: Working Directory: /var/jenkins/workspace/adamantine-nightly/build/tests
27: Test timeout computed to be: 7200
27: Running 3 test cases...
27: Entering test module "validate_input_database"
27: /var/jenkins/workspace/adamantine-nightly/tests/test_validate_input_database.cc(14): Entering test case "expected_passes"
27: Test case expected_passes did not check any assertions
27: /var/jenkins/workspace/adamantine-nightly/tests/test_validate_input_database.cc(14): Leaving test case "expected_passes"; testing time: 432us
27: /var/jenkins/workspace/adamantine-nightly/tests/test_validate_input_database.cc(50): Entering test case "parse_test_input_files"
27: Test case parse_test_input_files did not check any assertions
27: /var/jenkins/workspace/adamantine-nightly/tests/test_validate_input_database.cc(50): Leaving test case "parse_test_input_files"; testing time: 4544us
27: /var/jenkins/workspace/adamantine-nightly/tests/test_validate_input_database.cc(71): Entering test case "expected_failures"
27: /var/jenkins/workspace/adamantine-nightly/tests/test_validate_input_database.cc(71): Leaving test case "expected_failures"; testing time: 9744us
27: Leaving test module "validate_input_database"; testing time: 14819us
27: 
27: *** No errors detected
27: 
26/48 Test #27: test_validate_input_database_1 ...........   Passed    0.82 sec
test 28
      Start 28: test_integration_2d_1

28: Test command: /usr/bin/mpiexec "-n" "1" "/var/jenkins/workspace/adamantine-nightly/build/bin/test_integration_2d"
28: Working Directory: /var/jenkins/workspace/adamantine-nightly/build/tests
28: Test timeout computed to be: 7200
28: Running 3 test cases...
28: Entering test module "Integration_2D"
28: /var/jenkins/workspace/adamantine-nightly/tests/test_integration_2d.cc(19): Entering test case "integration_2D"
28: 10% completed
28: 20% completed
28: 30% completed
28: 40% completed
28: 50% completed
28: 60% completed
28: 70% completed
28: 80% completed
28: 90% completed
28: 100% completed
28: /var/jenkins/workspace/adamantine-nightly/tests/test_integration_2d.cc(19): Leaving test case "integration_2D"; testing time: 1356198us
28: /var/jenkins/workspace/adamantine-nightly/tests/test_integration_2d.cc(46): Entering test case "integration_2D_ensemble"
28: Starting the main time stepping loop...
28: 10% completed
28: 20% completed
28: 30% completed
28: 40% completed
28: 50% completed
28: 60% completed
28: 70% completed
28: 80% completed
28: 90% completed
28: 100% completed
28: /var/jenkins/workspace/adamantine-nightly/tests/test_integration_2d.cc(46): Leaving test case "integration_2D_ensemble"; testing time: 4011817us
28: /var/jenkins/workspace/adamantine-nightly/tests/test_integration_2d.cc(78): Entering test case "integration_2D_units"
28: 10% completed
28: 20% completed
28: 30% completed
28: 40% completed
28: 50% completed
28: 60% completed
28: 70% completed
28: 80% completed
28: 90% completed
28: 100% completed
28: /var/jenkins/workspace/adamantine-nightly/tests/test_integration_2d.cc(78): Leaving test case "integration_2D_units"; testing time: 1448251us
28: Leaving test module "Integration_2D"; testing time: 6816950us
28: 
28: *** No errors detected
28: 
27/48 Test #28: test_integration_2d_1 ....................   Passed    7.64 sec
test 29
      Start 29: test_integration_2d_2

29: Test command: /usr/bin/mpiexec "-n" "2" "/var/jenkins/workspace/adamantine-nightly/build/bin/test_integration_2d"
29: Working Directory: /var/jenkins/workspace/adamantine-nightly/build/tests
29: Test timeout computed to be: 7200
29: Running 3 test cases...
29: Entering test module "Integration_2D"
29: /var/jenkins/workspace/adamantine-nightly/tests/test_integration_2d.cc(19): Entering test case "integration_2D"
29: Running 3 test cases...
29: Entering test module "Integration_2D"
29: /var/jenkins/workspace/adamantine-nightly/tests/test_integration_2d.cc(19): Entering test case "integration_2D"
29: 10% completed
29: 20% completed
29: 30% completed
29: 40% completed
29: 50% completed
29: 60% completed
29: 70% completed
29: 80% completed
29: 90% completed
29: 100% completed
29: /var/jenkins/workspace/adamantine-nightly/tests/test_integration_2d.cc(19): Leaving test case "integration_2D"; testing time: 869184us
29: /var/jenkins/workspace/adamantine-nightly/tests/test_integration_2d.cc(46): Entering test case "integration_2D_ensemble"
29: /var/jenkins/workspace/adamantine-nightly/tests/test_integration_2d.cc(19): Leaving test case "integration_2D"; testing time: 870372us
29: /var/jenkins/workspace/adamantine-nightly/tests/test_integration_2d.cc(46): Entering test case "integration_2D_ensemble"
29: Starting the main time stepping loop...
29: 10% completed
29: 20% completed
29: 30% completed
29: 40% completed
29: /var/jenkins/workspace/adamantine-nightly/tests/test_integration_2d.cc(46): Leaving test case "integration_2D_ensemble"; testing time: 1395245us
29: /var/jenkins/workspace/adamantine-nightly/tests/test_integration_2d.cc(78): Entering test case "integration_2D_units"
29: 50% completed
29: 60% completed
29: 70% completed
29: 80% completed
29: 90% completed
29: 100% completed
29: /var/jenkins/workspace/adamantine-nightly/tests/test_integration_2d.cc(46): Leaving test case "integration_2D_ensemble"; testing time: 2548374us
29: /var/jenkins/workspace/adamantine-nightly/tests/test_integration_2d.cc(78): Entering test case "integration_2D_units"
29: 10% completed
29: 20% completed
29: 30% completed
29: 40% completed
29: 50% completed
29: 60% completed
29: 70% completed
29: 80% completed
29: 90% completed
29: 100% completed
29: /var/jenkins/workspace/adamantine-nightly/tests/test_integration_2d.cc(78): Leaving test case "integration_2D_units"; testing time: 2050768us
29: Leaving test module "Integration_2D"; testing time: 4315917us
29: /var/jenkins/workspace/adamantine-nightly/tests/test_integration_2d.cc(78): Leaving test case "integration_2D_units"; testing time: 897679us
29: Leaving test module "Integration_2D"; testing time: 4317144us
29: 
29: *** No errors detected
29: 
29: *** No errors detected
29: 
28/48 Test #29: test_integration_2d_2 ....................   Passed    5.33 sec
test 30
      Start 30: test_integration_2d_device_1

30: Test command: /usr/bin/mpiexec "-n" "1" "/var/jenkins/workspace/adamantine-nightly/build/bin/test_integration_2d_device"
30: Working Directory: /var/jenkins/workspace/adamantine-nightly/build/tests
30: Test timeout computed to be: 7200
30: Running 1 test case...
30: Entering test module "Integration_2D_Device"
30: /var/jenkins/workspace/adamantine-nightly/tests/test_integration_2d_device.cc(19): Entering test case "intregation_2D_device"
30: 10% completed
30: 20% completed
30: 30% completed
30: 40% completed
30: 50% completed
30: 60% completed
30: 70% completed
30: 80% completed
30: 90% completed
30: 100% completed
30: /var/jenkins/workspace/adamantine-nightly/tests/test_integration_2d_device.cc(19): Leaving test case "intregation_2D_device"; testing time: 2070241us
30: Leaving test module "Integration_2D_Device"; testing time: 2070475us
30: 
30: *** No errors detected
30: 
29/48 Test #30: test_integration_2d_device_1 .............   Passed    2.87 sec
test 31
      Start 31: test_integration_2d_device_2

31: Test command: /usr/bin/mpiexec "-n" "2" "/var/jenkins/workspace/adamantine-nightly/build/bin/test_integration_2d_device"
31: Working Directory: /var/jenkins/workspace/adamantine-nightly/build/tests
31: Test timeout computed to be: 7200
31: Running 1 test case...
31: Entering test module "Integration_2D_Device"
31: /var/jenkins/workspace/adamantine-nightly/tests/test_integration_2d_device.cc(19): Entering test case "intregation_2D_device"
31: Running 1 test case...
31: Entering test module "Integration_2D_Device"
31: /var/jenkins/workspace/adamantine-nightly/tests/test_integration_2d_device.cc(19): Entering test case "intregation_2D_device"
31: 10% completed
31: 20% completed
31: 30% completed
31: 40% completed
31: 50% completed
31: 60% completed
31: 70% completed
31: 80% completed
31: 90% completed
31: 100% completed
31: /var/jenkins/workspace/adamantine-nightly/tests/test_integration_2d_device.cc(19): Leaving test case "intregation_2D_device"; testing time: 1421138us
31: Leaving test module "Integration_2D_Device"; testing time: 1421405us
31: /var/jenkins/workspace/adamantine-nightly/tests/test_integration_2d_device.cc(19): Leaving test case "intregation_2D_device"; testing time: 1424119us
31: Leaving test module "Integration_2D_Device"; testing time: 1424374us
31: 
31: *** No errors detected
31: 
31: *** No errors detected
31: 
30/48 Test #31: test_integration_2d_device_2 .............   Passed    2.42 sec
test 32
      Start 32: test_integration_3d_1

32: Test command: /usr/bin/mpiexec "-n" "1" "/var/jenkins/workspace/adamantine-nightly/build/bin/test_integration_3d"
32: Working Directory: /var/jenkins/workspace/adamantine-nightly/build/tests
32: Test timeout computed to be: 7200
32: Running 5 test cases...
32: Entering test module "Integration_3D"
32: /var/jenkins/workspace/adamantine-nightly/tests/test_integration_3d.cc(102): Entering test case "integration_3D"
32: 10% completed
32: 20% completed
32: 30% completed
32: 40% completed
32: 50% completed
32: 60% completed
32: 70% completed
32: 80% completed
32: 90% completed
32: 100% completed
32: /var/jenkins/workspace/adamantine-nightly/tests/test_integration_3d.cc(102): Leaving test case "integration_3D"; testing time: 102506421us
32: /var/jenkins/workspace/adamantine-nightly/tests/test_integration_3d.cc(107): Entering test case "integration_3D_short"
32: 10% completed
32: 20% completed
32: 30% completed
32: 40% completed
32: 50% completed
32: 60% completed
32: 70% completed
32: 80% completed
32: 90% completed
32: 100% completed
32: /var/jenkins/workspace/adamantine-nightly/tests/test_integration_3d.cc(107): Leaving test case "integration_3D_short"; testing time: 919395565us
32: /var/jenkins/workspace/adamantine-nightly/tests/test_integration_3d.cc(112): Entering test case "integration_3D_five_axis"
32: 10% completed
32: 20% completed
32: 30% completed
32: 40% completed
wrapper script does not seem to be touching the log file in /var/jenkins/workspace/adamantine-nightly/build@tmp/durable-82d11167
This may occur if the durable task process was terminated externally, for example by interrupting an interactive terminal session running the agent since the interrupt can terminate forked durable task processes.
(JENKINS-48300: if on an extremely laggy filesystem, consider -Dorg.jenkinsci.plugins.durabletask.BourneShellScript.HEARTBEAT_CHECK_INTERVAL=86400)
[Pipeline] }
[Pipeline] // dir
Post stage
[Pipeline] xunit
INFO: Processing CTest-Version 3.x (default)
Error when executing always post condition:
Also:   hudson.remoting.Channel$CallSiteStackTrace: Remote call to JNLP4-connect connection from 10.64.199.13/10.64.199.13:41806
		at hudson.remoting.Channel.attachCallSiteStackTrace(Channel.java:1916)
		at hudson.remoting.UserRequest$ExceptionResponse.retrieve(UserRequest.java:384)
		at hudson.remoting.Channel.call(Channel.java:1108)
		at hudson.FilePath.act(FilePath.java:1220)
		at hudson.FilePath.act(FilePath.java:1209)
		at PluginClassLoader for xunit//org.jenkinsci.plugins.xunit.XUnitProcessor.processTestsReport(XUnitProcessor.java:214)
		at PluginClassLoader for xunit//org.jenkinsci.plugins.xunit.XUnitProcessor.process(XUnitProcessor.java:163)
		at PluginClassLoader for xunit//org.jenkinsci.plugins.xunit.pipeline.XUnitResultsStepExecution.run(XUnitResultsStepExecution.java:94)
		at PluginClassLoader for xunit//org.jenkinsci.plugins.xunit.pipeline.XUnitResultsStepExecution.run(XUnitResultsStepExecution.java:53)
		at PluginClassLoader for workflow-step-api//org.jenkinsci.plugins.workflow.steps.SynchronousNonBlockingStepExecution.lambda$start$0(SynchronousNonBlockingStepExecution.java:49)
		at java.base/java.util.concurrent.Executors$RunnableAdapter.call(Unknown Source)
		at java.base/java.util.concurrent.FutureTask.run(Unknown Source)
		at java.base/java.util.concurrent.ThreadPoolExecutor.runWorker(Unknown Source)
		at java.base/java.util.concurrent.ThreadPoolExecutor$Worker.run(Unknown Source)
		at java.base/java.lang.Thread.run(Unknown Source)
Also:   org.jenkinsci.plugins.workflow.actions.ErrorAction$ErrorId: f3a21733-d092-4963-bdff-4f7f7dfd991f
org.jenkinsci.plugins.xunit.service.NoTestFoundException: [CTest-Version 3.x (default)] - No test report file(s) were found with the pattern 'build/Testing/**/Test.xml' relative to '/var/jenkins/workspace/adamantine-nightly' for the testing framework 'CTest-Version 3.x (default)'.
Did you enter a pattern relative to (and within) the workspace directory?
Did you generate the result report(s) for 'CTest-Version 3.x (default)'?"
	at PluginClassLoader for xunit//org.jenkinsci.plugins.xunit.service.XUnitReportProcessorService.findReports(XUnitReportProcessorService.java:79)
	at PluginClassLoader for xunit//org.jenkinsci.plugins.xunit.service.XUnitTransformerCallable.invoke(XUnitTransformerCallable.java:87)
	at PluginClassLoader for xunit//org.jenkinsci.plugins.xunit.service.XUnitTransformerCallable.invoke(XUnitTransformerCallable.java:39)
	at Jenkins v2.568.3//hudson.FilePath$FileCallableWrapper.call(FilePath.java:3655)
	at hudson.remoting.UserRequest.perform(UserRequest.java:225)
	at hudson.remoting.UserRequest.perform(UserRequest.java:50)
	at hudson.remoting.Request$2.run(Request.java:391)
	at hudson.remoting.InterceptingExecutorService.lambda$wrap$0(InterceptingExecutorService.java:81)
	at java.base/java.util.concurrent.FutureTask.run(FutureTask.java:317)
	at java.base/java.util.concurrent.ThreadPoolExecutor.runWorker(ThreadPoolExecutor.java:1144)
	at java.base/java.util.concurrent.ThreadPoolExecutor$Worker.run(ThreadPoolExecutor.java:642)
	at hudson.remoting.Engine$1.lambda$newThread$0(Engine.java:312)
	at java.base/java.lang.Thread.run(Thread.java:1583)

[Pipeline] }
[Pipeline] // withEnv
[Pipeline] }
$ docker stop --time=1 807737b30978c20a1ec71a81a4769496c91c0b4c472bcc607b89015a49a87998
$ docker rm -f --volumes 807737b30978c20a1ec71a81a4769496c91c0b4c472bcc607b89015a49a87998
[Pipeline] // withDockerContainer
[Pipeline] }
[Pipeline] // withEnv
[Pipeline] }
[Pipeline] // node
[Pipeline] }
[Pipeline] // stage
[Pipeline] }
Failed in branch CUDA
[Pipeline] // parallel
[Pipeline] }
[Pipeline] // stage
[Pipeline] }
[Pipeline] // timeout
[Pipeline] }
[Pipeline] // withEnv
[Pipeline] End of Pipeline
ERROR: script returned exit code 2
Finished: FAILURE