Skip to content
Skipping 229 KB.. Full Log
39: Rank: 1 | New parameters for member 2: 0.107206 
39: Done.
39: Rank: 0 | New parameters for member 0: 0.121104 
39: Rank: 0 | New parameters for member 1: 0.142225 
39: 80% completed
39: 90% completed
39: 100% completed
39: 
39: *** No errors detected
39: /var/jenkins/workspace/adamantine-nightly/tests/test_integration_da_augmented.cc(19): Leaving test case "integration_3D_data_assimilation_augmented"; testing time: 38430633us
39: Leaving test module "Integration_Data_Assimilation_Augmented"; testing time: 38431128us
39: /var/jenkins/workspace/adamantine-nightly/tests/test_integration_da_augmented.cc(19): Leaving test case "integration_3D_data_assimilation_augmented"; testing time: 38430403us
39: 
39: Leaving test module "Integration_Data_Assimilation_Augmented"; testing time: 38443320us
39: *** No errors detected
39: 
38/48 Test #39: test_integration_da_augmented_2 ..........   Passed   39.19 sec
test 41
      Start 41: test_integration_thermoelastic_2

41: Test command: /usr/bin/mpiexec "-n" "2" "/var/jenkins/workspace/adamantine-nightly/build/bin/test_integration_thermoelastic"
41: Working Directory: /var/jenkins/workspace/adamantine-nightly/build/tests
41: Test timeout computed to be: 7200
41: Running 2 test cases...
41: Entering test module "Integration_Thermoelastic"
41: /var/jenkins/workspace/adamantine-nightly/tests/test_integration_thermoelastic.cc(19): Entering test case "integration_thermoelastic"
41: Running 2 test cases...
41: Entering test module "Integration_Thermoelastic"
41: /var/jenkins/workspace/adamantine-nightly/tests/test_integration_thermoelastic.cc(19): Entering test case "integration_thermoelastic"
33: n_time_step: 577 time: 5.76 n_dofs (thermal) after cell activation: 1219
33: n_time_step: 601 time: 6 n_dofs (thermal) after cell activation: 1220
33: 60% completed
32: 20% completed
33: n_time_step: 624 time: 6.23 n_dofs (thermal) after cell activation: 1221
33: n_time_step: 647 time: 6.46 n_dofs (thermal) after cell activation: 1222
34/48 Test #32: test_integration_3d_1 ....................***Timeout 7200.08 sec
33: n_time_step: 671 time: 6.7 n_dofs (thermal) after cell activation: 1223
33: n_time_step: 694 time: 6.93 n_dofs (thermal) after cell activation: 1224
33: 70% completed
33: n_time_step: 717 time: 7.16 n_dofs (thermal) after cell activation: 1226
33: n_time_step: 740 time: 7.39 n_dofs (thermal) after cell activation: 1227
41: 10% completed
33: n_time_step: 763 time: 7.62 n_dofs (thermal) after cell activation: 1228
33: 50% completed
40: 50% completed
33: n_time_step: 787 time: 7.86 n_dofs (thermal) after cell activation: 1229
33: 80% completed
33: n_time_step: 810 time: 8.09 n_dofs (thermal) after cell activation: 1230
33: n_time_step: 833 time: 8.32 n_dofs (thermal) after cell activation: 1231
33: n_time_step: 857 time: 8.56 n_dofs (thermal) after cell activation: 1232
39/48 Test #33: test_integration_3d_2 ....................***Timeout 7200.01 sec
test 43
      Start 43: test_material_deposition_2

43: Test command: /usr/bin/mpiexec "-n" "2" "/var/jenkins/workspace/adamantine-nightly/build/bin/test_material_deposition"
43: Working Directory: /var/jenkins/workspace/adamantine-nightly/build/tests
43: Test timeout computed to be: 7200
43: Running 11 test cases...
43: Running 11 test cases...
43: Entering test module "MaterialDeposition"
43: Entering test module "MaterialDeposition"
43: /var/jenkins/workspace/adamantine-nightly/tests/test_material_deposition.cc(50): Entering test case "read_material_deposition_file_2d"
43: /var/jenkins/workspace/adamantine-nightly/tests/test_material_deposition.cc(50): Entering test case "read_material_deposition_file_2d"
43: /var/jenkins/workspace/adamantine-nightly/tests/test_material_deposition.cc(50): Leaving test case "read_material_deposition_file_2d"; testing time: 696us
43: /var/jenkins/workspace/adamantine-nightly/tests/test_material_deposition.cc(92): Entering test case "read_material_deposition_file_3d"
43: /var/jenkins/workspace/adamantine-nightly/tests/test_material_deposition.cc(50): Leaving test case "read_material_deposition_file_2d"; testing time: 701us
43: /var/jenkins/workspace/adamantine-nightly/tests/test_material_deposition.cc(92): Entering test case "read_material_deposition_file_3d"
43: /var/jenkins/workspace/adamantine-nightly/tests/test_material_deposition.cc(92): Leaving test case "read_material_deposition_file_3d"; testing time: 428us
43: /var/jenkins/workspace/adamantine-nightly/tests/test_material_deposition.cc(134): Test case "get_elements_to_activate_2d" is skipped because precondition failed: the test only works in serial
43: /var/jenkins/workspace/adamantine-nightly/tests/test_material_deposition.cc(92): Leaving test case "read_material_deposition_file_3d"; testing time: 437us
43: /var/jenkins/workspace/adamantine-nightly/tests/test_material_deposition.cc(134): Test case "get_elements_to_activate_2d" is skipped because precondition failed: the test only works in serial
43: /var/jenkins/workspace/adamantine-nightly/tests/test_material_deposition.cc(195): Test case "get_elements_to_activate_3d" is skipped because precondition failed: the test only works in serial
43: /var/jenkins/workspace/adamantine-nightly/tests/test_material_deposition.cc(262): Entering test case "material_deposition"
43: /var/jenkins/workspace/adamantine-nightly/tests/test_material_deposition.cc(195): Test case "get_elements_to_activate_3d" is skipped because precondition failed: the test only works in serial
43: /var/jenkins/workspace/adamantine-nightly/tests/test_material_deposition.cc(262): Entering test case "material_deposition"
43: /var/jenkins/workspace/adamantine-nightly/tests/test_material_deposition.cc(262): Leaving test case "material_deposition"; testing time: 11763376us
43: /var/jenkins/workspace/adamantine-nightly/tests/test_material_deposition.cc(395): Entering test case "deposition_from_scan_path_2d"
43: /var/jenkins/workspace/adamantine-nightly/tests/test_material_deposition.cc(395): Leaving test case "deposition_from_scan_path_2d"; testing time: 645us
43: /var/jenkins/workspace/adamantine-nightly/tests/test_material_deposition.cc(445): Entering test case "deposition_from_scan_path_3d"
43: /var/jenkins/workspace/adamantine-nightly/tests/test_material_deposition.cc(445): Leaving test case "deposition_from_scan_path_3d"; testing time: 171us
43: /var/jenkins/workspace/adamantine-nightly/tests/test_material_deposition.cc(499): Entering test case "deposition_from_L_scan_path_3d"
43: /var/jenkins/workspace/adamantine-nightly/tests/test_material_deposition.cc(499): Leaving test case "deposition_from_L_scan_path_3d"; testing time: 401us
43: /var/jenkins/workspace/adamantine-nightly/tests/test_material_deposition.cc(586): Entering test case "deposition_from_diagonal_scan_path_3d"
43: /var/jenkins/workspace/adamantine-nightly/tests/test_material_deposition.cc(586): Leaving test case "deposition_from_diagonal_scan_path_3d"; testing time: 352us
43: /var/jenkins/workspace/adamantine-nightly/tests/test_material_deposition.cc(640): Entering test case "merge_multiple_deposition_paths"
43: /var/jenkins/workspace/adamantine-nightly/tests/test_material_deposition.cc(640): Leaving test case "merge_multiple_deposition_paths"; testing time: 105us
43: /var/jenkins/workspace/adamantine-nightly/tests/test_material_deposition.cc(697): Entering test case "deposition_quaternion_straight_line"
43: /var/jenkins/workspace/adamantine-nightly/tests/test_material_deposition.cc(262): Leaving test case "material_deposition"; testing time: 11768347us
43: /var/jenkins/workspace/adamantine-nightly/tests/test_material_deposition.cc(395): Entering test case "deposition_from_scan_path_2d"
43: /var/jenkins/workspace/adamantine-nightly/tests/test_material_deposition.cc(395): Leaving test case "deposition_from_scan_path_2d"; testing time: 258us
43: /var/jenkins/workspace/adamantine-nightly/tests/test_material_deposition.cc(445): Entering test case "deposition_from_scan_path_3d"
43: /var/jenkins/workspace/adamantine-nightly/tests/test_material_deposition.cc(445): Leaving test case "deposition_from_scan_path_3d"; testing time: 171us
43: /var/jenkins/workspace/adamantine-nightly/tests/test_material_deposition.cc(499): Entering test case "deposition_from_L_scan_path_3d"
43: /var/jenkins/workspace/adamantine-nightly/tests/test_material_deposition.cc(499): Leaving test case "deposition_from_L_scan_path_3d"; testing time: 187us
43: /var/jenkins/workspace/adamantine-nightly/tests/test_material_deposition.cc(586): Entering test case "deposition_from_diagonal_scan_path_3d"
43: /var/jenkins/workspace/adamantine-nightly/tests/test_material_deposition.cc(586): Leaving test case "deposition_from_diagonal_scan_path_3d"; testing time: 194us
43: /var/jenkins/workspace/adamantine-nightly/tests/test_material_deposition.cc(640): Entering test case "merge_multiple_deposition_paths"
43: /var/jenkins/workspace/adamantine-nightly/tests/test_material_deposition.cc(640): Leaving test case "merge_multiple_deposition_paths"; testing time: 102us
43: /var/jenkins/workspace/adamantine-nightly/tests/test_material_deposition.cc(697): Entering test case "deposition_quaternion_straight_line"
43: /var/jenkins/workspace/adamantine-nightly/tests/test_material_deposition.cc(697): Leaving test case "deposition_quaternion_straight_line"; testing time: 517us
43: /var/jenkins/workspace/adamantine-nightly/tests/test_material_deposition.cc(697): Leaving test case "deposition_quaternion_straight_line"; testing time: 9078us
43: Leaving test module "MaterialDeposition"; testing time: 11776928us
43: 
43: *** No errors detected
43: 
43: *** No errors detected
43: Leaving test module "MaterialDeposition"; testing time: 11785359us
43: 
40/48 Test #43: test_material_deposition_2 ...............   Passed   12.51 sec
test 45
      Start 45: test_microstructure_2

45: Test command: /usr/bin/mpiexec "-n" "2" "/var/jenkins/workspace/adamantine-nightly/build/bin/test_microstructure"
45: Working Directory: /var/jenkins/workspace/adamantine-nightly/build/tests
45: Test timeout computed to be: 7200
45: Running 1 test case...
45: Running 1 test case...
45: Entering test module "MicroStructure"
45: /var/jenkins/workspace/adamantine-nightly/tests/test_microstructure.cc(53): Entering test case "G_and_R"
45: Entering test module "MicroStructure"
45: /var/jenkins/workspace/adamantine-nightly/tests/test_microstructure.cc(53): Entering test case "G_and_R"
45: Test case G_and_R did not check any assertions
45: /var/jenkins/workspace/adamantine-nightly/tests/test_microstructure.cc(53): Leaving test case "G_and_R"; testing time: 213320us
45: Leaving test module "MicroStructure"; testing time: 213380us
45: 
45: *** No errors detected
45: /var/jenkins/workspace/adamantine-nightly/tests/test_microstructure.cc(53): Leaving test case "G_and_R"; testing time: 226293us
45: Leaving test module "MicroStructure"; testing time: 226343us
45: 
45: *** No errors detected
45: 
41/48 Test #45: test_microstructure_2 ....................   Passed    0.92 sec
test 47
      Start 47: test_thermal_physics_2

47: Test command: /usr/bin/mpiexec "-n" "2" "/var/jenkins/workspace/adamantine-nightly/build/bin/test_thermal_physics"
47: Working Directory: /var/jenkins/workspace/adamantine-nightly/build/tests
47: Test timeout computed to be: 7200
47: Running 7 test cases...
47: Running 7 test cases...
47: Entering test module "ThermalPhysics"
47: /var/jenkins/workspace/adamantine-nightly/tests/test_thermal_physics.cc(15): Entering test case "thermal_2d_explicit_host"
47: Entering test module "ThermalPhysics"
47: /var/jenkins/workspace/adamantine-nightly/tests/test_thermal_physics.cc(15): Entering test case "thermal_2d_explicit_host"
47: /var/jenkins/workspace/adamantine-nightly/tests/test_thermal_physics.cc(15): Leaving test case "thermal_2d_explicit_host"; testing time: 182473us
47: /var/jenkins/workspace/adamantine-nightly/tests/test_thermal_physics.cc(28): Entering test case "thermal_2d_manufactured_solution_host"
47: /var/jenkins/workspace/adamantine-nightly/tests/test_thermal_physics.cc(15): Leaving test case "thermal_2d_explicit_host"; testing time: 182500us
47: /var/jenkins/workspace/adamantine-nightly/tests/test_thermal_physics.cc(28): Entering test case "thermal_2d_manufactured_solution_host"
47: /var/jenkins/workspace/adamantine-nightly/tests/test_thermal_physics.cc(28): Leaving test case "thermal_2d_manufactured_solution_host"; testing time: 188322us
47: /var/jenkins/workspace/adamantine-nightly/tests/test_thermal_physics.cc(33): Entering test case "initial_temperature_host"
47: /var/jenkins/workspace/adamantine-nightly/tests/test_thermal_physics.cc(28): Leaving test case "thermal_2d_manufactured_solution_host"; testing time: 188328us
47: /var/jenkins/workspace/adamantine-nightly/tests/test_thermal_physics.cc(33): Entering test case "initial_temperature_host"
47: /var/jenkins/workspace/adamantine-nightly/tests/test_thermal_physics.cc(33): Leaving test case "initial_temperature_host"; testing time: 177841us
47: /var/jenkins/workspace/adamantine-nightly/tests/test_thermal_physics.cc(38): Entering test case "energy_conservation_host"
47: /var/jenkins/workspace/adamantine-nightly/tests/test_thermal_physics.cc(33): Leaving test case "initial_temperature_host"; testing time: 177886us
47: /var/jenkins/workspace/adamantine-nightly/tests/test_thermal_physics.cc(38): Entering test case "energy_conservation_host"
47: /var/jenkins/workspace/adamantine-nightly/tests/test_thermal_physics.cc(38): Leaving test case "energy_conservation_host"; testing time: 3845737us
47: /var/jenkins/workspace/adamantine-nightly/tests/test_thermal_physics.cc(43): Entering test case "radiation_bcs_host"
47: /var/jenkins/workspace/adamantine-nightly/tests/test_thermal_physics.cc(38): Leaving test case "energy_conservation_host"; testing time: 3845695us
47: /var/jenkins/workspace/adamantine-nightly/tests/test_thermal_physics.cc(43): Entering test case "radiation_bcs_host"
47: /var/jenkins/workspace/adamantine-nightly/tests/test_thermal_physics.cc(43): Leaving test case "radiation_bcs_host"; testing time: 2909635us
47: /var/jenkins/workspace/adamantine-nightly/tests/test_thermal_physics.cc(48): Entering test case "convection_bcs_host"
47: /var/jenkins/workspace/adamantine-nightly/tests/test_thermal_physics.cc(43): Leaving test case "radiation_bcs_host"; testing time: 2909621us
47: /var/jenkins/workspace/adamantine-nightly/tests/test_thermal_physics.cc(48): Entering test case "convection_bcs_host"
41: 20% completed
47: /var/jenkins/workspace/adamantine-nightly/tests/test_thermal_physics.cc(48): Leaving test case "convection_bcs_host"; testing time: 45463957us
47: /var/jenkins/workspace/adamantine-nightly/tests/test_thermal_physics.cc(53): Entering test case "reference_temperature_host"
47: /var/jenkins/workspace/adamantine-nightly/tests/test_thermal_physics.cc(48): Leaving test case "convection_bcs_host"; testing time: 45463949us
47: /var/jenkins/workspace/adamantine-nightly/tests/test_thermal_physics.cc(53): Entering test case "reference_temperature_host"
47: 
47: *** No errors detected
47: /var/jenkins/workspace/adamantine-nightly/tests/test_thermal_physics.cc(53): Leaving test case "reference_temperature_host"; testing time: 120233us
47: Leaving test module "ThermalPhysics"; testing time: 52888924us
47: /var/jenkins/workspace/adamantine-nightly/tests/test_thermal_physics.cc(53): Leaving test case "reference_temperature_host"; testing time: 155347us
47: Leaving test module "ThermalPhysics"; testing time: 52924032us
47: 
47: *** No errors detected
47: 
42/48 Test #47: test_thermal_physics_2 ...................   Passed   53.64 sec
test 49
      Start 49: test_ensemble_management_2

49: Test command: /usr/bin/mpiexec "-n" "2" "/var/jenkins/workspace/adamantine-nightly/build/bin/test_ensemble_management"
49: Working Directory: /var/jenkins/workspace/adamantine-nightly/build/tests
49: Test timeout computed to be: 7200
49: Running 1 test case...
49: Running 1 test case...
49: Entering test module "EnsembleManagement"
49: Entering test module "EnsembleManagement"
49: /var/jenkins/workspace/adamantine-nightly/tests/test_ensemble_management.cc(17): Entering test case "database_ensemble"
49: /var/jenkins/workspace/adamantine-nightly/tests/test_ensemble_management.cc(17): Entering test case "database_ensemble"
49: /var/jenkins/workspace/adamantine-nightly/tests/test_ensemble_management.cc(17): Leaving test case "database_ensemble"; testing time: 973us
49: Leaving test module "EnsembleManagement"; testing time: 1004us
49: 
49: *** No errors detected
49: /var/jenkins/workspace/adamantine-nightly/tests/test_ensemble_management.cc(17): Leaving test case "database_ensemble"; testing time: 2427us
49: Leaving test module "EnsembleManagement"; testing time: 2463us
49: 
49: *** No errors detected
49: 
43/48 Test #49: test_ensemble_management_2 ...............   Passed    0.67 sec
35/48 Test #40: test_integration_thermoelastic_1 .........***Timeout 7200.11 sec
test 35
      Start 35: test_integration_3d_amr_2

35: Test command: /usr/bin/mpiexec "-n" "2" "/var/jenkins/workspace/adamantine-nightly/build/bin/test_integration_3d_amr"
35: Working Directory: /var/jenkins/workspace/adamantine-nightly/build/tests
35: Test timeout computed to be: 7200
35: Running 2 test cases...
35: Entering test module "Integration_3D_AMR"
35: /var/jenkins/workspace/adamantine-nightly/tests/test_integration_3d_amr.cc(19): Entering test case "integration_3D_amr"
35: Running 2 test cases...
35: Entering test module "Integration_3D_AMR"
35: /var/jenkins/workspace/adamantine-nightly/tests/test_integration_3d_amr.cc(19): Entering test case "integration_3D_amr"
35: 10% completed
35: 20% completed
35: 30% completed
35: 40% completed
35: 50% completed
35: 60% completed
35: 70% completed
35: 80% completed
35: 90% completed
35: 100% completed
35: /var/jenkins/workspace/adamantine-nightly/tests/test_integration_3d_amr.cc(19): Leaving test case "integration_3D_amr"; testing time: 14271366us
35: /var/jenkins/workspace/adamantine-nightly/tests/test_integration_3d_amr.cc(60): Entering test case "integration_3D_amr_refine_coarsen"
35: /var/jenkins/workspace/adamantine-nightly/tests/test_integration_3d_amr.cc(19): Leaving test case "integration_3D_amr"; testing time: 14297039us
35: /var/jenkins/workspace/adamantine-nightly/tests/test_integration_3d_amr.cc(60): Entering test case "integration_3D_amr_refine_coarsen"
35: 10% completed
35: 20% completed
35: 30% completed
35: 40% completed
33: 60% completed
35: 50% completed
41: 30% completed
35: 60% completed
35: 70% completed
35: 80% completed
35: 90% completed
35: 100% completed
35: /var/jenkins/workspace/adamantine-nightly/tests/test_integration_3d_amr.cc(60): Leaving test case "integration_3D_amr_refine_coarsen"; testing time: 142026280us
35: Leaving test module "Integration_3D_AMR"; testing time: 156299164us
35: 
35: *** No errors detected
35: 
35: *** No errors detected
35: /var/jenkins/workspace/adamantine-nightly/tests/test_integration_3d_amr.cc(60): Leaving test case "integration_3D_amr_refine_coarsen"; testing time: 142026261us
35: Leaving test module "Integration_3D_AMR"; testing time: 156325165us
35: 
36/48 Test #35: test_integration_3d_amr_2 ................   Passed  164.07 sec
test 37
      Start 37: test_integration_3d_amr_device_2

37: Test command: /usr/bin/mpiexec "-n" "2" "/var/jenkins/workspace/adamantine-nightly/build/bin/test_integration_3d_amr_device"
37: Working Directory: /var/jenkins/workspace/adamantine-nightly/build/tests
37: Test timeout computed to be: 7200
37: Running 1 test case...
37: Entering test module "Integration_3D_AMR"
37: /var/jenkins/workspace/adamantine-nightly/tests/test_integration_3d_amr_device.cc(19): Entering test case "integration_3D_amr_device"
37: Running 1 test case...
37: Entering test module "Integration_3D_AMR"
37: /var/jenkins/workspace/adamantine-nightly/tests/test_integration_3d_amr_device.cc(19): Entering test case "integration_3D_amr_device"
37: 10% completed
37: 20% completed
37: 30% completed
37: 40% completed
37: 50% completed
41: 40% completed
37: 60% completed
37: 70% completed
37: 80% completed
37: 90% completed
37: 100% completed
37: 
37: *** No errors detected
37: /var/jenkins/workspace/adamantine-nightly/tests/test_integration_3d_amr_device.cc(19): Leaving test case "integration_3D_amr_device"; testing time: 117968311us
37: Leaving test module "Integration_3D_AMR"; testing time: 117968683us
37: /var/jenkins/workspace/adamantine-nightly/tests/test_integration_3d_amr_device.cc(19): Leaving test case "integration_3D_amr_device"; testing time: 117935116us
37: Leaving test module "Integration_3D_AMR"; testing time: 117935546us
37: 
37: *** No errors detected
37: 
37/48 Test #37: test_integration_3d_amr_device_2 .........   Passed  126.83 sec
test 39
      Start 39: test_integration_da_augmented_2

39: Test command: /usr/bin/mpiexec "-n" "2" "/var/jenkins/workspace/adamantine-nightly/build/bin/test_integration_da_augmented"
39: Working Directory: /var/jenkins/workspace/adamantine-nightly/build/tests
39: Test timeout computed to be: 7200
39: Running 1 test case...
39: Entering test module "Integration_Data_Assimilation_Augmented"
39: /var/jenkins/workspace/adamantine-nightly/tests/test_integration_da_augmented.cc(19): Entering test case "integration_3D_data_assimilation_augmented"
39: Running 1 test case...
39: Entering test module "Integration_Data_Assimilation_Augmented"
39: /var/jenkins/workspace/adamantine-nightly/tests/test_integration_da_augmented.cc(19): Entering test case "integration_3D_data_assimilation_augmented"
39: Reading the experimental log file...
39: Done. Log entries found for 1 camera(s), with 2 frame(s).
39: Starting the main time stepping loop...
39: 10% completed
39: 20% completed
39: 30% completed
39: Rank: 1 | Old parameters for member 2: 0.446065 
39: Rank: 1 | Number expt sites mapped to DOFs: 2
39: 40% completed
39: 50% completed
39: 60% completed
39: 70% completed
39: Performing data assimilation at time 0.04...
39: Rank: 0 | Old parameters for member 0: 0.413453 
39: Rank: 0 | Old parameters for member 1: 0.385362 
39: Rank: 0 | Number expt sites mapped to DOFs: 2
39: Getting the perturbed innovation...
39: Applying the Kalman gain...
39: Updating the ensemble members...
39: Rank: 1 | New parameters for member 2: 0.107206 
39: Done.
39: Rank: 0 | New parameters for member 0: 0.121104 
39: Rank: 0 | New parameters for member 1: 0.142225 
39: 80% completed
39: 90% completed
41: 50% completed
39: 100% completed
39: /var/jenkins/workspace/adamantine-nightly/tests/test_integration_da_augmented.cc(19): Leaving test case "integration_3D_data_assimilation_augmented"; testing time: 71098638us
39: Leaving test module "Integration_Data_Assimilation_Augmented"; testing time: 71099419us
39: /var/jenkins/workspace/adamantine-nightly/tests/test_integration_da_augmented.cc(19): Leaving test case "integration_3D_data_assimilation_augmented"; testing time: 71018080us
39: Leaving test module "Integration_Data_Assimilation_Augmented"; testing time: 71019016us
39: 
39: *** No errors detected
39: 
39: *** No errors detected
39: 
38/48 Test #39: test_integration_da_augmented_2 ..........   Passed   79.72 sec
test 41
      Start 41: test_integration_thermoelastic_2

41: Test command: /usr/bin/mpiexec "-n" "2" "/var/jenkins/workspace/adamantine-nightly/build/bin/test_integration_thermoelastic"
41: Working Directory: /var/jenkins/workspace/adamantine-nightly/build/tests
41: Test timeout computed to be: 7200
41: Running 2 test cases...
41: Entering test module "Integration_Thermoelastic"
41: /var/jenkins/workspace/adamantine-nightly/tests/test_integration_thermoelastic.cc(19): Entering test case "integration_thermoelastic"
41: Running 2 test cases...
41: Entering test module "Integration_Thermoelastic"
41: /var/jenkins/workspace/adamantine-nightly/tests/test_integration_thermoelastic.cc(19): Entering test case "integration_thermoelastic"
41: 60% completed
33: 70% completed
41: 70% completed
41: 80% completed
41: 90% completed
41: 100% completed
41: /var/jenkins/workspace/adamantine-nightly/tests/test_integration_thermoelastic.cc(19): Leaving test case "integration_thermoelastic"; testing time: 1783032022us
41: /var/jenkins/workspace/adamantine-nightly/tests/test_integration_thermoelastic.cc(47): Entering test case "integration_thermoelastic_add_material"
41: /var/jenkins/workspace/adamantine-nightly/tests/test_integration_thermoelastic.cc(19): Leaving test case "integration_thermoelastic"; testing time: 1783031803us
41: /var/jenkins/workspace/adamantine-nightly/tests/test_integration_thermoelastic.cc(47): Entering test case "integration_thermoelastic_add_material"
41: 10% completed
33: 80% completed
41: 10% completed
41: 20% completed
41: 30% completed
39/48 Test #33: test_integration_3d_2 ....................***Timeout 7200.06 sec
test 43
      Start 43: test_material_deposition_2

43: Test command: /usr/bin/mpiexec "-n" "2" "/var/jenkins/workspace/adamantine-nightly/build/bin/test_material_deposition"
43: Working Directory: /var/jenkins/workspace/adamantine-nightly/build/tests
43: Test timeout computed to be: 7200
43: Running 11 test cases...
43: Entering test module "MaterialDeposition"
43: /var/jenkins/workspace/adamantine-nightly/tests/test_material_deposition.cc(50): Entering test case "read_material_deposition_file_2d"
43: /var/jenkins/workspace/adamantine-nightly/tests/test_material_deposition.cc(50): Leaving test case "read_material_deposition_file_2d"; testing time: 22056us
43: /var/jenkins/workspace/adamantine-nightly/tests/test_material_deposition.cc(92): Entering test case "read_material_deposition_file_3d"
43: /var/jenkins/workspace/adamantine-nightly/tests/test_material_deposition.cc(92): Leaving test case "read_material_deposition_file_3d"; testing time: 23218us
43: /var/jenkins/workspace/adamantine-nightly/tests/test_material_deposition.cc(134): Test case "get_elements_to_activate_2d" is skipped because precondition failed: the test only works in serial
43: /var/jenkins/workspace/adamantine-nightly/tests/test_material_deposition.cc(195): Test case "get_elements_to_activate_3d" is skipped because precondition failed: the test only works in serial
43: /var/jenkins/workspace/adamantine-nightly/tests/test_material_deposition.cc(262): Entering test case "material_deposition"
43: Running 11 test cases...
43: Entering test module "MaterialDeposition"
43: /var/jenkins/workspace/adamantine-nightly/tests/test_material_deposition.cc(50): Entering test case "read_material_deposition_file_2d"
43: /var/jenkins/workspace/adamantine-nightly/tests/test_material_deposition.cc(50): Leaving test case "read_material_deposition_file_2d"; testing time: 454us
43: /var/jenkins/workspace/adamantine-nightly/tests/test_material_deposition.cc(92): Entering test case "read_material_deposition_file_3d"
43: /var/jenkins/workspace/adamantine-nightly/tests/test_material_deposition.cc(92): Leaving test case "read_material_deposition_file_3d"; testing time: 236us
43: /var/jenkins/workspace/adamantine-nightly/tests/test_material_deposition.cc(134): Test case "get_elements_to_activate_2d" is skipped because precondition failed: the test only works in serial
43: /var/jenkins/workspace/adamantine-nightly/tests/test_material_deposition.cc(195): Test case "get_elements_to_activate_3d" is skipped because precondition failed: the test only works in serial
43: /var/jenkins/workspace/adamantine-nightly/tests/test_material_deposition.cc(262): Entering test case "material_deposition"
41: 40% completed
43: /var/jenkins/workspace/adamantine-nightly/tests/test_material_deposition.cc(262): Leaving test case "material_deposition"; testing time: 16428916us
43: /var/jenkins/workspace/adamantine-nightly/tests/test_material_deposition.cc(395): Entering test case "deposition_from_scan_path_2d"
43: /var/jenkins/workspace/adamantine-nightly/tests/test_material_deposition.cc(262): Leaving test case "material_deposition"; testing time: 16395774us
43: /var/jenkins/workspace/adamantine-nightly/tests/test_material_deposition.cc(395): Entering test case "deposition_from_scan_path_2d"
43: /var/jenkins/workspace/adamantine-nightly/tests/test_material_deposition.cc(395): Leaving test case "deposition_from_scan_path_2d"; testing time: 4771us
43: /var/jenkins/workspace/adamantine-nightly/tests/test_material_deposition.cc(445): Entering test case "deposition_from_scan_path_3d"
43: /var/jenkins/workspace/adamantine-nightly/tests/test_material_deposition.cc(445): Leaving test case "deposition_from_scan_path_3d"; testing time: 227us
43: /var/jenkins/workspace/adamantine-nightly/tests/test_material_deposition.cc(499): Entering test case "deposition_from_L_scan_path_3d"
43: /var/jenkins/workspace/adamantine-nightly/tests/test_material_deposition.cc(395): Leaving test case "deposition_from_scan_path_2d"; testing time: 15745us
43: /var/jenkins/workspace/adamantine-nightly/tests/test_material_deposition.cc(445): Entering test case "deposition_from_scan_path_3d"
43: /var/jenkins/workspace/adamantine-nightly/tests/test_material_deposition.cc(445): Leaving test case "deposition_from_scan_path_3d"; testing time: 222us
43: /var/jenkins/workspace/adamantine-nightly/tests/test_material_deposition.cc(499): Entering test case "deposition_from_L_scan_path_3d"
43: /var/jenkins/workspace/adamantine-nightly/tests/test_material_deposition.cc(499): Leaving test case "deposition_from_L_scan_path_3d"; testing time: 11324us
43: /var/jenkins/workspace/adamantine-nightly/tests/test_material_deposition.cc(586): Entering test case "deposition_from_diagonal_scan_path_3d"
43: /var/jenkins/workspace/adamantine-nightly/tests/test_material_deposition.cc(499): Leaving test case "deposition_from_L_scan_path_3d"; testing time: 22495us
43: /var/jenkins/workspace/adamantine-nightly/tests/test_material_deposition.cc(586): Entering test case "deposition_from_diagonal_scan_path_3d"
43: /var/jenkins/workspace/adamantine-nightly/tests/test_material_deposition.cc(586): Leaving test case "deposition_from_diagonal_scan_path_3d"; testing time: 11785us
43: /var/jenkins/workspace/adamantine-nightly/tests/test_material_deposition.cc(640): Entering test case "merge_multiple_deposition_paths"
43: /var/jenkins/workspace/adamantine-nightly/tests/test_material_deposition.cc(640): Leaving test case "merge_multiple_deposition_paths"; testing time: 134us
43: /var/jenkins/workspace/adamantine-nightly/tests/test_material_deposition.cc(697): Entering test case "deposition_quaternion_straight_line"
43: /var/jenkins/workspace/adamantine-nightly/tests/test_material_deposition.cc(586): Leaving test case "deposition_from_diagonal_scan_path_3d"; testing time: 11722us
43: /var/jenkins/workspace/adamantine-nightly/tests/test_material_deposition.cc(640): Entering test case "merge_multiple_deposition_paths"
43: /var/jenkins/workspace/adamantine-nightly/tests/test_material_deposition.cc(640): Leaving test case "merge_multiple_deposition_paths"; testing time: 140us
43: /var/jenkins/workspace/adamantine-nightly/tests/test_material_deposition.cc(697): Entering test case "deposition_quaternion_straight_line"
43: /var/jenkins/workspace/adamantine-nightly/tests/test_material_deposition.cc(697): Leaving test case "deposition_quaternion_straight_line"; testing time: 21868us
43: Leaving test module "MaterialDeposition"; testing time: 16537206us
43: 
43: *** No errors detected
43: 
43: *** No errors detected
43: /var/jenkins/workspace/adamantine-nightly/tests/test_material_deposition.cc(697): Leaving test case "deposition_quaternion_straight_line"; testing time: 22876us
43: Leaving test module "MaterialDeposition"; testing time: 16460726us
43: 
40/48 Test #43: test_material_deposition_2 ...............   Passed   22.58 sec
test 45
      Start 45: test_microstructure_2

45: Test command: /usr/bin/mpiexec "-n" "2" "/var/jenkins/workspace/adamantine-nightly/build/bin/test_microstructure"
45: Working Directory: /var/jenkins/workspace/adamantine-nightly/build/tests
45: Test timeout computed to be: 7200
45: Running 1 test case...
45: Entering test module "MicroStructure"
45: /var/jenkins/workspace/adamantine-nightly/tests/test_microstructure.cc(53): Entering test case "G_and_R"
45: Running 1 test case...
45: Entering test module "MicroStructure"
45: /var/jenkins/workspace/adamantine-nightly/tests/test_microstructure.cc(53): Entering test case "G_and_R"
45: Test case G_and_R did not check any assertions
45: /var/jenkins/workspace/adamantine-nightly/tests/test_microstructure.cc(53): Leaving test case "G_and_R"; testing time: 532432us
45: Leaving test module "MicroStructure"; testing time: 532486us
45: 
45: *** No errors detected
45: /var/jenkins/workspace/adamantine-nightly/tests/test_microstructure.cc(53): Leaving test case "G_and_R"; testing time: 529606us
45: Leaving test module "MicroStructure"; testing time: 529665us
45: 
45: *** No errors detected
45: 
41/48 Test #45: test_microstructure_2 ....................   Passed    5.42 sec
test 47
      Start 47: test_thermal_physics_2

47: Test command: /usr/bin/mpiexec "-n" "2" "/var/jenkins/workspace/adamantine-nightly/build/bin/test_thermal_physics"
47: Working Directory: /var/jenkins/workspace/adamantine-nightly/build/tests
47: Test timeout computed to be: 7200
47: Running 7 test cases...
47: Entering test module "ThermalPhysics"
47: /var/jenkins/workspace/adamantine-nightly/tests/test_thermal_physics.cc(15): Entering test case "thermal_2d_explicit_host"
47: Running 7 test cases...
47: Entering test module "ThermalPhysics"
47: /var/jenkins/workspace/adamantine-nightly/tests/test_thermal_physics.cc(15): Entering test case "thermal_2d_explicit_host"
47: /var/jenkins/workspace/adamantine-nightly/tests/test_thermal_physics.cc(15): Leaving test case "thermal_2d_explicit_host"; testing time: 320314us
47: /var/jenkins/workspace/adamantine-nightly/tests/test_thermal_physics.cc(28): Entering test case "thermal_2d_manufactured_solution_host"
47: /var/jenkins/workspace/adamantine-nightly/tests/test_thermal_physics.cc(15): Leaving test case "thermal_2d_explicit_host"; testing time: 289493us
47: /var/jenkins/workspace/adamantine-nightly/tests/test_thermal_physics.cc(28): Entering test case "thermal_2d_manufactured_solution_host"
47: /var/jenkins/workspace/adamantine-nightly/tests/test_thermal_physics.cc(28): Leaving test case "thermal_2d_manufactured_solution_host"; testing time: 236681us
47: /var/jenkins/workspace/adamantine-nightly/tests/test_thermal_physics.cc(33): Entering test case "initial_temperature_host"
47: /var/jenkins/workspace/adamantine-nightly/tests/test_thermal_physics.cc(28): Leaving test case "thermal_2d_manufactured_solution_host"; testing time: 226027us
47: /var/jenkins/workspace/adamantine-nightly/tests/test_thermal_physics.cc(33): Entering test case "initial_temperature_host"
47: /var/jenkins/workspace/adamantine-nightly/tests/test_thermal_physics.cc(33): Leaving test case "initial_temperature_host"; testing time: 214027us
47: /var/jenkins/workspace/adamantine-nightly/tests/test_thermal_physics.cc(38): Entering test case "energy_conservation_host"
47: /var/jenkins/workspace/adamantine-nightly/tests/test_thermal_physics.cc(33): Leaving test case "initial_temperature_host"; testing time: 214035us
47: /var/jenkins/workspace/adamantine-nightly/tests/test_thermal_physics.cc(38): Entering test case "energy_conservation_host"
47: /var/jenkins/workspace/adamantine-nightly/tests/test_thermal_physics.cc(38): Leaving test case "energy_conservation_host"; testing time: 8194333us
47: /var/jenkins/workspace/adamantine-nightly/tests/test_thermal_physics.cc(43): Entering test case "radiation_bcs_host"
47: /var/jenkins/workspace/adamantine-nightly/tests/test_thermal_physics.cc(38): Leaving test case "energy_conservation_host"; testing time: 8194404us
47: /var/jenkins/workspace/adamantine-nightly/tests/test_thermal_physics.cc(43): Entering test case "radiation_bcs_host"
47: /var/jenkins/workspace/adamantine-nightly/tests/test_thermal_physics.cc(43): Leaving test case "radiation_bcs_host"; testing time: 4764464us
47: /var/jenkins/workspace/adamantine-nightly/tests/test_thermal_physics.cc(48): Entering test case "convection_bcs_host"
47: /var/jenkins/workspace/adamantine-nightly/tests/test_thermal_physics.cc(43): Leaving test case "radiation_bcs_host"; testing time: 4777428us
47: /var/jenkins/workspace/adamantine-nightly/tests/test_thermal_physics.cc(48): Entering test case "convection_bcs_host"
41: 50% completed
47: /var/jenkins/workspace/adamantine-nightly/tests/test_thermal_physics.cc(48): Leaving test case "convection_bcs_host"; testing time: 78466745us
47: /var/jenkins/workspace/adamantine-nightly/tests/test_thermal_physics.cc(53): Entering test case "reference_temperature_host"
47: /var/jenkins/workspace/adamantine-nightly/tests/test_thermal_physics.cc(48): Leaving test case "convection_bcs_host"; testing time: 78490711us
47: /var/jenkins/workspace/adamantine-nightly/tests/test_thermal_physics.cc(53): Entering test case "reference_temperature_host"
47: /var/jenkins/workspace/adamantine-nightly/tests/test_thermal_physics.cc(53): Leaving test case "reference_temperature_host"; testing time: 194046us
47: Leaving test module "ThermalPhysics"; testing time: 92363092us
47: 
47: *** No errors detected
47: 
47: *** No errors detected
47: /var/jenkins/workspace/adamantine-nightly/tests/test_thermal_physics.cc(53): Leaving test case "reference_temperature_host"; testing time: 230538us
47: Leaving test module "ThermalPhysics"; testing time: 92451782us
47: 
42/48 Test #47: test_thermal_physics_2 ...................   Passed   98.73 sec
test 49
      Start 49: test_ensemble_management_2

49: Test command: /usr/bin/mpiexec "-n" "2" "/var/jenkins/workspace/adamantine-nightly/build/bin/test_ensemble_management"
49: Working Directory: /var/jenkins/workspace/adamantine-nightly/build/tests
49: Test timeout computed to be: 7200
49: Running 1 test case...
49: Entering test module "EnsembleManagement"
49: /var/jenkins/workspace/adamantine-nightly/tests/test_ensemble_management.cc(17): Entering test case "database_ensemble"
49: 
49: *** No errors detected
49: /var/jenkins/workspace/adamantine-nightly/tests/test_ensemble_management.cc(17): Leaving test case "database_ensemble"; testing time: 29889us
49: Leaving test module "EnsembleManagement"; testing time: 29918us
49: Running 1 test case...
49: Entering test module "EnsembleManagement"
49: /var/jenkins/workspace/adamantine-nightly/tests/test_ensemble_management.cc(17): Entering test case "database_ensemble"
49: 
49: *** No errors detected
49: /var/jenkins/workspace/adamantine-nightly/tests/test_ensemble_management.cc(17): Leaving test case "database_ensemble"; testing time: 70883us
49: Leaving test module "EnsembleManagement"; testing time: 70913us
49: 
43/48 Test #49: test_ensemble_management_2 ...............   Passed    5.35 sec
41: 20% completed
41: 60% completed
41: 70% completed
41: 80% completed
41: 30% completed
41: 90% completed
41: 100% completed
41: /var/jenkins/workspace/adamantine-nightly/tests/test_integration_thermoelastic.cc(47): Leaving test case "integration_thermoelastic_add_material"; testing time: 818486005us
41: Leaving test module "Integration_Thermoelastic"; testing time: 2601519477us
41: 
41: *** No errors detected
41: /var/jenkins/workspace/adamantine-nightly/tests/test_integration_thermoelastic.cc(47): Leaving test case "integration_thermoelastic_add_material"; testing time: 818485930us
41: Leaving test module "Integration_Thermoelastic"; testing time: 2601519266us
41: 
41: *** No errors detected
41: 
44/48 Test #41: test_integration_thermoelastic_2 .........   Passed  2602.34 sec
test 4
      Start  4: test_integration_da_3

4: Test command: /usr/bin/mpiexec "-n" "3" "/var/jenkins/workspace/adamantine-nightly/build/bin/test_integration_da"
4: Working Directory: /var/jenkins/workspace/adamantine-nightly/build/tests
4: Test timeout computed to be: 7200
4: Running 3 test cases...
4: Running 3 test cases...
4: Running 3 test cases...
4: Entering test module "Integration_Data_Assimilation"
4: Entering test module "Integration_Data_Assimilation"
4: /var/jenkins/workspace/adamantine-nightly/tests/test_integration_da.cc(78): Entering test case "integration_data_assimilation"
4: /var/jenkins/workspace/adamantine-nightly/tests/test_integration_da.cc(78): Entering test case "integration_data_assimilation"
4: Entering test module "Integration_Data_Assimilation"
4: /var/jenkins/workspace/adamantine-nightly/tests/test_integration_da.cc(78): Entering test case "integration_data_assimilation"
4: Reading the experimental log file...
4: Done. Log entries found for 1 camera(s), with 2 frame(s).
4: Starting the main time stepping loop...
4: 10% completed
4: 20% completed
4: 30% completed
4: 40% completed
4: Rank: 1 | Old parameters for member 1: 
4: Rank: 2 | Old parameters for member 2: 
4: Performing data assimilation at time 0.0211...
4: Rank: 0 | Old parameters for member 0: 
4: Rank: 1 | Number expt sites mapped to DOFs: 1
4: Rank: 2 | Number expt sites mapped to DOFs: 1
4: Rank: 0 | Number expt sites mapped to DOFs: 1
4: Getting the perturbed innovation...
4: Applying the Kalman gain...
4: Updating the ensemble members...
4: Done.
4: 50% completed
4: 60% completed
4: Rank: 2 | Old parameters for member 2: 
4: Rank: 1 | Old parameters for member 1: 
4: Rank: 2 | Number expt sites mapped to DOFs: 1
4: Performing data assimilation at time 0.0316...
4: Rank: 0 | Old parameters for member 0: 
4: Rank: 1 | Number expt sites mapped to DOFs: 1
4: Rank: 0 | Number expt sites mapped to DOFs: 1
4: Getting the perturbed innovation...
4: Applying the Kalman gain...
4: Updating the ensemble members...
4: Done.
4: 70% completed
4: 80% completed
4: 90% completed
4: 100% completed
4: Reading the experimental log file...
4: Done. Log entries found for 1 camera(s), with 2 frame(s).
4: Reading the experimental log file...
4: Done. Log entries found for 1 camera(s), with 2 frame(s).
4: Reading the experimental log file...
4: Done. Log entries found for 1 camera(s), with 2 frame(s).
4: Starting the main time stepping loop...
4: Starting the main time stepping loop...
4: Starting the main time stepping loop...
4: 10% completed
4: 10% completed
4: 10% completed
4: 20% completed
4: 20% completed
4: 20% completed
4: 30% completed
4: 30% completed
4: 30% completed
4: 40% completed
4: 40% completed
4: 40% completed
4: Performing data assimilation at time 0.0211...
4: Rank: 0 | Old parameters for member 0: 
4: Rank: 0 | Old parameters for member 1: 
4: Rank: 0 | Old parameters for member 2: 
4: Rank: 0 | Number expt sites mapped to DOFs: 1
4: Performing data assimilation at time 0.0211...
4: Rank: 0 | Old parameters for member 0: 
4: Rank: 0 | Old parameters for member 1: 
4: Rank: 0 | Old parameters for member 2: 
4: Rank: 0 | Number expt sites mapped to DOFs: 1
4: Performing data assimilation at time 0.0211...
4: Rank: 0 | Old parameters for member 0: 
4: Rank: 0 | Old parameters for member 1: 
4: Rank: 0 | Old parameters for member 2: 
4: Rank: 0 | Number expt sites mapped to DOFs: 1
4: Getting the perturbed innovation...
4: Applying the Kalman gain...
4: Getting the perturbed innovation...
4: Applying the Kalman gain...
4: Getting the perturbed innovation...
4: Applying the Kalman gain...
4: Updating the ensemble members...
4: Done.
4: Updating the ensemble members...
4: Done.
4: Updating the ensemble members...
4: Done.
4: 50% completed
4: 50% completed
4: 50% completed
4: 60% completed
4: 60% completed
4: 60% completed
4: Performing data assimilation at time 0.0316...
4: Rank: 0 | Old parameters for member 0: 
4: Rank: 0 | Old parameters for member 1: 
4: Rank: 0 | Old parameters for member 2: 
4: Performing data assimilation at time 0.0316...
4: Rank: 0 | Old parameters for member 0: 
4: Rank: 0 | Old parameters for member 1: 
4: Rank: 0 | Old parameters for member 2: 
4: Rank: 0 | Number expt sites mapped to DOFs: 1
4: Rank: 0 | Number expt sites mapped to DOFs: 1
4: Performing data assimilation at time 0.0316...
4: Rank: 0 | Old parameters for member 0: 
4: Rank: 0 | Old parameters for member 1: 
4: Rank: 0 | Old parameters for member 2: 
4: Rank: 0 | Number expt sites mapped to DOFs: 1
4: Getting the perturbed innovation...
4: Applying the Kalman gain...
4: Getting the perturbed innovation...
4: Applying the Kalman gain...
4: Getting the perturbed innovation...
4: Applying the Kalman gain...
4: Updating the ensemble members...
4: Done.
4: Updating the ensemble members...
4: Done.
4: Updating the ensemble members...
4: Done.
4: 70% completed
4: 70% completed
4: 70% completed
4: 80% completed
4: 80% completed
4: 80% completed
4: 90% completed
4: 90% completed
4: 90% completed
4: 100% completed
4: 100% completed
4: 100% completed
4: /var/jenkins/workspace/adamantine-nightly/tests/test_integration_da.cc(78): Leaving test case "integration_data_assimilation"; testing time: 39828403us
4: /var/jenkins/workspace/adamantine-nightly/tests/test_integration_da.cc(148): Entering test case "integration_3D_da_point_cloud_add_material"
4: /var/jenkins/workspace/adamantine-nightly/tests/test_integration_da.cc(78): Leaving test case "integration_data_assimilation"; testing time: 39902154us
4: /var/jenkins/workspace/adamantine-nightly/tests/test_integration_da.cc(148): Entering test case "integration_3D_da_point_cloud_add_material"
4: /var/jenkins/workspace/adamantine-nightly/tests/test_integration_da.cc(78): Leaving test case "integration_data_assimilation"; testing time: 39932916us
4: /var/jenkins/workspace/adamantine-nightly/tests/test_integration_da.cc(148): Entering test case "integration_3D_da_point_cloud_add_material"
4: Reading the experimental log file...
4: Done. Log entries found for 1 camera(s), with 1 frame(s).
4: Starting the main time stepping loop...
4: 10% completed
4: 20% completed
4: 30% completed
4: 40% completed
4: 50% completed
4: Rank: 2 | Old parameters for member 2: 
4: Performing data assimilation at time 0.12...
4: Rank: 0 | Old parameters for member 0: 
4: Rank: 2 | Number expt sites mapped to DOFs: 1
4: Rank: 0 | Number expt sites mapped to DOFs: 1
4: Rank: 1 | Old parameters for member 1: 
4: Rank: 1 | Number expt sites mapped to DOFs: 1
4: Getting the perturbed innovation...
4: Applying the Kalman gain...
4: Updating the ensemble members...
4: Done.
4: 60% completed
4: 70% completed
4: 80% completed
4: 90% completed
4: 100% completed
4: Reading the experimental log file...
4: Done. Log entries found for 1 camera(s), with 1 frame(s).
4: Reading the experimental log file...
4: Done. Log entries found for 1 camera(s), with 1 frame(s).
4: Reading the experimental log file...
4: Done. Log entries found for 1 camera(s), with 1 frame(s).
4: Starting the main time stepping loop...
4: Starting the main time stepping loop...
4: Starting the main time stepping loop...
4: 10% completed
4: 10% completed
4: 10% completed
4: 20% completed
4: 20% completed
4: 20% completed
4: 30% completed
4: 30% completed
4: 30% completed
4: 40% completed
4: 40% completed
4: 40% completed
4: 50% completed
4: 50% completed
4: 50% completed
4: Performing data assimilation at time 0.12...
4: Rank: 0 | Old parameters for member 0: 
4: Rank: 0 | Old parameters for member 1: 
4: Rank: 0 | Old parameters for member 2: 
4: Rank: 0 | Number expt sites mapped to DOFs: 1
4: Performing data assimilation at time 0.12...
4: Rank: 0 | Old parameters for member 0: 
4: Rank: 0 | Old parameters for member 1: 
4: Rank: 0 | Old parameters for member 2: 
4: Rank: 0 | Number expt sites mapped to DOFs: 1
4: Performing data assimilation at time 0.12...
4: Rank: 0 | Old parameters for member 0: 
4: Rank: 0 | Old parameters for member 1: 
4: Rank: 0 | Old parameters for member 2: 
4: Rank: 0 | Number expt sites mapped to DOFs: 1
4: Getting the perturbed innovation...
4: Applying the Kalman gain...
4: Getting the perturbed innovation...
4: Applying the Kalman gain...
4: Getting the perturbed innovation...
4: Applying the Kalman gain...
4: Updating the ensemble members...
4: Done.
4: 60% completed
4: Updating the ensemble members...
4: Done.
4: 60% completed
4: Updating the ensemble members...
4: Done.
4: 60% completed
4: 70% completed
4: 70% completed
4: 70% completed
4: 80% completed
4: 80% completed
4: 80% completed
4: 90% completed
4: 90% completed
4: 90% completed
4: 100% completed
4: 100% completed
4: 100% completed
4: /var/jenkins/workspace/adamantine-nightly/tests/test_integration_da.cc(148): Leaving test case "integration_3D_da_point_cloud_add_material"; testing time: 1708383us
4: /var/jenkins/workspace/adamantine-nightly/tests/test_integration_da.cc(231): Entering test case "integration_3D_da_ray_add_material"
4: /var/jenkins/workspace/adamantine-nightly/tests/test_integration_da.cc(148): Leaving test case "integration_3D_da_point_cloud_add_material"; testing time: 1801811us
4: /var/jenkins/workspace/adamantine-nightly/tests/test_integration_da.cc(231): Entering test case "integration_3D_da_ray_add_material"
4: /var/jenkins/workspace/adamantine-nightly/tests/test_integration_da.cc(148): Leaving test case "integration_3D_da_point_cloud_add_material"; testing time: 1706488us
4: /var/jenkins/workspace/adamantine-nightly/tests/test_integration_da.cc(231): Entering test case "integration_3D_da_ray_add_material"
4: Reading the experimental log file...
4: Done. Log entries found for 1 camera(s), with 1 frame(s).
4: Starting the main time stepping loop...
4: 10% completed
4: 20% completed
4: 30% completed
4: 40% completed
4: 50% completed
4: Performing data assimilation at time 0.12...
4: Rank: 0 | Old parameters for member 0: 
4: Rank: 1 | Old parameters for member 1: 
4: Rank: 2 | Old parameters for member 2: 
4: Rank: 0 | Number expt sites mapped to DOFs: 1
4: Rank: 1 | Number expt sites mapped to DOFs: 1
4: Rank: 2 | Number expt sites mapped to DOFs: 1
4: Getting the perturbed innovation...
4: Applying the Kalman gain...
4: Updating the ensemble members...
4: Done.
4: 60% completed
4: 70% completed
4: 80% completed
4: 90% completed
4: 100% completed
4: Reading the experimental log file...
4: Done. Log entries found for 1 camera(s), with 1 frame(s).
4: Reading the experimental log file...
4: Done. Log entries found for 1 camera(s), with 1 frame(s).
4: Reading the experimental log file...
4: Done. Log entries found for 1 camera(s), with 1 frame(s).
4: Starting the main time stepping loop...
4: Starting the main time stepping loop...
4: Starting the main time stepping loop...
4: 10% completed
4: 10% completed
4: 10% completed
4: 20% completed
4: 20% completed
4: 20% completed
4: 30% completed
4: 30% completed
4: 30% completed
4: 40% completed
4: 40% completed
4: 40% completed
4: 50% completed
4: 50% completed
4: 50% completed
4: Performing data assimilation at time 0.12...
4: Rank: 0 | Old parameters for member 0: 
4: Rank: 0 | Old parameters for member 1: 
4: Rank: 0 | Old parameters for member 2: 
4: Performing data assimilation at time 0.12...
4: Rank: 0 | Old parameters for member 0: 
4: Rank: 0 | Old parameters for member 1: 
4: Rank: 0 | Old parameters for member 2: 
4: Rank: 0 | Number expt sites mapped to DOFs: 1
4: Rank: 0 | Number expt sites mapped to DOFs: 1
4: Performing data assimilation at time 0.12...
4: Rank: 0 | Old parameters for member 0: 
4: Rank: 0 | Old parameters for member 1: 
4: Rank: 0 | Old parameters for member 2: 
4: Rank: 0 | Number expt sites mapped to DOFs: 1
4: Getting the perturbed innovation...
4: Applying the Kalman gain...
4: Getting the perturbed innovation...
4: Applying the Kalman gain...
4: Getting the perturbed innovation...
4: Applying the Kalman gain...
4: Updating the ensemble members...
4: Updating the ensemble members...
4: Done.
4: 60% completed
4: Done.
4: 60% completed
4: Updating the ensemble members...
4: Done.
4: 60% completed
4: 70% completed
4: 70% completed
4: 70% completed
4: 80% completed
4: 80% completed
4: 80% completed
4: 90% completed
4: 90% completed
4: 90% completed
4: 100% completed
4: 100% completed
4: 100% completed
4: /var/jenkins/workspace/adamantine-nightly/tests/test_integration_da.cc(231): Leaving test case "integration_3D_da_ray_add_material"; testing time: 1743956us
4: Leaving test module "Integration_Data_Assimilation"; testing time: 43383683us
4: 
4: /var/jenkins/workspace/adamantine-nightly/tests/test_integration_da.cc(231): Leaving test case "integration_3D_da_ray_add_material"; testing time: 1753359us
4: *** No errors detected
4: Leaving test module "Integration_Data_Assimilation"; testing time: 43383810us
4: 
4: *** No errors detected
4: /var/jenkins/workspace/adamantine-nightly/tests/test_integration_da.cc(231): Leaving test case "integration_3D_da_ray_add_material"; testing time: 1774499us
4: Leaving test module "Integration_Data_Assimilation"; testing time: 43385279us
4: 
4: *** No errors detected
4: 
45/48 Test  #4: test_integration_da_3 ....................   Passed   44.00 sec
test 5
      Start  5: test_integration_da_6

5: Test command: /usr/bin/mpiexec "-n" "6" "/var/jenkins/workspace/adamantine-nightly/build/bin/test_integration_da"
5: Working Directory: /var/jenkins/workspace/adamantine-nightly/build/tests
5: Test timeout computed to be: 7200
5: Running 3 test cases...
5: Running 3 test cases...
5: Entering test module "Integration_Data_Assimilation"
5: /var/jenkins/workspace/adamantine-nightly/tests/test_integration_da.cc(78): Entering test case "integration_data_assimilation"
5: Running 3 test cases...
5: Entering test module "Integration_Data_Assimilation"
5: /var/jenkins/workspace/adamantine-nightly/tests/test_integration_da.cc(78): Entering test case "integration_data_assimilation"
5: Running 3 test cases...
5: Running 3 test cases...
5: Entering test module "Integration_Data_Assimilation"
5: Entering test module "Integration_Data_Assimilation"
5: Running 3 test cases...
5: /var/jenkins/workspace/adamantine-nightly/tests/test_integration_da.cc(78): Entering test case "integration_data_assimilation"
5: /var/jenkins/workspace/adamantine-nightly/tests/test_integration_da.cc(78): Entering test case "integration_data_assimilation"
5: Entering test module "Integration_Data_Assimilation"
5: /var/jenkins/workspace/adamantine-nightly/tests/test_integration_da.cc(78): Entering test case "integration_data_assimilation"
5: Entering test module "Integration_Data_Assimilation"
5: /var/jenkins/workspace/adamantine-nightly/tests/test_integration_da.cc(78): Entering test case "integration_data_assimilation"
5: Reading the experimental log file...
5: Done. Log entries found for 1 camera(s), with 2 frame(s).
5: Starting the main time stepping loop...
5: 10% completed
5: 20% completed
5: 30% completed
5: 40% completed
5: Rank: 4 | Old parameters for member 2: 
5: Rank: 5 | Old parameters for member 2: 
5: Rank: 2 | Old parameters for member 1: 
5: Rank: 3 | Old parameters for member 1: 
5: Performing data assimilation at time 0.0211...
5: Rank: 0 | Old parameters for member 0: 
5: Rank: 1 | Old parameters for member 0: 
5: Rank: 4 | Number expt sites mapped to DOFs: 1
5: Rank: 5 | Number expt sites mapped to DOFs: 1
5: Rank: 3 | Number expt sites mapped to DOFs: 1
5: Rank: 2 | Number expt sites mapped to DOFs: 1
5: Rank: 0 | Number expt sites mapped to DOFs: 1
5: Rank: 1 | Number expt sites mapped to DOFs: 1
5: Getting the perturbed innovation...
5: Applying the Kalman gain...
5: Updating the ensemble members...
5: Done.
5: 50% completed
5: 60% completed
5: Rank: 2 | Old parameters for member 1: 
5: Rank: 3 | Old parameters for member 1: 
5: Rank: 5 | Old parameters for member 2: 
5: Rank: 4 | Old parameters for member 2: 
5: Rank: 1 | Old parameters for member 0: 
5: Performing data assimilation at time 0.0316...
5: Rank: 0 | Old parameters for member 0: 
5: Rank: 3 | Number expt sites mapped to DOFs: 1
5: Rank: 2 | Number expt sites mapped to DOFs: 1
5: Rank: 0 | Number expt sites mapped to DOFs: 1
5: Rank: 1 | Number expt sites mapped to DOFs: 1
5: Rank: 5 | Number expt sites mapped to DOFs: 1
5: Rank: 4 | Number expt sites mapped to DOFs: 1
5: Getting the perturbed innovation...
5: Applying the Kalman gain...
5: Updating the ensemble members...
5: Done.
5: 70% completed
5: 80% completed
5: 90% completed
5: 100% completed
5: Reading the experimental log file...
5: Done. Log entries found for 1 camera(s), with 2 frame(s).
5: Reading the experimental log file...
5: Done. Log entries found for 1 camera(s), with 2 frame(s).
5: Reading the experimental log file...
5: Done. Log entries found for 1 camera(s), with 2 frame(s).
5: Reading the experimental log file...
5: Done. Log entries found for 1 camera(s), with 2 frame(s).
5: Reading the experimental log file...
5: Done. Log entries found for 1 camera(s), with 2 frame(s).
5: Reading the experimental log file...
5: Done. Log entries found for 1 camera(s), with 2 frame(s).
5: Starting the main time stepping loop...
5: Starting the main time stepping loop...
5: Starting the main time stepping loop...
5: Starting the main time stepping loop...
5: Starting the main time stepping loop...
5: Starting the main time stepping loop...
5: 10% completed
5: 10% completed
5: 10% completed
5: 10% completed
5: 10% completed
5: 10% completed
5: 20% completed
5: 20% completed
5: 20% completed
5: 20% completed
5: 20% completed
5: 20% completed
5: 30% completed
5: 30% completed
5: 30% completed
5: 30% completed
5: 30% completed
5: 30% completed
5: 40% completed
5: 40% completed
5: 40% completed
5: 40% completed
5: 40% completed
5: 40% completed
5: Performing data assimilation at time 0.0211...
5: Rank: 0 | Old parameters for member 0: 
5: Rank: 0 | Old parameters for member 1: 
5: Rank: 0 | Old parameters for member 2: 
5: Rank: 0 | Number expt sites mapped to DOFs: 1
5: Performing data assimilation at time 0.0211...
5: Rank: 0 | Old parameters for member 0: 
5: Rank: 0 | Old parameters for member 1: 
5: Rank: 0 | Old parameters for member 2: 
5: Rank: 0 | Number expt sites mapped to DOFs: 1
5: Performing data assimilation at time 0.0211...
5: Rank: 0 | Old parameters for member 0: 
5: Rank: 0 | Old parameters for member 1: 
5: Rank: 0 | Old parameters for member 2: 
5: Performing data assimilation at time 0.0211...
5: Rank: 0 | Old parameters for member 0: 
5: Rank: 0 | Old parameters for member 1: 
5: Rank: 0 | Old parameters for member 2: 
5: Rank: 0 | Number expt sites mapped to DOFs: 1
5: Rank: 0 | Number expt sites mapped to DOFs: 1
5: Performing data assimilation at time 0.0211...
5: Rank: 0 | Old parameters for member 0: 
5: Rank: 0 | Old parameters for member 1: 
5: Rank: 0 | Old parameters for member 2: 
5: Performing data assimilation at time 0.0211...
5: Rank: 0 | Old parameters for member 0: 
5: Rank: 0 | Old parameters for member 1: 
5: Rank: 0 | Old parameters for member 2: 
5: Rank: 0 | Number expt sites mapped to DOFs: 1
5: Rank: 0 | Number expt sites mapped to DOFs: 1
41: 40% completed
5: Getting the perturbed innovation...
5: Applying the Kalman gain...
5: Getting the perturbed innovation...
5: Applying the Kalman gain...
5: Getting the perturbed innovation...
5: Applying the Kalman gain...
5: Getting the perturbed innovation...
5: Applying the Kalman gain...
5: Getting the perturbed innovation...
5: Applying the Kalman gain...
5: Getting the perturbed innovation...
5: Applying the Kalman gain...
5: Updating the ensemble members...
5: Done.
5: Updating the ensemble members...
5: Done.
5: Updating the ensemble members...
5: Done.
5: Updating the ensemble members...
5: Done.
5: Updating the ensemble members...
5: Done.
5: Updating the ensemble members...
5: Done.
5: 50% completed
5: 50% completed
5: 50% completed
5: 50% completed
5: 50% completed
5: 50% completed
5: 60% completed
5: 60% completed
5: 60% completed
5: 60% completed
5: 60% completed
5: 60% completed
5: Performing data assimilation at time 0.0316...
5: Rank: 0 | Old parameters for member 0: 
5: Rank: 0 | Old parameters for member 1: 
5: Rank: 0 | Old parameters for member 2: 
5: Rank: 0 | Number expt sites mapped to DOFs: 1
5: Performing data assimilation at time 0.0316...
5: Rank: 0 | Old parameters for member 0: 
5: Rank: 0 | Old parameters for member 1: 
5: Rank: 0 | Old parameters for member 2: 
5: Rank: 0 | Number expt sites mapped to DOFs: 1
5: Performing data assimilation at time 0.0316...
5: Rank: 0 | Old parameters for member 0: 
5: Rank: 0 | Old parameters for member 1: 
5: Rank: 0 | Old parameters for member 2: 
5: Rank: 0 | Number expt sites mapped to DOFs: 1
5: Performing data assimilation at time 0.0316...
5: Rank: 0 | Old parameters for member 0: 
5: Rank: 0 | Old parameters for member 1: 
5: Rank: 0 | Old parameters for member 2: 
5: Rank: 0 | Number expt sites mapped to DOFs: 1
5: Performing data assimilation at time 0.0316...
5: Rank: 0 | Old parameters for member 0: 
5: Rank: 0 | Old parameters for member 1: 
5: Rank: 0 | Old parameters for member 2: 
5: Performing data assimilation at time 0.0316...
5: Rank: 0 | Old parameters for member 0: 
5: Rank: 0 | Old parameters for member 1: 
5: Rank: 0 | Old parameters for member 2: 
5: Rank: 0 | Number expt sites mapped to DOFs: 1
5: Rank: 0 | Number expt sites mapped to DOFs: 1
5: Getting the perturbed innovation...
5: Applying the Kalman gain...
5: Getting the perturbed innovation...
5: Applying the Kalman gain...
5: Getting the perturbed innovation...
5: Applying the Kalman gain...
5: Getting the perturbed innovation...
5: Applying the Kalman gain...
5: Getting the perturbed innovation...
5: Applying the Kalman gain...
5: Getting the perturbed innovation...
5: Applying the Kalman gain...
5: Updating the ensemble members...
5: Done.
5: Updating the ensemble members...
5: Done.
5: Updating the ensemble members...
5: Done.
5: Updating the ensemble members...
5: Done.
5: Updating the ensemble members...
5: Done.
5: Updating the ensemble members...
5: Done.
5: 70% completed
5: 70% completed
5: 70% completed
5: 70% completed
5: 70% completed
5: 70% completed
5: 80% completed
5: 80% completed
5: 80% completed
5: 80% completed
5: 80% completed
5: 80% completed
5: 90% completed
5: 90% completed
5: 90% completed
5: 90% completed
5: 90% completed
5: 90% completed
5: 100% completed
5: 100% completed
5: /var/jenkins/workspace/adamantine-nightly/tests/test_integration_da.cc(78): Leaving test case "integration_data_assimilation"; testing time: 37597314us
5: /var/jenkins/workspace/adamantine-nightly/tests/test_integration_da.cc(148): Entering test case "integration_3D_da_point_cloud_add_material"
5: 100% completed
5: /var/jenkins/workspace/adamantine-nightly/tests/test_integration_da.cc(78): Leaving test case "integration_data_assimilation"; testing time: 37753409us
5: /var/jenkins/workspace/adamantine-nightly/tests/test_integration_da.cc(148): Entering test case "integration_3D_da_point_cloud_add_material"
5: 100% completed
5: /var/jenkins/workspace/adamantine-nightly/tests/test_integration_da.cc(78): Leaving test case "integration_data_assimilation"; testing time: 37793580us
5: /var/jenkins/workspace/adamantine-nightly/tests/test_integration_da.cc(148): Entering test case "integration_3D_da_point_cloud_add_material"
5: 100% completed
5: 100% completed
5: /var/jenkins/workspace/adamantine-nightly/tests/test_integration_da.cc(78): Leaving test case "integration_data_assimilation"; testing time: 37989453us
5: /var/jenkins/workspace/adamantine-nightly/tests/test_integration_da.cc(148): Entering test case "integration_3D_da_point_cloud_add_material"
5: /var/jenkins/workspace/adamantine-nightly/tests/test_integration_da.cc(78): Leaving test case "integration_data_assimilation"; testing time: 38143791us
5: /var/jenkins/workspace/adamantine-nightly/tests/test_integration_da.cc(148): Entering test case "integration_3D_da_point_cloud_add_material"
5: /var/jenkins/workspace/adamantine-nightly/tests/test_integration_da.cc(78): Leaving test case "integration_data_assimilation"; testing time: 38148239us
5: /var/jenkins/workspace/adamantine-nightly/tests/test_integration_da.cc(148): Entering test case "integration_3D_da_point_cloud_add_material"
5: Reading the experimental log file...
5: Done. Log entries found for 1 camera(s), with 1 frame(s).
5: Starting the main time stepping loop...
5: 10% completed
5: 20% completed
5: 30% completed
5: 40% completed
5: 50% completed
5: Rank: 5 | Old parameters for member 2: 
5: Rank: 4 | Old parameters for member 2: 
5: Rank: 4 | Number expt sites mapped to DOFs: 1
5: Rank: 5 | Number expt sites mapped to DOFs: 1
5: Rank: 2 | Old parameters for member 1: 
5: Rank: 3 | Old parameters for member 1: 
5: Rank: 2 | Number expt sites mapped to DOFs: 1
5: Rank: 3 | Number expt sites mapped to DOFs: 1
5: Rank: 1 | Old parameters for member 0: 
5: Performing data assimilation at time 0.12...
5: Rank: 0 | Old parameters for member 0: 
5: Rank: 0 | Number expt sites mapped to DOFs: 1
5: Rank: 1 | Number expt sites mapped to DOFs: 1
5: Getting the perturbed innovation...
5: Applying the Kalman gain...
5: Updating the ensemble members...
5: Done.
5: 60% completed
5: 70% completed
5: 80% completed
5: 90% completed
5: 100% completed
5: Reading the experimental log file...
5: Done. Log entries found for 1 camera(s), with 1 frame(s).
5: Reading the experimental log file...
5: Done. Log entries found for 1 camera(s), with 1 frame(s).
5: Reading the experimental log file...
5: Done. Log entries found for 1 camera(s), with 1 frame(s).
5: Reading the experimental log file...
5: Done. Log entries found for 1 camera(s), with 1 frame(s).
5: Reading the experimental log file...
5: Done. Log entries found for 1 camera(s), with 1 frame(s).
5: Reading the experimental log file...
5: Done. Log entries found for 1 camera(s), with 1 frame(s).
5: Starting the main time stepping loop...
5: Starting the main time stepping loop...
5: Starting the main time stepping loop...
5: Starting the main time stepping loop...
5: Starting the main time stepping loop...
5: Starting the main time stepping loop...
5: 10% completed
5: 10% completed
5: 10% completed
5: 10% completed
5: 20% completed
5: 10% completed
5: 10% completed
5: 20% completed
5: 30% completed
5: 20% completed
5: 30% completed
5: 20% completed
5: 20% completed
5: 20% completed
5: 40% completed
5: 30% completed
5: 40% completed
5: 30% completed
5: 30% completed
5: 30% completed
5: 40% completed
5: 50% completed
5: 50% completed
5: 50% completed
5: Performing data assimilation at time 0.12...
5: Rank: 0 | Old parameters for member 0: 
5: Rank: 0 | Old parameters for member 1: 
5: Rank: 0 | Old parameters for member 2: 
5: Rank: 0 | Number expt sites mapped to DOFs: 1
5: 40% completed
5: 40% completed
5: 40% completed
5: Performing data assimilation at time 0.12...
5: Rank: 0 | Old parameters for member 0: 
5: Rank: 0 | Old parameters for member 1: 
5: Rank: 0 | Old parameters for member 2: 
5: Rank: 0 | Number expt sites mapped to DOFs: 1
5: Performing data assimilation at time 0.12...
5: Rank: 0 | Old parameters for member 0: 
5: Rank: 0 | Old parameters for member 1: 
5: Rank: 0 | Old parameters for member 2: 
5: Rank: 0 | Number expt sites mapped to DOFs: 1
5: 50% completed
5: 50% completed
5: 50% completed
5: Performing data assimilation at time 0.12...
5: Performing data assimilation at time 0.12...
5: Rank: 0 | Old parameters for member 0: 
5: Rank: 0 | Old parameters for member 1: 
5: Rank: 0 | Old parameters for member 2: 
5: Performing data assimilation at time 0.12...
5: Rank: 0 | Old parameters for member 0: 
5: Rank: 0 | Old parameters for member 1: 
5: Rank: 0 | Old parameters for member 2: 
5: Rank: 0 | Old parameters for member 0: 
5: Rank: 0 | Old parameters for member 1: 
5: Rank: 0 | Old parameters for member 2: 
5: Rank: 0 | Number expt sites mapped to DOFs: 1
5: Rank: 0 | Number expt sites mapped to DOFs: 1
5: Rank: 0 | Number expt sites mapped to DOFs: 1
5: Getting the perturbed innovation...
5: Applying the Kalman gain...
5: Getting the perturbed innovation...
5: Applying the Kalman gain...
5: Getting the perturbed innovation...
5: Applying the Kalman gain...
5: Getting the perturbed innovation...
5: Applying the Kalman gain...
5: Getting the perturbed innovation...
5: Getting the perturbed innovation...
5: Applying the Kalman gain...
5: Applying the Kalman gain...
5: Updating the ensemble members...
5: Done.
5: 60% completed
5: Updating the ensemble members...
5: Done.
5: 60% completed
5: 70% completed
5: Updating the ensemble members...
5: Done.
5: 60% completed
5: 70% completed
5: 80% completed
5: 70% completed
5: 80% completed
5: 90% completed
5: Updating the ensemble members...
5: Updating the ensemble members...
5: Updating the ensemble members...
5: Done.
5: 60% completed
5: Done.
5: Done.
5: 60% completed
5: 60% completed
5: 80% completed
5: 90% completed
5: 90% completed
5: 70% completed
5: 70% completed
5: 70% completed
5: 80% completed
5: 80% completed
5: 80% completed
5: 90% completed
5: 90% completed
5: 90% completed
5: 100% completed
5: 100% completed
5: /var/jenkins/workspace/adamantine-nightly/tests/test_integration_da.cc(148): Leaving test case "integration_3D_da_point_cloud_add_material"; testing time: 1882223us
5: /var/jenkins/workspace/adamantine-nightly/tests/test_integration_da.cc(231): Entering test case "integration_3D_da_ray_add_material"
5: 100% completed
5: /var/jenkins/workspace/adamantine-nightly/tests/test_integration_da.cc(148): Leaving test case "integration_3D_da_point_cloud_add_material"; testing time: 2099724us
5: /var/jenkins/workspace/adamantine-nightly/tests/test_integration_da.cc(231): Entering test case "integration_3D_da_ray_add_material"
5: /var/jenkins/workspace/adamantine-nightly/tests/test_integration_da.cc(148): Leaving test case "integration_3D_da_point_cloud_add_material"; testing time: 1772909us
5: /var/jenkins/workspace/adamantine-nightly/tests/test_integration_da.cc(231): Entering test case "integration_3D_da_ray_add_material"
5: 100% completed
5: 100% completed
5: 100% completed
5: /var/jenkins/workspace/adamantine-nightly/tests/test_integration_da.cc(148): Leaving test case "integration_3D_da_point_cloud_add_material"; testing time: 2264047us
5: /var/jenkins/workspace/adamantine-nightly/tests/test_integration_da.cc(148): Leaving test case "integration_3D_da_point_cloud_add_material"; testing time: 1873729us
5: /var/jenkins/workspace/adamantine-nightly/tests/test_integration_da.cc(231): Entering test case "integration_3D_da_ray_add_material"
5: /var/jenkins/workspace/adamantine-nightly/tests/test_integration_da.cc(231): Entering test case "integration_3D_da_ray_add_material"
5: /var/jenkins/workspace/adamantine-nightly/tests/test_integration_da.cc(148): Leaving test case "integration_3D_da_point_cloud_add_material"; testing time: 2420576us
5: /var/jenkins/workspace/adamantine-nightly/tests/test_integration_da.cc(231): Entering test case "integration_3D_da_ray_add_material"
5: Reading the experimental log file...
5: Done. Log entries found for 1 camera(s), with 1 frame(s).
5: Starting the main time stepping loop...
5: 10% completed
5: 20% completed
5: 30% completed
5: 40% completed
5: 50% completed
5: Performing data assimilation at time 0.12...
5: Rank: 0 | Old parameters for member 0: 
5: Rank: 1 | Old parameters for member 0: 
5: Rank: 2 | Old parameters for member 1: 
5: Rank: 3 | Old parameters for member 1: 
5: Rank: 1 | Number expt sites mapped to DOFs: 1
5: Rank: 0 | Number expt sites mapped to DOFs: 1
5: Rank: 4 | Old parameters for member 2: 
5: Rank: 5 | Old parameters for member 2: 
5: Rank: 3 | Number expt sites mapped to DOFs: 1
5: Rank: 2 | Number expt sites mapped to DOFs: 1
5: Rank: 5 | Number expt sites mapped to DOFs: 1
5: Rank: 4 | Number expt sites mapped to DOFs: 1
5: Getting the perturbed innovation...
5: Applying the Kalman gain...
5: Updating the ensemble members...
5: Done.
5: 60% completed
5: 70% completed
5: 80% completed
5: 90% completed
5: 100% completed
5: Reading the experimental log file...
5: Done. Log entries found for 1 camera(s), with 1 frame(s).
5: Reading the experimental log file...
5: Done. Log entries found for 1 camera(s), with 1 frame(s).
5: Reading the experimental log file...
5: Reading the experimental log file...
5: Done. Log entries found for 1 camera(s), with 1 frame(s).
5: Done. Log entries found for 1 camera(s), with 1 frame(s).
5: Reading the experimental log file...
5: Done. Log entries found for 1 camera(s), with 1 frame(s).
5: Reading the experimental log file...
5: Done. Log entries found for 1 camera(s), with 1 frame(s).
5: Starting the main time stepping loop...
5: Starting the main time stepping loop...
5: Starting the main time stepping loop...
5: Starting the main time stepping loop...
5: Starting the main time stepping loop...
5: Starting the main time stepping loop...
5: 10% completed
5: 10% completed
5: 10% completed
5: 10% completed
5: 10% completed
5: 10% completed
5: 20% completed
5: 20% completed
5: 20% completed
5: 20% completed
5: 20% completed
5: 20% completed
5: 30% completed
5: 30% completed
5: 30% completed
5: 40% completed
5: 30% completed
5: 30% completed
5: 30% completed
5: 40% completed
5: 40% completed
5: 50% completed
5: 40% completed
5: 40% completed
5: 40% completed
5: Performing data assimilation at time 0.12...
5: Rank: 0 | Old parameters for member 0: 
5: Rank: 0 | Old parameters for member 1: 
5: Rank: 0 | Old parameters for member 2: 
5: Rank: 0 | Number expt sites mapped to DOFs: 1
5: 50% completed
5: 50% completed
5: 50% completed
5: 50% completed
5: 50% completed
5: Performing data assimilation at time 0.12...
5: Rank: 0 | Old parameters for member 0: 
5: Rank: 0 | Old parameters for member 1: 
5: Rank: 0 | Old parameters for member 2: 
5: Performing data assimilation at time 0.12...
5: Rank: 0 | Old parameters for member 0: 
5: Rank: 0 | Old parameters for member 1: 
5: Rank: 0 | Old parameters for member 2: 
5: Rank: 0 | Number expt sites mapped to DOFs: 1
5: Rank: 0 | Number expt sites mapped to DOFs: 1
5: Performing data assimilation at time 0.12...
5: Rank: 0 | Old parameters for member 0: 
5: Rank: 0 | Old parameters for member 1: 
5: Rank: 0 | Old parameters for member 2: 
5: Performing data assimilation at time 0.12...
5: Rank: 0 | Old parameters for member 0: 
5: Rank: 0 | Old parameters for member 1: 
5: Rank: 0 | Old parameters for member 2: 
5: Performing data assimilation at time 0.12...
5: Rank: 0 | Old parameters for member 0: 
5: Rank: 0 | Old parameters for member 1: 
5: Rank: 0 | Old parameters for member 2: 
5: Rank: 0 | Number expt sites mapped to DOFs: 1
5: Rank: 0 | Number expt sites mapped to DOFs: 1
5: Rank: 0 | Number expt sites mapped to DOFs: 1
5: Getting the perturbed innovation...
5: Applying the Kalman gain...
5: Getting the perturbed innovation...
5: Applying the Kalman gain...
5: Getting the perturbed innovation...
5: Applying the Kalman gain...
5: Getting the perturbed innovation...
5: Applying the Kalman gain...
5: Getting the perturbed innovation...
5: Applying the Kalman gain...
5: Getting the perturbed innovation...
5: Applying the Kalman gain...
5: Updating the ensemble members...
5: Done.
5: 60% completed
5: 70% completed
5: Updating the ensemble members...
5: Done.
5: 60% completed
5: Updating the ensemble members...
5: Done.
5: 60% completed
5: 80% completed
5: 70% completed
5: Updating the ensemble members...
5: Done.
5: 60% completed
5: Updating the ensemble members...
5: Updating the ensemble members...
5: 70% completed
5: Done.
5: 60% completed
5: Done.
5: 60% completed
5: 90% completed
5: 80% completed
5: 70% completed
5: 80% completed
5: 70% completed
5: 70% completed
5: 90% completed
5: 80% completed
5: 90% completed
5: 80% completed
5: 80% completed
5: 90% completed
5: 90% completed
5: 90% completed
5: 100% completed
5: 100% completed
5: /var/jenkins/workspace/adamantine-nightly/tests/test_integration_da.cc(231): Leaving test case "integration_3D_da_ray_add_material"; testing time: 1940226us
5: Leaving test module "Integration_Data_Assimilation"; testing time: 41833790us
5: 
5: *** No errors detected
5: 100% completed
5: 100% completed
5: /var/jenkins/workspace/adamantine-nightly/tests/test_integration_da.cc(231): Leaving test case "integration_3D_da_ray_add_material"; testing time: 1989407us
5: Leaving test module "Integration_Data_Assimilation"; testing time: 41861368us
5: 
5: *** No errors detected
5: /var/jenkins/workspace/adamantine-nightly/tests/test_integration_da.cc(231): Leaving test case "integration_3D_da_ray_add_material"; testing time: 1956325us
5: Leaving test module "Integration_Data_Assimilation"; testing time: 41877748us
5: 
5: *** No errors detected
5: 100% completed
5: 100% completed
5: /var/jenkins/workspace/adamantine-nightly/tests/test_integration_da.cc(231): Leaving test case "integration_3D_da_ray_add_material"; testing time: 1874390us
5: Leaving test module "Integration_Data_Assimilation"; testing time: 41892099us
5: 
5: *** No errors detected
5: /var/jenkins/workspace/adamantine-nightly/tests/test_integration_da.cc(231): Leaving test case "integration_3D_da_ray_add_material"; testing time: 1901365us
5: Leaving test module "Integration_Data_Assimilation"; testing time: 41919538us
5: 
5: *** No errors detected
5: /var/jenkins/workspace/adamantine-nightly/tests/test_integration_da.cc(231): Leaving test case "integration_3D_da_ray_add_material"; testing time: 1901821us
5: Leaving test module "Integration_Data_Assimilation"; testing time: 41919598us
5: 
5: *** No errors detected
5: 
46/48 Test  #5: test_integration_da_6 ....................   Passed   42.63 sec
test 8
      Start  8: test_closest_source_point_adaptation_3

8: Test command: /usr/bin/mpiexec "-n" "3" "/var/jenkins/workspace/adamantine-nightly/build/bin/test_closest_source_point_adaptation"
8: Working Directory: /var/jenkins/workspace/adamantine-nightly/build/tests
8: Test timeout computed to be: 7200
8: Running 1 test case...
8: Entering test module "ClosestSourcePointAdaptation"
8: /var/jenkins/workspace/adamantine-nightly/tests/test_closest_source_point_adaptation.cc(124): Entering test case "closest_source_point_adaptation"
8: Running 1 test case...
8: Running 1 test case...
8: Entering test module "ClosestSourcePointAdaptation"
8: /var/jenkins/workspace/adamantine-nightly/tests/test_closest_source_point_adaptation.cc(124): Entering test case "closest_source_point_adaptation"
8: Entering test module "ClosestSourcePointAdaptation"
8: /var/jenkins/workspace/adamantine-nightly/tests/test_closest_source_point_adaptation.cc(124): Entering test case "closest_source_point_adaptation"
8: /var/jenkins/workspace/adamantine-nightly/tests/test_closest_source_point_adaptation.cc(124): Leaving test case "closest_source_point_adaptation"; testing time: 5846174us
8: Leaving test module "ClosestSourcePointAdaptation"; testing time: 5846235us
8: 
8: *** No errors detected
8: /var/jenkins/workspace/adamantine-nightly/tests/test_closest_source_point_adaptation.cc(124): Leaving test case "closest_source_point_adaptation"; testing time: 5846833us
8: Leaving test module "ClosestSourcePointAdaptation"; testing time: 5846916us
8: 
8: *** No errors detected
8: /var/jenkins/workspace/adamantine-nightly/tests/test_closest_source_point_adaptation.cc(124): Leaving test case "closest_source_point_adaptation"; testing time: 5847007us
8: Leaving test module "ClosestSourcePointAdaptation"; testing time: 5847086us
8: 
8: *** No errors detected
8: 
47/48 Test  #8: test_closest_source_point_adaptation_3 ...   Passed    6.51 sec
test 9
      Start  9: test_closest_source_point_adaptation_6

9: Test command: /usr/bin/mpiexec "-n" "6" "/var/jenkins/workspace/adamantine-nightly/build/bin/test_closest_source_point_adaptation"
9: Working Directory: /var/jenkins/workspace/adamantine-nightly/build/tests
9: Test timeout computed to be: 7200
9: Running 1 test case...
9: Entering test module "ClosestSourcePointAdaptation"
9: /var/jenkins/workspace/adamantine-nightly/tests/test_closest_source_point_adaptation.cc(124): Entering test case "closest_source_point_adaptation"
9: Running 1 test case...
9: Running 1 test case...
9: Running 1 test case...
9: Running 1 test case...
9: Entering test module "ClosestSourcePointAdaptation"
9: /var/jenkins/workspace/adamantine-nightly/tests/test_closest_source_point_adaptation.cc(124): Entering test case "closest_source_point_adaptation"
9: Entering test module "ClosestSourcePointAdaptation"
9: Entering test module "ClosestSourcePointAdaptation"
9: /var/jenkins/workspace/adamantine-nightly/tests/test_closest_source_point_adaptation.cc(124): Entering test case "closest_source_point_adaptation"
9: Entering test module "ClosestSourcePointAdaptation"
9: /var/jenkins/workspace/adamantine-nightly/tests/test_closest_source_point_adaptation.cc(124): Entering test case "closest_source_point_adaptation"
9: /var/jenkins/workspace/adamantine-nightly/tests/test_closest_source_point_adaptation.cc(124): Entering test case "closest_source_point_adaptation"
9: Running 1 test case...
9: Entering test module "ClosestSourcePointAdaptation"
9: /var/jenkins/workspace/adamantine-nightly/tests/test_closest_source_point_adaptation.cc(124): Entering test case "closest_source_point_adaptation"
9: /var/jenkins/workspace/adamantine-nightly/tests/test_closest_source_point_adaptation.cc(124): Leaving test case "closest_source_point_adaptation"; testing time: 3657ms
9: Leaving test module "ClosestSourcePointAdaptation"; testing time: 3657072us
9: 
9: *** No errors detected
9: /var/jenkins/workspace/adamantine-nightly/tests/test_closest_source_point_adaptation.cc(124): Leaving test case "closest_source_point_adaptation"; testing time: 3657486us
9: Leaving test module "ClosestSourcePointAdaptation"; testing time: 3657556us
9: 
9: *** No errors detected
9: /var/jenkins/workspace/adamantine-nightly/tests/test_closest_source_point_adaptation.cc(124): Leaving test case "closest_source_point_adaptation"; testing time: 3657962us
9: Leaving test module "ClosestSourcePointAdaptation"; testing time: 3658044us
9: 
9: *** No errors detected
9: /var/jenkins/workspace/adamantine-nightly/tests/test_closest_source_point_adaptation.cc(124): Leaving test case "closest_source_point_adaptation"; testing time: 3658075us
9: /var/jenkins/workspace/adamantine-nightly/tests/test_closest_source_point_adaptation.cc(124): Leaving test case "closest_source_point_adaptation"; testing time: 3658364us
9: Leaving test module "ClosestSourcePointAdaptation"; testing time: 3658454us
9: Leaving test module "ClosestSourcePointAdaptation"; testing time: 3658161us
9: 
9: *** No errors detected
9: 
9: *** No errors detected
9: /var/jenkins/workspace/adamantine-nightly/tests/test_closest_source_point_adaptation.cc(124): Leaving test case "closest_source_point_adaptation"; testing time: 3658223us
9: Leaving test module "ClosestSourcePointAdaptation"; testing time: 3658309us
9: 
9: *** No errors detected
9: 
48/48 Test  #9: test_closest_source_point_adaptation_6 ...   Passed    4.38 sec

The following tests passed:
	test_closest_source_point_adaptation_1
	test_data_assimilator_1
	test_experimental_data_1
	test_geometry_1
	test_heat_source_1
	test_integration_da_2
	test_closest_source_point_adaptation_2
	test_material_property_1
	test_material_property_device_1
	test_integration_da_1
	test_post_processor_1
	test_quaternion_1
	test_scan_path_1
	test_thermal_operator_1
	test_thermal_operator_device_1
	test_mechanical_operator_1
	test_timer_1
	test_utils_1
	test_validate_input_database_1
	test_integration_2d_1
	test_integration_2d_device_1
	test_thermal_physics_device_1
	test_mechanical_physics_1
	test_integration_3d_amr_1
	test_integration_3d_amr_device_1
	test_integration_da_augmented_1
	test_material_deposition_1
	test_microstructure_1
	test_thermal_physics_1
	test_ensemble_management_1
	test_integration_3d_device_1
	test_integration_2d_2
	test_integration_2d_device_2
	test_integration_3d_amr_2
	test_integration_3d_amr_device_2
	test_integration_da_augmented_2
	test_material_deposition_2
	test_microstructure_2
	test_thermal_physics_2
	test_ensemble_management_2
	test_integration_thermoelastic_2
	test_integration_da_3
	test_integration_da_6
	test_closest_source_point_adaptation_3
	test_closest_source_point_adaptation_6

94% tests passed, 3 tests failed out of 48

Total Test time (real) = 10876.63 sec

The following tests FAILED:
	 32 - test_integration_3d_1 (Timeout)
	 33 - test_integration_3d_2 (Timeout)
	 40 - test_integration_thermoelastic_1 (Timeout)
Errors while running CTest
Output from these tests are in: /var/jenkins/workspace/adamantine-nightly/build/Testing/Temporary/LastTest.log
Use "--rerun-failed --output-on-failure" to re-run the failed cases verbosely.
[Pipeline] }
[Pipeline] // dir
Post stage
[Pipeline] xunit
INFO: Processing CTest-Version 3.x (default)
[Pipeline] }
[Pipeline] // withEnv
[Pipeline] }
$ docker stop --time=1 d91568db24223d7d86628f687ccbeb7bf9f13dc2573e4cfc2d27ee88df2a128b
INFO: [CTest-Version 3.x (default)] - 1 test report file(s) were found with the pattern 'build/Testing/**/Test.xml' relative to '/var/jenkins/workspace/adamantine-nightly' for the testing framework 'CTest-Version 3.x (default)'.
$ docker rm -f --volumes d91568db24223d7d86628f687ccbeb7bf9f13dc2573e4cfc2d27ee88df2a128b
[Pipeline] // withDockerContainer
[Pipeline] }
[Pipeline] // withEnv
[Pipeline] }
[Pipeline] // node
[Pipeline] }
[Pipeline] // stage
[Pipeline] }
Failed in branch CPU
41: 50% completed
41: 60% completed
41: 70% completed
41: 80% completed
41: 90% completed
41: 100% completed
41: /var/jenkins/workspace/adamantine-nightly/tests/test_integration_thermoelastic.cc(19): Leaving test case "integration_thermoelastic"; testing time: 2702916081us
41: /var/jenkins/workspace/adamantine-nightly/tests/test_integration_thermoelastic.cc(47): Entering test case "integration_thermoelastic_add_material"
41: /var/jenkins/workspace/adamantine-nightly/tests/test_integration_thermoelastic.cc(19): Leaving test case "integration_thermoelastic"; testing time: 2702966920us
41: /var/jenkins/workspace/adamantine-nightly/tests/test_integration_thermoelastic.cc(47): Entering test case "integration_thermoelastic_add_material"
41: 10% completed
41: 20% completed
41: 30% completed
41: 40% completed
41: 50% completed
41: 60% completed
41: 70% completed
41: 80% completed
41: 90% completed
41: 100% completed
41: 
41: *** No errors detected
41: /var/jenkins/workspace/adamantine-nightly/tests/test_integration_thermoelastic.cc(47): Leaving test case "integration_thermoelastic_add_material"; testing time: 1365110195us
41: Leaving test module "Integration_Thermoelastic"; testing time: 4068028612us
41: /var/jenkins/workspace/adamantine-nightly/tests/test_integration_thermoelastic.cc(47): Leaving test case "integration_thermoelastic_add_material"; testing time: 1365110199us
41: 
41: Leaving test module "Integration_Thermoelastic"; testing time: 4068079571us
41: *** No errors detected
41: 
44/48 Test #41: test_integration_thermoelastic_2 .........   Passed  4074.23 sec
test 4
      Start  4: test_integration_da_3

4: Test command: /usr/bin/mpiexec "-n" "3" "/var/jenkins/workspace/adamantine-nightly/build/bin/test_integration_da"
4: Working Directory: /var/jenkins/workspace/adamantine-nightly/build/tests
4: Test timeout computed to be: 7200
4: Running 3 test cases...
4: Entering test module "Integration_Data_Assimilation"
4: /var/jenkins/workspace/adamantine-nightly/tests/test_integration_da.cc(78): Entering test case "integration_data_assimilation"
4: Running 3 test cases...
4: Entering test module "Integration_Data_Assimilation"
4: /var/jenkins/workspace/adamantine-nightly/tests/test_integration_da.cc(78): Entering test case "integration_data_assimilation"
4: Running 3 test cases...
4: Entering test module "Integration_Data_Assimilation"
4: /var/jenkins/workspace/adamantine-nightly/tests/test_integration_da.cc(78): Entering test case "integration_data_assimilation"
4: Reading the experimental log file...
4: Done. Log entries found for 1 camera(s), with 2 frame(s).
4: Starting the main time stepping loop...
4: 10% completed
4: 20% completed
4: 30% completed
4: 40% completed
4: Rank: 1 | Old parameters for member 1: 
4: Performing data assimilation at time 0.0211...
4: Rank: 0 | Old parameters for member 0: 
4: Rank: 2 | Old parameters for member 2: 
4: Rank: 1 | Number expt sites mapped to DOFs: 1
4: Rank: 0 | Number expt sites mapped to DOFs: 1
4: Rank: 2 | Number expt sites mapped to DOFs: 1
4: Getting the perturbed innovation...
4: Applying the Kalman gain...
4: Updating the ensemble members...
4: Done.
4: 50% completed
4: 60% completed
4: Performing data assimilation at time 0.0316...
4: Rank: 0 | Old parameters for member 0: 
4: Rank: 1 | Old parameters for member 1: 
4: Rank: 2 | Old parameters for member 2: 
4: Rank: 0 | Number expt sites mapped to DOFs: 1
4: Rank: 1 | Number expt sites mapped to DOFs: 1
4: Rank: 2 | Number expt sites mapped to DOFs: 1
4: Getting the perturbed innovation...
4: Applying the Kalman gain...
4: Updating the ensemble members...
4: Done.
4: 70% completed
4: 80% completed
4: 90% completed
4: 100% completed
4: Reading the experimental log file...
4: Done. Log entries found for 1 camera(s), with 2 frame(s).
4: Reading the experimental log file...
4: Done. Log entries found for 1 camera(s), with 2 frame(s).
4: Reading the experimental log file...
4: Done. Log entries found for 1 camera(s), with 2 frame(s).
4: Starting the main time stepping loop...
4: Starting the main time stepping loop...
4: Starting the main time stepping loop...
4: 10% completed
4: 10% completed
4: 10% completed
4: 20% completed
4: 20% completed
4: 20% completed
4: 30% completed
4: 30% completed
4: 30% completed
4: 40% completed
4: 40% completed
4: 40% completed
4: Performing data assimilation at time 0.0211...
4: Rank: 0 | Old parameters for member 0: 
4: Rank: 0 | Old parameters for member 1: 
4: Rank: 0 | Old parameters for member 2: 
4: Rank: 0 | Number expt sites mapped to DOFs: 1
4: Performing data assimilation at time 0.0211...
4: Rank: 0 | Old parameters for member 0: 
4: Rank: 0 | Old parameters for member 1: 
4: Rank: 0 | Old parameters for member 2: 
4: Performing data assimilation at time 0.0211...
4: Rank: 0 | Old parameters for member 0: 
4: Rank: 0 | Old parameters for member 1: 
4: Rank: 0 | Old parameters for member 2: 
4: Rank: 0 | Number expt sites mapped to DOFs: 1
4: Rank: 0 | Number expt sites mapped to DOFs: 1
4: Getting the perturbed innovation...
4: Applying the Kalman gain...
4: Getting the perturbed innovation...
4: Applying the Kalman gain...
4: Getting the perturbed innovation...
4: Applying the Kalman gain...
4: Updating the ensemble members...
4: Done.
4: Updating the ensemble members...
4: Done.
4: Updating the ensemble members...
4: Done.
4: 50% completed
4: 50% completed
4: 50% completed
4: 60% completed
4: 60% completed
4: 60% completed
4: Performing data assimilation at time 0.0316...
4: Rank: 0 | Old parameters for member 0: 
4: Rank: 0 | Old parameters for member 1: 
4: Rank: 0 | Old parameters for member 2: 
4: Rank: 0 | Number expt sites mapped to DOFs: 1
4: Performing data assimilation at time 0.0316...
4: Rank: 0 | Old parameters for member 0: 
4: Rank: 0 | Old parameters for member 1: 
4: Rank: 0 | Old parameters for member 2: 
4: Rank: 0 | Number expt sites mapped to DOFs: 1
4: Performing data assimilation at time 0.0316...
4: Rank: 0 | Old parameters for member 0: 
4: Rank: 0 | Old parameters for member 1: 
4: Rank: 0 | Old parameters for member 2: 
4: Rank: 0 | Number expt sites mapped to DOFs: 1
4: Getting the perturbed innovation...
4: Applying the Kalman gain...
4: Getting the perturbed innovation...
4: Applying the Kalman gain...
4: Getting the perturbed innovation...
4: Applying the Kalman gain...
4: Updating the ensemble members...
4: Done.
4: Updating the ensemble members...
4: Done.
4: Updating the ensemble members...
4: Done.
4: 70% completed
4: 70% completed
4: 70% completed
4: 80% completed
4: 80% completed
4: 80% completed
4: 90% completed
4: 90% completed
4: 90% completed
4: 100% completed
4: /var/jenkins/workspace/adamantine-nightly/tests/test_integration_da.cc(78): Leaving test case "integration_data_assimilation"; testing time: 63150255us
4: /var/jenkins/workspace/adamantine-nightly/tests/test_integration_da.cc(148): Entering test case "integration_3D_da_point_cloud_add_material"
4: 100% completed
4: /var/jenkins/workspace/adamantine-nightly/tests/test_integration_da.cc(78): Leaving test case "integration_data_assimilation"; testing time: 63590428us
4: /var/jenkins/workspace/adamantine-nightly/tests/test_integration_da.cc(148): Entering test case "integration_3D_da_point_cloud_add_material"
4: 100% completed
4: /var/jenkins/workspace/adamantine-nightly/tests/test_integration_da.cc(78): Leaving test case "integration_data_assimilation"; testing time: 64064377us
4: /var/jenkins/workspace/adamantine-nightly/tests/test_integration_da.cc(148): Entering test case "integration_3D_da_point_cloud_add_material"
4: Reading the experimental log file...
4: Done. Log entries found for 1 camera(s), with 1 frame(s).
4: Starting the main time stepping loop...
4: 10% completed
4: 20% completed
4: 30% completed
4: 40% completed
4: 50% completed
4: Rank: 1 | Old parameters for member 1: 
4: Rank: 2 | Old parameters for member 2: 
4: Performing data assimilation at time 0.12...
4: Rank: 0 | Old parameters for member 0: 
4: Rank: 1 | Number expt sites mapped to DOFs: 1
4: Rank: 2 | Number expt sites mapped to DOFs: 1
4: Rank: 0 | Number expt sites mapped to DOFs: 1
4: Getting the perturbed innovation...
4: Applying the Kalman gain...
4: Updating the ensemble members...
4: Done.
4: 60% completed
4: 70% completed
4: 80% completed
4: 90% completed
4: 100% completed
4: Reading the experimental log file...
4: Done. Log entries found for 1 camera(s), with 1 frame(s).
4: Reading the experimental log file...
4: Done. Log entries found for 1 camera(s), with 1 frame(s).
4: Reading the experimental log file...
4: Done. Log entries found for 1 camera(s), with 1 frame(s).
4: Starting the main time stepping loop...
4: Starting the main time stepping loop...
4: Starting the main time stepping loop...
4: 10% completed
4: 10% completed
4: 10% completed
4: 20% completed
4: 20% completed
4: 20% completed
4: 30% completed
4: 30% completed
4: 30% completed
4: 40% completed
4: 40% completed
4: 40% completed
4: 50% completed
4: 50% completed
4: 50% completed
4: Performing data assimilation at time 0.12...
4: Rank: 0 | Old parameters for member 0: 
4: Rank: 0 | Old parameters for member 1: 
4: Rank: 0 | Old parameters for member 2: 
4: Performing data assimilation at time 0.12...
4: Rank: 0 | Old parameters for member 0: 
4: Rank: 0 | Old parameters for member 1: 
4: Rank: 0 | Old parameters for member 2: 
4: Performing data assimilation at time 0.12...
4: Rank: 0 | Old parameters for member 0: 
4: Rank: 0 | Old parameters for member 1: 
4: Rank: 0 | Old parameters for member 2: 
4: Rank: 0 | Number expt sites mapped to DOFs: 1
4: Rank: 0 | Number expt sites mapped to DOFs: 1
4: Rank: 0 | Number expt sites mapped to DOFs: 1
4: Getting the perturbed innovation...
4: Applying the Kalman gain...
4: Getting the perturbed innovation...
4: Applying the Kalman gain...
4: Getting the perturbed innovation...
4: Applying the Kalman gain...
4: Updating the ensemble members...
4: Done.
4: 60% completed
4: Updating the ensemble members...
4: Done.
4: 60% completed
4: Updating the ensemble members...
4: Done.
4: 60% completed
4: 70% completed
4: 70% completed
4: 70% completed
4: 80% completed
4: 80% completed
4: 80% completed
4: 90% completed
4: 90% completed
4: 90% completed
4: 100% completed
4: 100% completed
4: 100% completed
4: /var/jenkins/workspace/adamantine-nightly/tests/test_integration_da.cc(148): Leaving test case "integration_3D_da_point_cloud_add_material"; testing time: 3371338us
4: /var/jenkins/workspace/adamantine-nightly/tests/test_integration_da.cc(231): Entering test case "integration_3D_da_ray_add_material"
4: /var/jenkins/workspace/adamantine-nightly/tests/test_integration_da.cc(148): Leaving test case "integration_3D_da_point_cloud_add_material"; testing time: 2900566us
4: /var/jenkins/workspace/adamantine-nightly/tests/test_integration_da.cc(231): Entering test case "integration_3D_da_ray_add_material"
4: /var/jenkins/workspace/adamantine-nightly/tests/test_integration_da.cc(148): Leaving test case "integration_3D_da_point_cloud_add_material"; testing time: 2429651us
4: /var/jenkins/workspace/adamantine-nightly/tests/test_integration_da.cc(231): Entering test case "integration_3D_da_ray_add_material"
4: Reading the experimental log file...
4: Done. Log entries found for 1 camera(s), with 1 frame(s).
4: Starting the main time stepping loop...
4: 10% completed
4: 20% completed
4: 30% completed
4: 40% completed
4: 50% completed
4: Rank: 2 | Old parameters for member 2: 
4: Rank: 2 | Number expt sites mapped to DOFs: 1
4: Rank: 1 | Old parameters for member 1: 
4: Performing data assimilation at time 0.12...
4: Rank: 0 | Old parameters for member 0: 
4: Rank: 0 | Number expt sites mapped to DOFs: 1
4: Rank: 1 | Number expt sites mapped to DOFs: 1
4: Getting the perturbed innovation...
4: Applying the Kalman gain...
4: Updating the ensemble members...
4: Done.
4: 60% completed
4: 70% completed
4: 80% completed
4: 90% completed
4: 100% completed
4: Reading the experimental log file...
4: Done. Log entries found for 1 camera(s), with 1 frame(s).
4: Reading the experimental log file...
4: Done. Log entries found for 1 camera(s), with 1 frame(s).
4: Reading the experimental log file...
4: Done. Log entries found for 1 camera(s), with 1 frame(s).
4: Starting the main time stepping loop...
4: Starting the main time stepping loop...
4: Starting the main time stepping loop...
4: 10% completed
4: 10% completed
4: 10% completed
4: 20% completed
4: 20% completed
4: 20% completed
4: 30% completed
4: 30% completed
4: 30% completed
4: 40% completed
4: 40% completed
4: 40% completed
4: 50% completed
4: 50% completed
4: 50% completed
4: Performing data assimilation at time 0.12...
4: Rank: 0 | Old parameters for member 0: 
4: Rank: 0 | Old parameters for member 1: 
4: Rank: 0 | Old parameters for member 2: 
4: Rank: 0 | Number expt sites mapped to DOFs: 1
4: Performing data assimilation at time 0.12...
4: Rank: 0 | Old parameters for member 0: 
4: Rank: 0 | Old parameters for member 1: 
4: Rank: 0 | Old parameters for member 2: 
4: Rank: 0 | Number expt sites mapped to DOFs: 1
4: Performing data assimilation at time 0.12...
4: Rank: 0 | Old parameters for member 0: 
4: Rank: 0 | Old parameters for member 1: 
4: Rank: 0 | Old parameters for member 2: 
4: Rank: 0 | Number expt sites mapped to DOFs: 1
4: Getting the perturbed innovation...
4: Applying the Kalman gain...
4: Getting the perturbed innovation...
4: Applying the Kalman gain...
4: Getting the perturbed innovation...
4: Applying the Kalman gain...
4: Updating the ensemble members...
4: Done.
4: 60% completed
4: Updating the ensemble members...
4: Done.
4: 60% completed
4: Updating the ensemble members...
4: Done.
4: 60% completed
4: 70% completed
4: 70% completed
4: 70% completed
4: 80% completed
4: 80% completed
4: 80% completed
4: 90% completed
4: 90% completed
4: 90% completed
4: 100% completed
4: 100% completed
4: 100% completed
4: 
4: *** No errors detected
4: /var/jenkins/workspace/adamantine-nightly/tests/test_integration_da.cc(231): Leaving test case "integration_3D_da_ray_add_material"; testing time: 2363327us
4: Leaving test module "Integration_Data_Assimilation"; testing time: 68885046us
4: /var/jenkins/workspace/adamantine-nightly/tests/test_integration_da.cc(231): Leaving test case "integration_3D_da_ray_add_material"; testing time: 2365601us
4: Leaving test module "Integration_Data_Assimilation"; testing time: 68859795us
4: 
4: *** No errors detected
4: /var/jenkins/workspace/adamantine-nightly/tests/test_integration_da.cc(231): Leaving test case "integration_3D_da_ray_add_material"; testing time: 2391999us
4: Leaving test module "Integration_Data_Assimilation"; testing time: 68883164us
4: 
4: *** No errors detected
4: 
45/48 Test  #4: test_integration_da_3 ....................   Passed   70.26 sec
test 5
      Start  5: test_integration_da_6

5: Test command: /usr/bin/mpiexec "-n" "6" "/var/jenkins/workspace/adamantine-nightly/build/bin/test_integration_da"
5: Working Directory: /var/jenkins/workspace/adamantine-nightly/build/tests
5: Test timeout computed to be: 7200
5: Running 3 test cases...
5: Entering test module "Integration_Data_Assimilation"
5: /var/jenkins/workspace/adamantine-nightly/tests/test_integration_da.cc(78): Entering test case "integration_data_assimilation"
5: Running 3 test cases...
5: Entering test module "Integration_Data_Assimilation"
5: /var/jenkins/workspace/adamantine-nightly/tests/test_integration_da.cc(78): Entering test case "integration_data_assimilation"
5: Running 3 test cases...
5: Entering test module "Integration_Data_Assimilation"
5: /var/jenkins/workspace/adamantine-nightly/tests/test_integration_da.cc(78): Entering test case "integration_data_assimilation"
5: Running 3 test cases...
5: Entering test module "Integration_Data_Assimilation"
5: /var/jenkins/workspace/adamantine-nightly/tests/test_integration_da.cc(78): Entering test case "integration_data_assimilation"
5: Running 3 test cases...
5: Entering test module "Integration_Data_Assimilation"
5: /var/jenkins/workspace/adamantine-nightly/tests/test_integration_da.cc(78): Entering test case "integration_data_assimilation"
5: Running 3 test cases...
5: Entering test module "Integration_Data_Assimilation"
5: /var/jenkins/workspace/adamantine-nightly/tests/test_integration_da.cc(78): Entering test case "integration_data_assimilation"
5: Reading the experimental log file...
5: Done. Log entries found for 1 camera(s), with 2 frame(s).
5: Starting the main time stepping loop...
5: 10% completed
5: 20% completed
5: 30% completed
5: 40% completed
5: Rank: 2 | Old parameters for member 1: 
5: Rank: 4 | Old parameters for member 2: 
5: Rank: 5 | Old parameters for member 2: 
5: Rank: 3 | Old parameters for member 1: 
5: Rank: 5 | Number expt sites mapped to DOFs: 1
5: Rank: 3 | Number expt sites mapped to DOFs: 1
5: Rank: 2 | Number expt sites mapped to DOFs: 1
5: Rank: 4 | Number expt sites mapped to DOFs: 1
5: Rank: 1 | Old parameters for member 0: 
5: Performing data assimilation at time 0.0211...
5: Rank: 0 | Old parameters for member 0: 
5: Rank: 1 | Number expt sites mapped to DOFs: 1
5: Rank: 0 | Number expt sites mapped to DOFs: 1
5: Getting the perturbed innovation...
5: Applying the Kalman gain...
5: Updating the ensemble members...
5: Done.
5: 50% completed
5: 60% completed
5: Rank: 5 | Old parameters for member 2: 
5: Rank: 4 | Old parameters for member 2: 
5: Rank: 2 | Old parameters for member 1: 
5: Rank: 3 | Old parameters for member 1: 
5: Rank: 5 | Number expt sites mapped to DOFs: 1
5: Rank: 4 | Number expt sites mapped to DOFs: 1
5: Rank: 3 | Number expt sites mapped to DOFs: 1
5: Rank: 2 | Number expt sites mapped to DOFs: 1
5: Rank: 1 | Old parameters for member 0: 
5: Performing data assimilation at time 0.0316...
5: Rank: 0 | Old parameters for member 0: 
5: Rank: 1 | Number expt sites mapped to DOFs: 1
5: Rank: 0 | Number expt sites mapped to DOFs: 1
5: Getting the perturbed innovation...
5: Applying the Kalman gain...
5: Updating the ensemble members...
5: Done.
5: 70% completed
5: 80% completed
5: 90% completed
5: 100% completed
5: Reading the experimental log file...
5: Done. Log entries found for 1 camera(s), with 2 frame(s).
5: Reading the experimental log file...
5: Done. Log entries found for 1 camera(s), with 2 frame(s).
5: Reading the experimental log file...
5: Done. Log entries found for 1 camera(s), with 2 frame(s).
5: Reading the experimental log file...
5: Done. Log entries found for 1 camera(s), with 2 frame(s).
5: Reading the experimental log file...
5: Done. Log entries found for 1 camera(s), with 2 frame(s).
5: Reading the experimental log file...
5: Done. Log entries found for 1 camera(s), with 2 frame(s).
5: Starting the main time stepping loop...
5: Starting the main time stepping loop...
5: Starting the main time stepping loop...
5: Starting the main time stepping loop...
5: Starting the main time stepping loop...
5: Starting the main time stepping loop...
5: 10% completed
5: 10% completed
5: 10% completed
5: 10% completed
5: 10% completed
5: 10% completed
5: 20% completed
5: 20% completed
5: 20% completed
5: 20% completed
5: 20% completed
5: 20% completed
5: 30% completed
5: 30% completed
5: 30% completed
5: 30% completed
5: 30% completed
5: 30% completed
5: 40% completed
5: 40% completed
5: 40% completed
5: 40% completed
5: 40% completed
5: 40% completed
5: Performing data assimilation at time 0.0211...
5: Rank: 0 | Old parameters for member 0: 
5: Rank: 0 | Old parameters for member 1: 
5: Rank: 0 | Old parameters for member 2: 
5: Performing data assimilation at time 0.0211...
5: Rank: 0 | Old parameters for member 0: 
5: Rank: 0 | Old parameters for member 1: 
5: Rank: 0 | Old parameters for member 2: 
5: Rank: 0 | Number expt sites mapped to DOFs: 1
5: Rank: 0 | Number expt sites mapped to DOFs: 1
5: Performing data assimilation at time 0.0211...
5: Rank: 0 | Old parameters for member 0: 
5: Rank: 0 | Old parameters for member 1: 
5: Rank: 0 | Old parameters for member 2: 
5: Performing data assimilation at time 0.0211...
5: Rank: 0 | Old parameters for member 0: 
5: Rank: 0 | Old parameters for member 1: 
5: Rank: 0 | Old parameters for member 2: 
5: Performing data assimilation at time 0.0211...
5: Rank: 0 | Old parameters for member 0: 
5: Rank: 0 | Old parameters for member 1: 
5: Rank: 0 | Old parameters for member 2: 
5: Performing data assimilation at time 0.0211...
5: Rank: 0 | Old parameters for member 0: 
5: Rank: 0 | Old parameters for member 1: 
5: Rank: 0 | Old parameters for member 2: 
5: Rank: 0 | Number expt sites mapped to DOFs: 1
5: Rank: 0 | Number expt sites mapped to DOFs: 1
5: Rank: 0 | Number expt sites mapped to DOFs: 1
5: Rank: 0 | Number expt sites mapped to DOFs: 1
5: Getting the perturbed innovation...
5: Applying the Kalman gain...
5: Getting the perturbed innovation...
5: Applying the Kalman gain...
5: Getting the perturbed innovation...
5: Applying the Kalman gain...
5: Getting the perturbed innovation...
5: Applying the Kalman gain...
5: Getting the perturbed innovation...
5: Applying the Kalman gain...
5: Getting the perturbed innovation...
5: Applying the Kalman gain...
5: Updating the ensemble members...
5: Done.
5: Updating the ensemble members...
5: Done.
5: Updating the ensemble members...
5: Done.
5: Updating the ensemble members...
5: Done.
5: Updating the ensemble members...
5: Done.
5: Updating the ensemble members...
5: Done.
5: 50% completed
5: 50% completed
5: 50% completed
5: 50% completed
5: 50% completed
5: 50% completed
5: 60% completed
5: 60% completed
5: 60% completed
5: 60% completed
5: 60% completed
5: 60% completed
5: Performing data assimilation at time 0.0316...
5: Rank: 0 | Old parameters for member 0: 
5: Rank: 0 | Old parameters for member 1: 
5: Rank: 0 | Old parameters for member 2: 
5: Performing data assimilation at time 0.0316...
5: Rank: 0 | Old parameters for member 0: 
5: Rank: 0 | Old parameters for member 1: 
5: Rank: 0 | Old parameters for member 2: 
5: Rank: 0 | Number expt sites mapped to DOFs: 1
5: Performing data assimilation at time 0.0316...
5: Rank: 0 | Old parameters for member 0: 
5: Rank: 0 | Old parameters for member 1: 
5: Rank: 0 | Old parameters for member 2: 
5: Rank: 0 | Number expt sites mapped to DOFs: 1
5: Rank: 0 | Number expt sites mapped to DOFs: 1
5: Performing data assimilation at time 0.0316...
5: Rank: 0 | Old parameters for member 0: 
5: Rank: 0 | Old parameters for member 1: 
5: Rank: 0 | Old parameters for member 2: 
5: Performing data assimilation at time 0.0316...
5: Rank: 0 | Old parameters for member 0: 
5: Rank: 0 | Old parameters for member 1: 
5: Rank: 0 | Old parameters for member 2: 
5: Rank: 0 | Number expt sites mapped to DOFs: 1
5: Rank: 0 | Number expt sites mapped to DOFs: 1
5: Performing data assimilation at time 0.0316...
5: Rank: 0 | Old parameters for member 0: 
5: Rank: 0 | Old parameters for member 1: 
5: Rank: 0 | Old parameters for member 2: 
5: Rank: 0 | Number expt sites mapped to DOFs: 1
5: Getting the perturbed innovation...
5: Applying the Kalman gain...
5: Getting the perturbed innovation...
5: Applying the Kalman gain...
5: Getting the perturbed innovation...
5: Applying the Kalman gain...
5: Getting the perturbed innovation...
5: Applying the Kalman gain...
5: Getting the perturbed innovation...
5: Applying the Kalman gain...
5: Getting the perturbed innovation...
5: Applying the Kalman gain...
5: Updating the ensemble members...
5: Done.
5: Updating the ensemble members...
5: Updating the ensemble members...
5: Done.
5: Done.
5: Updating the ensemble members...
5: Updating the ensemble members...
5: Done.
5: Done.
5: Updating the ensemble members...
5: Done.
5: 70% completed
5: 70% completed
5: 70% completed
5: 70% completed
5: 70% completed
5: 70% completed
5: 80% completed
5: 80% completed
5: 80% completed
5: 80% completed
5: 80% completed
5: 80% completed
5: 90% completed
5: 90% completed
5: 90% completed
5: 90% completed
5: 90% completed
5: 90% completed
5: 100% completed
5: 100% completed
5: 100% completed
5: 100% completed
5: 100% completed
5: /var/jenkins/workspace/adamantine-nightly/tests/test_integration_da.cc(78): Leaving test case "integration_data_assimilation"; testing time: 57740836us
5: /var/jenkins/workspace/adamantine-nightly/tests/test_integration_da.cc(148): Entering test case "integration_3D_da_point_cloud_add_material"
5: /var/jenkins/workspace/adamantine-nightly/tests/test_integration_da.cc(78): Leaving test case "integration_data_assimilation"; testing time: 57740352us
5: /var/jenkins/workspace/adamantine-nightly/tests/test_integration_da.cc(148): Entering test case "integration_3D_da_point_cloud_add_material"
5: /var/jenkins/workspace/adamantine-nightly/tests/test_integration_da.cc(78): Leaving test case "integration_data_assimilation"; testing time: 57752274us
5: /var/jenkins/workspace/adamantine-nightly/tests/test_integration_da.cc(148): Entering test case "integration_3D_da_point_cloud_add_material"
5: /var/jenkins/workspace/adamantine-nightly/tests/test_integration_da.cc(78): Leaving test case "integration_data_assimilation"; testing time: 57791748us
5: /var/jenkins/workspace/adamantine-nightly/tests/test_integration_da.cc(148): Entering test case "integration_3D_da_point_cloud_add_material"
5: 100% completed
5: /var/jenkins/workspace/adamantine-nightly/tests/test_integration_da.cc(78): Leaving test case "integration_data_assimilation"; testing time: 57852832us
5: /var/jenkins/workspace/adamantine-nightly/tests/test_integration_da.cc(148): Entering test case "integration_3D_da_point_cloud_add_material"
5: /var/jenkins/workspace/adamantine-nightly/tests/test_integration_da.cc(78): Leaving test case "integration_data_assimilation"; testing time: 57995657us
5: /var/jenkins/workspace/adamantine-nightly/tests/test_integration_da.cc(148): Entering test case "integration_3D_da_point_cloud_add_material"
5: Reading the experimental log file...
5: Done. Log entries found for 1 camera(s), with 1 frame(s).
5: Starting the main time stepping loop...
5: 10% completed
5: 20% completed
5: 30% completed
5: 40% completed
5: 50% completed
5: Rank: 4 | Old parameters for member 2: 
5: Rank: 5 | Old parameters for member 2: 
5: Rank: 5 | Number expt sites mapped to DOFs: 1
5: Rank: 4 | Number expt sites mapped to DOFs: 1
5: Performing data assimilation at time 0.12...
5: Rank: 0 | Old parameters for member 0: 
5: Rank: 1 | Old parameters for member 0: 
5: Rank: 1 | Number expt sites mapped to DOFs: 1
5: Rank: 0 | Number expt sites mapped to DOFs: 1
5: Rank: 3 | Old parameters for member 1: 
5: Rank: 2 | Old parameters for member 1: 
5: Rank: 3 | Number expt sites mapped to DOFs: 1
5: Rank: 2 | Number expt sites mapped to DOFs: 1
5: Getting the perturbed innovation...
5: Applying the Kalman gain...
5: Updating the ensemble members...
5: Done.
5: 60% completed
5: 70% completed
5: 80% completed
5: 90% completed
5: 100% completed
5: Reading the experimental log file...
5: Done. Log entries found for 1 camera(s), with 1 frame(s).
5: Reading the experimental log file...
5: Done. Log entries found for 1 camera(s), with 1 frame(s).
5: Reading the experimental log file...
5: Done. Log entries found for 1 camera(s), with 1 frame(s).
5: Reading the experimental log file...
5: Done. Log entries found for 1 camera(s), with 1 frame(s).
5: Reading the experimental log file...
5: Done. Log entries found for 1 camera(s), with 1 frame(s).
5: Reading the experimental log file...
5: Done. Log entries found for 1 camera(s), with 1 frame(s).
5: Starting the main time stepping loop...
5: Starting the main time stepping loop...
5: Starting the main time stepping loop...
5: Starting the main time stepping loop...
5: Starting the main time stepping loop...
5: Starting the main time stepping loop...
5: 10% completed
5: 10% completed
5: 10% completed
5: 10% completed
5: 10% completed
5: 10% completed
5: 20% completed
5: 20% completed
5: 20% completed
5: 20% completed
5: 20% completed
5: 20% completed
5: 30% completed
5: 30% completed
5: 30% completed
5: 40% completed
5: 30% completed
5: 30% completed
5: 30% completed
5: 40% completed
5: 40% completed
5: 50% completed
5: 50% completed
5: 40% completed
5: 40% completed
5: 40% completed
5: 50% completed
5: Performing data assimilation at time 0.12...
5: Rank: 0 | Old parameters for member 0: 
5: Rank: 0 | Old parameters for member 1: 
5: Rank: 0 | Old parameters for member 2: 
5: Rank: 0 | Number expt sites mapped to DOFs: 1
5: Performing data assimilation at time 0.12...
5: Rank: 0 | Old parameters for member 0: 
5: Rank: 0 | Old parameters for member 1: 
5: Rank: 0 | Old parameters for member 2: 
5: Rank: 0 | Number expt sites mapped to DOFs: 1
5: 50% completed
5: 50% completed
5: 50% completed
5: Performing data assimilation at time 0.12...
5: Rank: 0 | Old parameters for member 0: 
5: Rank: 0 | Old parameters for member 1: 
5: Rank: 0 | Old parameters for member 2: 
5: Rank: 0 | Number expt sites mapped to DOFs: 1
5: Performing data assimilation at time 0.12...
5: Rank: 0 | Old parameters for member 0: 
5: Rank: 0 | Old parameters for member 1: 
5: Rank: 0 | Old parameters for member 2: 
5: Performing data assimilation at time 0.12...
5: Rank: 0 | Old parameters for member 0: 
5: Rank: 0 | Old parameters for member 1: 
5: Rank: 0 | Old parameters for member 2: 
5: Performing data assimilation at time 0.12...
5: Rank: 0 | Old parameters for member 0: 
5: Rank: 0 | Old parameters for member 1: 
5: Rank: 0 | Old parameters for member 2: 
5: Rank: 0 | Number expt sites mapped to DOFs: 1
5: Rank: 0 | Number expt sites mapped to DOFs: 1
5: Rank: 0 | Number expt sites mapped to DOFs: 1
5: Getting the perturbed innovation...
5: Applying the Kalman gain...
5: Getting the perturbed innovation...
5: Applying the Kalman gain...
5: Getting the perturbed innovation...
5: Applying the Kalman gain...
5: Getting the perturbed innovation...
5: Applying the Kalman gain...
5: Getting the perturbed innovation...
5: Applying the Kalman gain...
5: Getting the perturbed innovation...
5: Applying the Kalman gain...
5: Updating the ensemble members...
5: Done.
5: Updating the ensemble members...
5: 60% completed
5: Done.
5: 60% completed
5: Updating the ensemble members...
5: 70% completed
5: 70% completed
5: Done.
5: 60% completed
5: 80% completed
5: 80% completed
5: 70% completed
5: Updating the ensemble members...
5: Updating the ensemble members...
5: Done.
5: 60% completed
5: Done.
5: 60% completed
5: Updating the ensemble members...
5: Done.
5: 60% completed
5: 90% completed
5: 90% completed
5: 80% completed
5: 70% completed
5: 70% completed
5: 70% completed
5: 90% completed
5: 80% completed
5: 80% completed
5: 80% completed
5: 90% completed
5: 90% completed
5: 90% completed
5: 100% completed
5: 100% completed
5: /var/jenkins/workspace/adamantine-nightly/tests/test_integration_da.cc(148): Leaving test case "integration_3D_da_point_cloud_add_material"; testing time: 2570721us
5: /var/jenkins/workspace/adamantine-nightly/tests/test_integration_da.cc(231): Entering test case "integration_3D_da_ray_add_material"
5: 100% completed
5: /var/jenkins/workspace/adamantine-nightly/tests/test_integration_da.cc(148): Leaving test case "integration_3D_da_point_cloud_add_material"; testing time: 2332321us
5: /var/jenkins/workspace/adamantine-nightly/tests/test_integration_da.cc(231): Entering test case "integration_3D_da_ray_add_material"
5: /var/jenkins/workspace/adamantine-nightly/tests/test_integration_da.cc(148): Leaving test case "integration_3D_da_point_cloud_add_material"; testing time: 2589954us
5: /var/jenkins/workspace/adamantine-nightly/tests/test_integration_da.cc(231): Entering test case "integration_3D_da_ray_add_material"
5: 100% completed
5: 100% completed
5: 100% completed
5: /var/jenkins/workspace/adamantine-nightly/tests/test_integration_da.cc(148): Leaving test case "integration_3D_da_point_cloud_add_material"; testing time: 2734344us
5: /var/jenkins/workspace/adamantine-nightly/tests/test_integration_da.cc(231): Entering test case "integration_3D_da_ray_add_material"
5: /var/jenkins/workspace/adamantine-nightly/tests/test_integration_da.cc(148): Leaving test case "integration_3D_da_point_cloud_add_material"; testing time: 2621416us
5: /var/jenkins/workspace/adamantine-nightly/tests/test_integration_da.cc(231): Entering test case "integration_3D_da_ray_add_material"
5: /var/jenkins/workspace/adamantine-nightly/tests/test_integration_da.cc(148): Leaving test case "integration_3D_da_point_cloud_add_material"; testing time: 2717015us
5: /var/jenkins/workspace/adamantine-nightly/tests/test_integration_da.cc(231): Entering test case "integration_3D_da_ray_add_material"
5: Reading the experimental log file...
5: Done. Log entries found for 1 camera(s), with 1 frame(s).
5: Starting the main time stepping loop...
5: 10% completed
5: 20% completed
5: 30% completed
5: 40% completed
5: 50% completed
5: Rank: 3 | Old parameters for member 1: 
5: Rank: 2 | Old parameters for member 1: 
5: Rank: 5 | Old parameters for member 2: 
5: Rank: 4 | Old parameters for member 2: 
5: Performing data assimilation at time 0.12...
5: Rank: 0 | Old parameters for member 0: 
5: Rank: 1 | Old parameters for member 0: 
5: Rank: 2 | Number expt sites mapped to DOFs: 1
5: Rank: 3 | Number expt sites mapped to DOFs: 1
5: Rank: 4 | Number expt sites mapped to DOFs: 1
5: Rank: 5 | Number expt sites mapped to DOFs: 1
5: Rank: 1 | Number expt sites mapped to DOFs: 1
5: Rank: 0 | Number expt sites mapped to DOFs: 1
5: Getting the perturbed innovation...
5: Applying the Kalman gain...
5: Updating the ensemble members...
5: Done.
5: 60% completed
5: 70% completed
5: 80% completed
5: 90% completed
5: 100% completed
5: Reading the experimental log file...
5: Done. Log entries found for 1 camera(s), with 1 frame(s).
5: Reading the experimental log file...
5: Done. Log entries found for 1 camera(s), with 1 frame(s).
5: Reading the experimental log file...
5: Done. Log entries found for 1 camera(s), with 1 frame(s).
5: Reading the experimental log file...
5: Done. Log entries found for 1 camera(s), with 1 frame(s).
5: Reading the experimental log file...
5: Done. Log entries found for 1 camera(s), with 1 frame(s).
5: Reading the experimental log file...
5: Done. Log entries found for 1 camera(s), with 1 frame(s).
5: Starting the main time stepping loop...
5: Starting the main time stepping loop...
5: Starting the main time stepping loop...
5: Starting the main time stepping loop...
5: Starting the main time stepping loop...
5: Starting the main time stepping loop...
5: 10% completed
5: 10% completed
5: 10% completed
5: 10% completed
5: 10% completed
5: 10% completed
5: 20% completed
5: 20% completed
5: 20% completed
5: 20% completed
5: 20% completed
5: 20% completed
5: 30% completed
5: 30% completed
5: 30% completed
5: 30% completed
5: 30% completed
5: 30% completed
5: 40% completed
5: 40% completed
5: 40% completed
5: 40% completed
5: 40% completed
5: 40% completed
5: 50% completed
5: 50% completed
5: 50% completed
5: 50% completed
5: 50% completed
5: 50% completed
5: Performing data assimilation at time 0.12...
5: Rank: 0 | Old parameters for member 0: 
5: Rank: 0 | Old parameters for member 1: 
5: Rank: 0 | Old parameters for member 2: 
5: Rank: 0 | Number expt sites mapped to DOFs: 1
5: Performing data assimilation at time 0.12...
5: Rank: 0 | Old parameters for member 0: 
5: Rank: 0 | Old parameters for member 1: 
5: Rank: 0 | Old parameters for member 2: 
5: Rank: 0 | Number expt sites mapped to DOFs: 1
5: Performing data assimilation at time 0.12...
5: Rank: 0 | Old parameters for member 0: 
5: Rank: 0 | Old parameters for member 1: 
5: Rank: 0 | Old parameters for member 2: 
5: Performing data assimilation at time 0.12...
5: Rank: 0 | Old parameters for member 0: 
5: Rank: 0 | Old parameters for member 1: 
5: Rank: 0 | Old parameters for member 2: 
5: Rank: 0 | Number expt sites mapped to DOFs: 1
5: Rank: 0 | Number expt sites mapped to DOFs: 1
5: Performing data assimilation at time 0.12...
5: Rank: 0 | Old parameters for member 0: 
5: Rank: 0 | Old parameters for member 1: 
5: Rank: 0 | Old parameters for member 2: 
5: Performing data assimilation at time 0.12...
5: Rank: 0 | Old parameters for member 0: 
5: Rank: 0 | Old parameters for member 1: 
5: Rank: 0 | Old parameters for member 2: 
5: Rank: 0 | Number expt sites mapped to DOFs: 1
5: Rank: 0 | Number expt sites mapped to DOFs: 1
5: Getting the perturbed innovation...
5: Applying the Kalman gain...
5: Getting the perturbed innovation...
5: Applying the Kalman gain...
5: Getting the perturbed innovation...
5: Applying the Kalman gain...
5: Getting the perturbed innovation...
5: Applying the Kalman gain...
5: Getting the perturbed innovation...
5: Applying the Kalman gain...
5: Getting the perturbed innovation...
5: Applying the Kalman gain...
5: Updating the ensemble members...
5: Done.
5: 60% completed
5: Updating the ensemble members...
5: Done.
5: 60% completed
5: Updating the ensemble members...
5: Updating the ensemble members...
5: Done.
5: 60% completed
5: Done.
5: 60% completed
5: 70% completed
5: Updating the ensemble members...
5: Updating the ensemble members...
5: Done.
5: Done.
5: 60% completed
5: 60% completed
5: 70% completed
5: 70% completed
5: 70% completed
5: 80% completed
5: 70% completed
5: 70% completed
5: 80% completed
5: 90% completed
5: 80% completed
5: 80% completed
5: 80% completed
5: 80% completed
5: 90% completed
5: 90% completed
5: 90% completed
5: 90% completed
5: 90% completed
5: 100% completed
5: 100% completed
5: /var/jenkins/workspace/adamantine-nightly/tests/test_integration_da.cc(231): Leaving test case "integration_3D_da_ray_add_material"; testing time: 2614767us
5: Leaving test module "Integration_Data_Assimilation"; testing time: 62925960us
5: 
5: *** No errors detected
5: 100% completed
5: 100% completed
5: 100% completed
5: 100% completed
5: /var/jenkins/workspace/adamantine-nightly/tests/test_integration_da.cc(231): Leaving test case "integration_3D_da_ray_add_material"; testing time: 2488993us
5: Leaving test module "Integration_Data_Assimilation"; testing time: 62958433us
5: 
5: *** No errors detected
5: /var/jenkins/workspace/adamantine-nightly/tests/test_integration_da.cc(231): Leaving test case "integration_3D_da_ray_add_material"; testing time: 2510158us
5: Leaving test module "Integration_Data_Assimilation"; testing time: 62985470us
5: 
5: *** No errors detected
5: /var/jenkins/workspace/adamantine-nightly/tests/test_integration_da.cc(231): Leaving test case "integration_3D_da_ray_add_material"; testing time: 2524916us
5: Leaving test module "Integration_Data_Assimilation"; testing time: 62999307us
5: 
5: *** No errors detected
5: 
5: /var/jenkins/workspace/adamantine-nightly/tests/test_integration_da.cc(231): Leaving test case "integration_3D_da_ray_add_material"; testing time: 2661653us
5: Leaving test module "Integration_Data_Assimilation"; testing time: 62989764us
5: *** No errors detected
5: 
5: *** No errors detected
5: /var/jenkins/workspace/adamantine-nightly/tests/test_integration_da.cc(231): Leaving test case "integration_3D_da_ray_add_material"; testing time: 2620102us
5: Leaving test module "Integration_Data_Assimilation"; testing time: 63001948us
5: 
46/48 Test  #5: test_integration_da_6 ....................   Passed   64.90 sec
test 8
      Start  8: test_closest_source_point_adaptation_3

8: Test command: /usr/bin/mpiexec "-n" "3" "/var/jenkins/workspace/adamantine-nightly/build/bin/test_closest_source_point_adaptation"
8: Working Directory: /var/jenkins/workspace/adamantine-nightly/build/tests
8: Test timeout computed to be: 7200
8: Running 1 test case...
8: Entering test module "ClosestSourcePointAdaptation"
8: /var/jenkins/workspace/adamantine-nightly/tests/test_closest_source_point_adaptation.cc(124): Entering test case "closest_source_point_adaptation"
8: Running 1 test case...
8: Entering test module "ClosestSourcePointAdaptation"
8: /var/jenkins/workspace/adamantine-nightly/tests/test_closest_source_point_adaptation.cc(124): Entering test case "closest_source_point_adaptation"
8: Running 1 test case...
8: Entering test module "ClosestSourcePointAdaptation"
8: /var/jenkins/workspace/adamantine-nightly/tests/test_closest_source_point_adaptation.cc(124): Entering test case "closest_source_point_adaptation"
8: /var/jenkins/workspace/adamantine-nightly/tests/test_closest_source_point_adaptation.cc(124): Leaving test case "closest_source_point_adaptation"; testing time: 7108376us
8: Leaving test module "ClosestSourcePointAdaptation"; testing time: 7108456us
8: 
8: *** No errors detected
8: /var/jenkins/workspace/adamantine-nightly/tests/test_closest_source_point_adaptation.cc(124): Leaving test case "closest_source_point_adaptation"; testing time: 7127292us
8: Leaving test module "ClosestSourcePointAdaptation"; testing time: 7127340us
8: 
8: *** No errors detected
8: /var/jenkins/workspace/adamantine-nightly/tests/test_closest_source_point_adaptation.cc(124): Leaving test case "closest_source_point_adaptation"; testing time: 7117428us
8: Leaving test module "ClosestSourcePointAdaptation"; testing time: 7117493us
8: 
8: *** No errors detected
8: 
47/48 Test  #8: test_closest_source_point_adaptation_3 ...   Passed    8.44 sec
test 9
      Start  9: test_closest_source_point_adaptation_6

9: Test command: /usr/bin/mpiexec "-n" "6" "/var/jenkins/workspace/adamantine-nightly/build/bin/test_closest_source_point_adaptation"
9: Working Directory: /var/jenkins/workspace/adamantine-nightly/build/tests
9: Test timeout computed to be: 7200
9: Running 1 test case...
9: Entering test module "ClosestSourcePointAdaptation"
9: /var/jenkins/workspace/adamantine-nightly/tests/test_closest_source_point_adaptation.cc(124): Entering test case "closest_source_point_adaptation"
9: Running 1 test case...
9: Entering test module "ClosestSourcePointAdaptation"
9: /var/jenkins/workspace/adamantine-nightly/tests/test_closest_source_point_adaptation.cc(124): Entering test case "closest_source_point_adaptation"
9: Running 1 test case...
9: Entering test module "ClosestSourcePointAdaptation"
9: /var/jenkins/workspace/adamantine-nightly/tests/test_closest_source_point_adaptation.cc(124): Entering test case "closest_source_point_adaptation"
9: Running 1 test case...
9: Entering test module "ClosestSourcePointAdaptation"
9: /var/jenkins/workspace/adamantine-nightly/tests/test_closest_source_point_adaptation.cc(124): Entering test case "closest_source_point_adaptation"
9: Running 1 test case...
9: Entering test module "ClosestSourcePointAdaptation"
9: /var/jenkins/workspace/adamantine-nightly/tests/test_closest_source_point_adaptation.cc(124): Entering test case "closest_source_point_adaptation"
9: Running 1 test case...
9: Entering test module "ClosestSourcePointAdaptation"
9: /var/jenkins/workspace/adamantine-nightly/tests/test_closest_source_point_adaptation.cc(124): Entering test case "closest_source_point_adaptation"
9: /var/jenkins/workspace/adamantine-nightly/tests/test_closest_source_point_adaptation.cc(124): Leaving test case "closest_source_point_adaptation"; testing time: 4435630us
9: Leaving test module "ClosestSourcePointAdaptation"; testing time: 4435672us
9: 
9: *** No errors detected
9: /var/jenkins/workspace/adamantine-nightly/tests/test_closest_source_point_adaptation.cc(124): Leaving test case "closest_source_point_adaptation"; testing time: 4435335us
9: Leaving test module "ClosestSourcePointAdaptation"; testing time: 4435388us
9: 
9: *** No errors detected
9: /var/jenkins/workspace/adamantine-nightly/tests/test_closest_source_point_adaptation.cc(124): Leaving test case "closest_source_point_adaptation"; testing time: 4471395us
9: Leaving test module "ClosestSourcePointAdaptation"; testing time: 4471436us
9: 
9: *** No errors detected
9: /var/jenkins/workspace/adamantine-nightly/tests/test_closest_source_point_adaptation.cc(124): Leaving test case "closest_source_point_adaptation"; testing time: 4463417us
9: Leaving test module "ClosestSourcePointAdaptation"; testing time: 4463502us
9: 
9: *** No errors detected
9: /var/jenkins/workspace/adamantine-nightly/tests/test_closest_source_point_adaptation.cc(124): Leaving test case "closest_source_point_adaptation"; testing time: 4435177us
9: Leaving test module "ClosestSourcePointAdaptation"; testing time: 4435225us
9: 
9: *** No errors detected
9: /var/jenkins/workspace/adamantine-nightly/tests/test_closest_source_point_adaptation.cc(124): Leaving test case "closest_source_point_adaptation"; testing time: 4442495us
9: Leaving test module "ClosestSourcePointAdaptation"; testing time: 4442562us
9: 
9: *** No errors detected
9: 
48/48 Test  #9: test_closest_source_point_adaptation_6 ...   Passed    6.39 sec

The following tests passed:
	test_closest_source_point_adaptation_1
	test_data_assimilator_1
	test_experimental_data_1
	test_geometry_1
	test_heat_source_1
	test_integration_da_2
	test_closest_source_point_adaptation_2
	test_material_property_1
	test_material_property_device_1
	test_integration_da_1
	test_post_processor_1
	test_quaternion_1
	test_scan_path_1
	test_mechanical_operator_1
	test_thermal_operator_1
	test_thermal_operator_device_1
	test_timer_1
	test_utils_1
	test_validate_input_database_1
	test_integration_2d_1
	test_integration_2d_device_1
	test_mechanical_physics_1
	test_thermal_physics_device_1
	test_integration_3d_amr_device_1
	test_integration_3d_amr_1
	test_integration_da_augmented_1
	test_material_deposition_1
	test_microstructure_1
	test_thermal_physics_1
	test_ensemble_management_1
	test_integration_3d_device_1
	test_integration_2d_2
	test_integration_2d_device_2
	test_integration_3d_amr_2
	test_integration_3d_amr_device_2
	test_integration_da_augmented_2
	test_material_deposition_2
	test_microstructure_2
	test_thermal_physics_2
	test_ensemble_management_2
	test_integration_thermoelastic_2
	test_integration_da_3
	test_integration_da_6
	test_closest_source_point_adaptation_3
	test_closest_source_point_adaptation_6

94% tests passed, 3 tests failed out of 48

Total Test time (real) = 12813.84 sec

The following tests FAILED:
	 32 - test_integration_3d_1 (Timeout)
	 33 - test_integration_3d_2 (Timeout)
	 40 - test_integration_thermoelastic_1 (Timeout)
Errors while running CTest
Output from these tests are in: /var/jenkins/workspace/adamantine-nightly/build/Testing/Temporary/LastTest.log
Use "--rerun-failed --output-on-failure" to re-run the failed cases verbosely.
[Pipeline] }
[Pipeline] // dir
Post stage
[Pipeline] xunit
INFO: Processing CTest-Version 3.x (default)
[Pipeline] }
[Pipeline] // withEnv
[Pipeline] }
$ docker stop --time=1 80a789d8c79a2da3eab1723fa506c812b8faf427a6e8bdfc03a09cb78f92f813
INFO: [CTest-Version 3.x (default)] - 1 test report file(s) were found with the pattern 'build/Testing/**/Test.xml' relative to '/var/jenkins/workspace/adamantine-nightly' for the testing framework 'CTest-Version 3.x (default)'.
$ docker rm -f --volumes 80a789d8c79a2da3eab1723fa506c812b8faf427a6e8bdfc03a09cb78f92f813
[Pipeline] // withDockerContainer
[Pipeline] }
[Pipeline] // withEnv
[Pipeline] }
[Pipeline] // node
[Pipeline] }
[Pipeline] // stage
[Pipeline] }
Failed in branch CUDA
[Pipeline] // parallel
[Pipeline] }
[Pipeline] // stage
[Pipeline] }
[Pipeline] // timeout
[Pipeline] }
[Pipeline] // withEnv
[Pipeline] End of Pipeline
ERROR: script returned exit code 8
Finished: FAILURE