Skip to content
Skipping 230 KB.. Full Log
38: Updating the ensemble members...
38: Rank: 1 | New parameters for member 2: 0.107206 
38: Done.
38: Rank: 0 | New parameters for member 0: 0.121104 
38: Rank: 0 | New parameters for member 1: 0.142225 
38: 80% completed
38: 90% completed
38: 100% completed
38: /var/jenkins/workspace/adamantine-nightly/tests/test_integration_da_augmented.cc(19): Leaving test case "integration_3D_data_assimilation_augmented"; testing time: 38737378us
38: Leaving test module "Integration_Data_Assimilation_Augmented"; testing time: 38737703us
38: 
38: *** No errors detected
38: /var/jenkins/workspace/adamantine-nightly/tests/test_integration_da_augmented.cc(19): Leaving test case "integration_3D_data_assimilation_augmented"; testing time: 38737432us
38: Leaving test module "Integration_Data_Assimilation_Augmented"; testing time: 38737812us
38: 
38: *** No errors detected
38: 
38/48 Test #38: test_integration_da_augmented_2 ..........   Passed   39.52 sec
test 40
      Start 40: test_integration_thermoelastic_2

40: Test command: /usr/bin/mpiexec "-n" "2" "/var/jenkins/workspace/adamantine-nightly/build/bin/test_integration_thermoelastic"
40: Working Directory: /var/jenkins/workspace/adamantine-nightly/build/tests
40: Test timeout computed to be: 7200
40: Running 2 test cases...
40: Entering test module "Integration_Thermoelastic"
40: /var/jenkins/workspace/adamantine-nightly/tests/test_integration_thermoelastic.cc(19): Entering test case "integration_thermoelastic"
40: Running 2 test cases...
40: Entering test module "Integration_Thermoelastic"
40: /var/jenkins/workspace/adamantine-nightly/tests/test_integration_thermoelastic.cc(19): Entering test case "integration_thermoelastic"
32: n_time_step: 507 time: 5.06 n_dofs (thermal) after cell activation: 1216
32: 40% completed
32: n_time_step: 531 time: 5.3 n_dofs (thermal) after cell activation: 1217
32: n_time_step: 554 time: 5.53 n_dofs (thermal) after cell activation: 1218
32: n_time_step: 577 time: 5.76 n_dofs (thermal) after cell activation: 1219
34/48 Test #31: test_integration_3d_1 ....................***Timeout 7200.11 sec
32: n_time_step: 601 time: 6 n_dofs (thermal) after cell activation: 1220
32: 60% completed
32: n_time_step: 624 time: 6.23 n_dofs (thermal) after cell activation: 1221
32: n_time_step: 647 time: 6.46 n_dofs (thermal) after cell activation: 1222
32: n_time_step: 671 time: 6.7 n_dofs (thermal) after cell activation: 1223
40: 10% completed
32: n_time_step: 694 time: 6.93 n_dofs (thermal) after cell activation: 1224
32: 70% completed
32: n_time_step: 717 time: 7.16 n_dofs (thermal) after cell activation: 1226
32: n_time_step: 740 time: 7.39 n_dofs (thermal) after cell activation: 1227
32: 50% completed
32: n_time_step: 763 time: 7.62 n_dofs (thermal) after cell activation: 1228
39: 50% completed
32: n_time_step: 787 time: 7.86 n_dofs (thermal) after cell activation: 1229
39/48 Test #32: test_integration_3d_2 ....................***Timeout 7200.01 sec
test 42
      Start 42: test_material_deposition_2

42: Test command: /usr/bin/mpiexec "-n" "2" "/var/jenkins/workspace/adamantine-nightly/build/bin/test_material_deposition"
42: Working Directory: /var/jenkins/workspace/adamantine-nightly/build/tests
42: Test timeout computed to be: 7200
42: Running 11 test cases...
42: Entering test module "MaterialDeposition"
42: /var/jenkins/workspace/adamantine-nightly/tests/test_material_deposition.cc(50): Entering test case "read_material_deposition_file_2d"
42: Running 11 test cases...
42: Entering test module "MaterialDeposition"
42: /var/jenkins/workspace/adamantine-nightly/tests/test_material_deposition.cc(50): Entering test case "read_material_deposition_file_2d"
42: /var/jenkins/workspace/adamantine-nightly/tests/test_material_deposition.cc(50): Leaving test case "read_material_deposition_file_2d"; testing time: 307us
42: /var/jenkins/workspace/adamantine-nightly/tests/test_material_deposition.cc(92): Entering test case "read_material_deposition_file_3d"
42: /var/jenkins/workspace/adamantine-nightly/tests/test_material_deposition.cc(50): Leaving test case "read_material_deposition_file_2d"; testing time: 405us
42: /var/jenkins/workspace/adamantine-nightly/tests/test_material_deposition.cc(92): Entering test case "read_material_deposition_file_3d"
42: /var/jenkins/workspace/adamantine-nightly/tests/test_material_deposition.cc(92): Leaving test case "read_material_deposition_file_3d"; testing time: 194us
42: /var/jenkins/workspace/adamantine-nightly/tests/test_material_deposition.cc(134): Test case "get_elements_to_activate_2d" is skipped because precondition failed: the test only works in serial
42: /var/jenkins/workspace/adamantine-nightly/tests/test_material_deposition.cc(195): Test case "get_elements_to_activate_3d" is skipped because precondition failed: the test only works in serial
42: /var/jenkins/workspace/adamantine-nightly/tests/test_material_deposition.cc(262): Entering test case "material_deposition"
42: /var/jenkins/workspace/adamantine-nightly/tests/test_material_deposition.cc(92): Leaving test case "read_material_deposition_file_3d"; testing time: 186us
42: /var/jenkins/workspace/adamantine-nightly/tests/test_material_deposition.cc(134): Test case "get_elements_to_activate_2d" is skipped because precondition failed: the test only works in serial
42: /var/jenkins/workspace/adamantine-nightly/tests/test_material_deposition.cc(195): Test case "get_elements_to_activate_3d" is skipped because precondition failed: the test only works in serial
42: /var/jenkins/workspace/adamantine-nightly/tests/test_material_deposition.cc(262): Entering test case "material_deposition"
42: /var/jenkins/workspace/adamantine-nightly/tests/test_material_deposition.cc(262): Leaving test case "material_deposition"; testing time: 11022871us
42: /var/jenkins/workspace/adamantine-nightly/tests/test_material_deposition.cc(395): Entering test case "deposition_from_scan_path_2d"
42: /var/jenkins/workspace/adamantine-nightly/tests/test_material_deposition.cc(395): Leaving test case "deposition_from_scan_path_2d"; testing time: 246us
42: /var/jenkins/workspace/adamantine-nightly/tests/test_material_deposition.cc(262): Leaving test case "material_deposition"; testing time: 11023523us
42: /var/jenkins/workspace/adamantine-nightly/tests/test_material_deposition.cc(395): Entering test case "deposition_from_scan_path_2d"
42: /var/jenkins/workspace/adamantine-nightly/tests/test_material_deposition.cc(395): Leaving test case "deposition_from_scan_path_2d"; testing time: 299us
42: /var/jenkins/workspace/adamantine-nightly/tests/test_material_deposition.cc(445): Entering test case "deposition_from_scan_path_3d"
42: /var/jenkins/workspace/adamantine-nightly/tests/test_material_deposition.cc(445): Leaving test case "deposition_from_scan_path_3d"; testing time: 198us
42: /var/jenkins/workspace/adamantine-nightly/tests/test_material_deposition.cc(499): Entering test case "deposition_from_L_scan_path_3d"
42: /var/jenkins/workspace/adamantine-nightly/tests/test_material_deposition.cc(499): Leaving test case "deposition_from_L_scan_path_3d"; testing time: 200us
42: /var/jenkins/workspace/adamantine-nightly/tests/test_material_deposition.cc(586): Entering test case "deposition_from_diagonal_scan_path_3d"
42: /var/jenkins/workspace/adamantine-nightly/tests/test_material_deposition.cc(586): Leaving test case "deposition_from_diagonal_scan_path_3d"; testing time: 170us
42: /var/jenkins/workspace/adamantine-nightly/tests/test_material_deposition.cc(640): Entering test case "merge_multiple_deposition_paths"
42: /var/jenkins/workspace/adamantine-nightly/tests/test_material_deposition.cc(640): Leaving test case "merge_multiple_deposition_paths"; testing time: 113us
42: /var/jenkins/workspace/adamantine-nightly/tests/test_material_deposition.cc(697): Entering test case "deposition_quaternion_straight_line"
42: /var/jenkins/workspace/adamantine-nightly/tests/test_material_deposition.cc(697): Leaving test case "deposition_quaternion_straight_line"; testing time: 512us
42: Leaving test module "MaterialDeposition"; testing time: 11027324us
42: 
42: *** No errors detected
42: /var/jenkins/workspace/adamantine-nightly/tests/test_material_deposition.cc(445): Entering test case "deposition_from_scan_path_3d"
42: /var/jenkins/workspace/adamantine-nightly/tests/test_material_deposition.cc(445): Leaving test case "deposition_from_scan_path_3d"; testing time: 198us
42: /var/jenkins/workspace/adamantine-nightly/tests/test_material_deposition.cc(499): Entering test case "deposition_from_L_scan_path_3d"
42: /var/jenkins/workspace/adamantine-nightly/tests/test_material_deposition.cc(499): Leaving test case "deposition_from_L_scan_path_3d"; testing time: 195us
42: /var/jenkins/workspace/adamantine-nightly/tests/test_material_deposition.cc(586): Entering test case "deposition_from_diagonal_scan_path_3d"
42: /var/jenkins/workspace/adamantine-nightly/tests/test_material_deposition.cc(586): Leaving test case "deposition_from_diagonal_scan_path_3d"; testing time: 194us
42: /var/jenkins/workspace/adamantine-nightly/tests/test_material_deposition.cc(640): Entering test case "merge_multiple_deposition_paths"
42: /var/jenkins/workspace/adamantine-nightly/tests/test_material_deposition.cc(640): Leaving test case "merge_multiple_deposition_paths"; testing time: 104us
42: /var/jenkins/workspace/adamantine-nightly/tests/test_material_deposition.cc(697): Entering test case "deposition_quaternion_straight_line"
42: /var/jenkins/workspace/adamantine-nightly/tests/test_material_deposition.cc(697): Leaving test case "deposition_quaternion_straight_line"; testing time: 527us
42: Leaving test module "MaterialDeposition"; testing time: 11038765us
42: 
42: *** No errors detected
42: 
40/48 Test #42: test_material_deposition_2 ...............   Passed   11.80 sec
test 44
      Start 44: test_microstructure_2

44: Test command: /usr/bin/mpiexec "-n" "2" "/var/jenkins/workspace/adamantine-nightly/build/bin/test_microstructure"
44: Working Directory: /var/jenkins/workspace/adamantine-nightly/build/tests
44: Test timeout computed to be: 7200
44: Running 1 test case...
44: Entering test module "MicroStructure"
44: /var/jenkins/workspace/adamantine-nightly/tests/test_microstructure.cc(53): Entering test case "G_and_R"
44: Running 1 test case...
44: Entering test module "MicroStructure"
44: /var/jenkins/workspace/adamantine-nightly/tests/test_microstructure.cc(53): Entering test case "G_and_R"
44: Test case G_and_R did not check any assertions
44: /var/jenkins/workspace/adamantine-nightly/tests/test_microstructure.cc(53): Leaving test case "G_and_R"; testing time: 204592us
44: Leaving test module "MicroStructure"; testing time: 204672us
44: 
44: *** No errors detected
44: 
44: *** No errors detected
44: /var/jenkins/workspace/adamantine-nightly/tests/test_microstructure.cc(53): Leaving test case "G_and_R"; testing time: 214464us
44: Leaving test module "MicroStructure"; testing time: 214520us
44: 
41/48 Test #44: test_microstructure_2 ....................   Passed    0.95 sec
test 46
      Start 46: test_thermal_physics_2

46: Test command: /usr/bin/mpiexec "-n" "2" "/var/jenkins/workspace/adamantine-nightly/build/bin/test_thermal_physics"
46: Working Directory: /var/jenkins/workspace/adamantine-nightly/build/tests
46: Test timeout computed to be: 7200
46: Running 7 test cases...
46: Entering test module "ThermalPhysics"
46: /var/jenkins/workspace/adamantine-nightly/tests/test_thermal_physics.cc(15): Entering test case "thermal_2d_explicit_host"
46: Running 7 test cases...
46: Entering test module "ThermalPhysics"
46: /var/jenkins/workspace/adamantine-nightly/tests/test_thermal_physics.cc(15): Entering test case "thermal_2d_explicit_host"
46: /var/jenkins/workspace/adamantine-nightly/tests/test_thermal_physics.cc(15): Leaving test case "thermal_2d_explicit_host"; testing time: 166865us
46: /var/jenkins/workspace/adamantine-nightly/tests/test_thermal_physics.cc(28): Entering test case "thermal_2d_manufactured_solution_host"
46: /var/jenkins/workspace/adamantine-nightly/tests/test_thermal_physics.cc(15): Leaving test case "thermal_2d_explicit_host"; testing time: 167015us
46: /var/jenkins/workspace/adamantine-nightly/tests/test_thermal_physics.cc(28): Entering test case "thermal_2d_manufactured_solution_host"
46: /var/jenkins/workspace/adamantine-nightly/tests/test_thermal_physics.cc(28): Leaving test case "thermal_2d_manufactured_solution_host"; testing time: 147743us
46: /var/jenkins/workspace/adamantine-nightly/tests/test_thermal_physics.cc(33): Entering test case "initial_temperature_host"
46: /var/jenkins/workspace/adamantine-nightly/tests/test_thermal_physics.cc(28): Leaving test case "thermal_2d_manufactured_solution_host"; testing time: 147445us
46: /var/jenkins/workspace/adamantine-nightly/tests/test_thermal_physics.cc(33): Entering test case "initial_temperature_host"
46: /var/jenkins/workspace/adamantine-nightly/tests/test_thermal_physics.cc(33): Leaving test case "initial_temperature_host"; testing time: 161353us
46: /var/jenkins/workspace/adamantine-nightly/tests/test_thermal_physics.cc(38): Entering test case "energy_conservation_host"
46: /var/jenkins/workspace/adamantine-nightly/tests/test_thermal_physics.cc(33): Leaving test case "initial_temperature_host"; testing time: 161321us
46: /var/jenkins/workspace/adamantine-nightly/tests/test_thermal_physics.cc(38): Entering test case "energy_conservation_host"
46: /var/jenkins/workspace/adamantine-nightly/tests/test_thermal_physics.cc(38): Leaving test case "energy_conservation_host"; testing time: 6861309us
46: /var/jenkins/workspace/adamantine-nightly/tests/test_thermal_physics.cc(43): Entering test case "radiation_bcs_host"
46: /var/jenkins/workspace/adamantine-nightly/tests/test_thermal_physics.cc(38): Leaving test case "energy_conservation_host"; testing time: 6861414us
46: /var/jenkins/workspace/adamantine-nightly/tests/test_thermal_physics.cc(43): Entering test case "radiation_bcs_host"
46: /var/jenkins/workspace/adamantine-nightly/tests/test_thermal_physics.cc(43): Leaving test case "radiation_bcs_host"; testing time: 2185680us
46: /var/jenkins/workspace/adamantine-nightly/tests/test_thermal_physics.cc(48): Entering test case "convection_bcs_host"
46: /var/jenkins/workspace/adamantine-nightly/tests/test_thermal_physics.cc(43): Leaving test case "radiation_bcs_host"; testing time: 2185617us
46: /var/jenkins/workspace/adamantine-nightly/tests/test_thermal_physics.cc(48): Entering test case "convection_bcs_host"
46: /var/jenkins/workspace/adamantine-nightly/tests/test_thermal_physics.cc(48): Leaving test case "convection_bcs_host"; testing time: 44418032us
46: /var/jenkins/workspace/adamantine-nightly/tests/test_thermal_physics.cc(48): Leaving test case "convection_bcs_host"; testing time: 44418167us
46: /var/jenkins/workspace/adamantine-nightly/tests/test_thermal_physics.cc(53): Entering test case "reference_temperature_host"
46: /var/jenkins/workspace/adamantine-nightly/tests/test_thermal_physics.cc(53): Entering test case "reference_temperature_host"
46: 
46: *** No errors detected
46: /var/jenkins/workspace/adamantine-nightly/tests/test_thermal_physics.cc(53): Leaving test case "reference_temperature_host"; testing time: 120537us
46: Leaving test module "ThermalPhysics"; testing time: 54075245us
46: 
46: *** No errors detected
46: /var/jenkins/workspace/adamantine-nightly/tests/test_thermal_physics.cc(53): Leaving test case "reference_temperature_host"; testing time: 152928us
46: Leaving test module "ThermalPhysics"; testing time: 54107384us
46: 
42/48 Test #46: test_thermal_physics_2 ...................   Passed   54.90 sec
test 48
      Start 48: test_ensemble_management_2

48: Test command: /usr/bin/mpiexec "-n" "2" "/var/jenkins/workspace/adamantine-nightly/build/bin/test_ensemble_management"
48: Working Directory: /var/jenkins/workspace/adamantine-nightly/build/tests
48: Test timeout computed to be: 7200
48: Running 1 test case...
48: Entering test module "EnsembleManagement"
48: /var/jenkins/workspace/adamantine-nightly/tests/test_ensemble_management.cc(17): Entering test case "database_ensemble"
48: Running 1 test case...
48: Entering test module "EnsembleManagement"
48: /var/jenkins/workspace/adamantine-nightly/tests/test_ensemble_management.cc(17): Entering test case "database_ensemble"
48: /var/jenkins/workspace/adamantine-nightly/tests/test_ensemble_management.cc(17): Leaving test case "database_ensemble"; testing time: 613us
48: Leaving test module "EnsembleManagement"; testing time: 655us
48: 
48: *** No errors detected
48: /var/jenkins/workspace/adamantine-nightly/tests/test_ensemble_management.cc(17): Leaving test case "database_ensemble"; testing time: 2269us
48: Leaving test module "EnsembleManagement"; testing time: 2299us
48: 
48: *** No errors detected
48: 
43/48 Test #48: test_ensemble_management_2 ...............   Passed    0.74 sec
40: 20% completed
35/48 Test #39: test_integration_thermoelastic_1 .........***Timeout 7200.10 sec
test 34
      Start 34: test_integration_3d_amr_2

34: Test command: /usr/bin/mpiexec "-n" "2" "/var/jenkins/workspace/adamantine-nightly/build/bin/test_integration_3d_amr"
34: Working Directory: /var/jenkins/workspace/adamantine-nightly/build/tests
34: Test timeout computed to be: 7200
34: Running 2 test cases...
34: Entering test module "Integration_3D_AMR"
34: /var/jenkins/workspace/adamantine-nightly/tests/test_integration_3d_amr.cc(19): Entering test case "integration_3D_amr"
34: Running 2 test cases...
34: Entering test module "Integration_3D_AMR"
34: /var/jenkins/workspace/adamantine-nightly/tests/test_integration_3d_amr.cc(19): Entering test case "integration_3D_amr"
34: 10% completed
34: 20% completed
34: 30% completed
34: 40% completed
34: 50% completed
34: 60% completed
34: 70% completed
34: 80% completed
34: 90% completed
34: 100% completed
34: /var/jenkins/workspace/adamantine-nightly/tests/test_integration_3d_amr.cc(19): Leaving test case "integration_3D_amr"; testing time: 14482031us
34: /var/jenkins/workspace/adamantine-nightly/tests/test_integration_3d_amr.cc(60): Entering test case "integration_3D_amr_refine_coarsen"
34: /var/jenkins/workspace/adamantine-nightly/tests/test_integration_3d_amr.cc(19): Leaving test case "integration_3D_amr"; testing time: 14548615us
34: /var/jenkins/workspace/adamantine-nightly/tests/test_integration_3d_amr.cc(60): Entering test case "integration_3D_amr_refine_coarsen"
34: 10% completed
34: 20% completed
34: 30% completed
34: 40% completed
40: 30% completed
34: 50% completed
34: 60% completed
34: 70% completed
34: 80% completed
34: 90% completed
34: 100% completed
34: /var/jenkins/workspace/adamantine-nightly/tests/test_integration_3d_amr.cc(60): Leaving test case "integration_3D_amr_refine_coarsen"; testing time: 141656613us
34: Leaving test module "Integration_3D_AMR"; testing time: 156206578us
34: 
34: *** No errors detected
34: /var/jenkins/workspace/adamantine-nightly/tests/test_integration_3d_amr.cc(60): Leaving test case "integration_3D_amr_refine_coarsen"; testing time: 141668588us
34: Leaving test module "Integration_3D_AMR"; testing time: 156152287us
34: 
34: *** No errors detected
34: 
36/48 Test #34: test_integration_3d_amr_2 ................   Passed  164.06 sec
test 36
      Start 36: test_integration_3d_amr_device_2

36: Test command: /usr/bin/mpiexec "-n" "2" "/var/jenkins/workspace/adamantine-nightly/build/bin/test_integration_3d_amr_device"
36: Working Directory: /var/jenkins/workspace/adamantine-nightly/build/tests
36: Test timeout computed to be: 7200
36: Running 1 test case...
36: Entering test module "Integration_3D_AMR"
36: /var/jenkins/workspace/adamantine-nightly/tests/test_integration_3d_amr_device.cc(19): Entering test case "integration_3D_amr_device"
36: Running 1 test case...
36: Entering test module "Integration_3D_AMR"
36: /var/jenkins/workspace/adamantine-nightly/tests/test_integration_3d_amr_device.cc(19): Entering test case "integration_3D_amr_device"
36: 10% completed
36: 20% completed
36: 30% completed
36: 40% completed
36: 50% completed
40: 40% completed
36: 60% completed
32: 60% completed
36: 70% completed
36: 80% completed
36: 90% completed
36: 100% completed
36: 
36: *** No errors detected
36: /var/jenkins/workspace/adamantine-nightly/tests/test_integration_3d_amr_device.cc(19): Leaving test case "integration_3D_amr_device"; testing time: 124240433us
36: Leaving test module "Integration_3D_AMR"; testing time: 124241206us
36: /var/jenkins/workspace/adamantine-nightly/tests/test_integration_3d_amr_device.cc(19): Leaving test case "integration_3D_amr_device"; testing time: 124209310us
36: Leaving test module "Integration_3D_AMR"; testing time: 124210162us
36: 
36: *** No errors detected
36: 
37/48 Test #36: test_integration_3d_amr_device_2 .........   Passed  130.46 sec
test 38
      Start 38: test_integration_da_augmented_2

38: Test command: /usr/bin/mpiexec "-n" "2" "/var/jenkins/workspace/adamantine-nightly/build/bin/test_integration_da_augmented"
38: Working Directory: /var/jenkins/workspace/adamantine-nightly/build/tests
38: Test timeout computed to be: 7200
38: Running 1 test case...
38: Entering test module "Integration_Data_Assimilation_Augmented"
38: /var/jenkins/workspace/adamantine-nightly/tests/test_integration_da_augmented.cc(19): Entering test case "integration_3D_data_assimilation_augmented"
38: Running 1 test case...
38: Entering test module "Integration_Data_Assimilation_Augmented"
38: /var/jenkins/workspace/adamantine-nightly/tests/test_integration_da_augmented.cc(19): Entering test case "integration_3D_data_assimilation_augmented"
38: Reading the experimental log file...
38: Done. Log entries found for 1 camera(s), with 2 frame(s).
38: Starting the main time stepping loop...
38: 10% completed
38: 20% completed
38: 30% completed
38: Rank: 1 | Old parameters for member 2: 0.446065 
38: Rank: 1 | Number expt sites mapped to DOFs: 2
38: 40% completed
38: 50% completed
38: 60% completed
38: 70% completed
38: Performing data assimilation at time 0.04...
38: Rank: 0 | Old parameters for member 0: 0.413453 
38: Rank: 0 | Old parameters for member 1: 0.385362 
38: Rank: 0 | Number expt sites mapped to DOFs: 2
38: Getting the perturbed innovation...
38: Applying the Kalman gain...
38: Updating the ensemble members...
38: Rank: 1 | New parameters for member 2: 0.107206 
38: Done.
38: Rank: 0 | New parameters for member 0: 0.121104 
38: Rank: 0 | New parameters for member 1: 0.142225 
38: 80% completed
40: 50% completed
38: 90% completed
38: 100% completed
38: /var/jenkins/workspace/adamantine-nightly/tests/test_integration_da_augmented.cc(19): Leaving test case "integration_3D_data_assimilation_augmented"; testing time: 73163140us
38: Leaving test module "Integration_Data_Assimilation_Augmented"; testing time: 73163522us
38: /var/jenkins/workspace/adamantine-nightly/tests/test_integration_da_augmented.cc(19): Leaving test case "integration_3D_data_assimilation_augmented"; testing time: 73131229us
38: Leaving test module "Integration_Data_Assimilation_Augmented"; testing time: 73131647us
38: 
38: *** No errors detected
38: 
38: *** No errors detected
38: 
38/48 Test #38: test_integration_da_augmented_2 ..........   Passed   81.32 sec
test 40
      Start 40: test_integration_thermoelastic_2

40: Test command: /usr/bin/mpiexec "-n" "2" "/var/jenkins/workspace/adamantine-nightly/build/bin/test_integration_thermoelastic"
40: Working Directory: /var/jenkins/workspace/adamantine-nightly/build/tests
40: Test timeout computed to be: 7200
40: Running 2 test cases...
40: Entering test module "Integration_Thermoelastic"
40: /var/jenkins/workspace/adamantine-nightly/tests/test_integration_thermoelastic.cc(19): Entering test case "integration_thermoelastic"
40: Running 2 test cases...
40: Entering test module "Integration_Thermoelastic"
40: /var/jenkins/workspace/adamantine-nightly/tests/test_integration_thermoelastic.cc(19): Entering test case "integration_thermoelastic"
40: 60% completed
40: 70% completed
32: 70% completed
40: 80% completed
40: 90% completed
40: 100% completed
40: /var/jenkins/workspace/adamantine-nightly/tests/test_integration_thermoelastic.cc(19): Leaving test case "integration_thermoelastic"; testing time: 1848347777us
40: /var/jenkins/workspace/adamantine-nightly/tests/test_integration_thermoelastic.cc(47): Entering test case "integration_thermoelastic_add_material"
40: /var/jenkins/workspace/adamantine-nightly/tests/test_integration_thermoelastic.cc(19): Leaving test case "integration_thermoelastic"; testing time: 1848348130us
40: /var/jenkins/workspace/adamantine-nightly/tests/test_integration_thermoelastic.cc(47): Entering test case "integration_thermoelastic_add_material"
40: 10% completed
40: 10% completed
32: 80% completed
40: 20% completed
40: 30% completed
39/48 Test #32: test_integration_3d_2 ....................***Timeout 7200.11 sec
test 42
      Start 42: test_material_deposition_2

42: Test command: /usr/bin/mpiexec "-n" "2" "/var/jenkins/workspace/adamantine-nightly/build/bin/test_material_deposition"
42: Working Directory: /var/jenkins/workspace/adamantine-nightly/build/tests
42: Test timeout computed to be: 7200
42: Running 11 test cases...
42: Entering test module "MaterialDeposition"
42: /var/jenkins/workspace/adamantine-nightly/tests/test_material_deposition.cc(50): Entering test case "read_material_deposition_file_2d"
42: /var/jenkins/workspace/adamantine-nightly/tests/test_material_deposition.cc(50): Leaving test case "read_material_deposition_file_2d"; testing time: 19974us
42: /var/jenkins/workspace/adamantine-nightly/tests/test_material_deposition.cc(92): Entering test case "read_material_deposition_file_3d"
42: /var/jenkins/workspace/adamantine-nightly/tests/test_material_deposition.cc(92): Leaving test case "read_material_deposition_file_3d"; testing time: 11694us
42: /var/jenkins/workspace/adamantine-nightly/tests/test_material_deposition.cc(134): Test case "get_elements_to_activate_2d" is skipped because precondition failed: the test only works in serial
42: /var/jenkins/workspace/adamantine-nightly/tests/test_material_deposition.cc(195): Test case "get_elements_to_activate_3d" is skipped because precondition failed: the test only works in serial
42: /var/jenkins/workspace/adamantine-nightly/tests/test_material_deposition.cc(262): Entering test case "material_deposition"
42: Running 11 test cases...
42: Entering test module "MaterialDeposition"
42: /var/jenkins/workspace/adamantine-nightly/tests/test_material_deposition.cc(50): Entering test case "read_material_deposition_file_2d"
42: /var/jenkins/workspace/adamantine-nightly/tests/test_material_deposition.cc(50): Leaving test case "read_material_deposition_file_2d"; testing time: 468us
42: /var/jenkins/workspace/adamantine-nightly/tests/test_material_deposition.cc(92): Entering test case "read_material_deposition_file_3d"
42: /var/jenkins/workspace/adamantine-nightly/tests/test_material_deposition.cc(92): Leaving test case "read_material_deposition_file_3d"; testing time: 224us
42: /var/jenkins/workspace/adamantine-nightly/tests/test_material_deposition.cc(134): Test case "get_elements_to_activate_2d" is skipped because precondition failed: the test only works in serial
42: /var/jenkins/workspace/adamantine-nightly/tests/test_material_deposition.cc(195): Test case "get_elements_to_activate_3d" is skipped because precondition failed: the test only works in serial
42: /var/jenkins/workspace/adamantine-nightly/tests/test_material_deposition.cc(262): Entering test case "material_deposition"
42: /var/jenkins/workspace/adamantine-nightly/tests/test_material_deposition.cc(262): Leaving test case "material_deposition"; testing time: 16848416us
42: /var/jenkins/workspace/adamantine-nightly/tests/test_material_deposition.cc(395): Entering test case "deposition_from_scan_path_2d"
42: /var/jenkins/workspace/adamantine-nightly/tests/test_material_deposition.cc(262): Leaving test case "material_deposition"; testing time: 16750131us
42: /var/jenkins/workspace/adamantine-nightly/tests/test_material_deposition.cc(395): Entering test case "deposition_from_scan_path_2d"
42: /var/jenkins/workspace/adamantine-nightly/tests/test_material_deposition.cc(395): Leaving test case "deposition_from_scan_path_2d"; testing time: 20270us
42: /var/jenkins/workspace/adamantine-nightly/tests/test_material_deposition.cc(445): Entering test case "deposition_from_scan_path_3d"
42: /var/jenkins/workspace/adamantine-nightly/tests/test_material_deposition.cc(445): Leaving test case "deposition_from_scan_path_3d"; testing time: 226us
42: /var/jenkins/workspace/adamantine-nightly/tests/test_material_deposition.cc(499): Entering test case "deposition_from_L_scan_path_3d"
42: /var/jenkins/workspace/adamantine-nightly/tests/test_material_deposition.cc(395): Leaving test case "deposition_from_scan_path_2d"; testing time: 21651us
42: /var/jenkins/workspace/adamantine-nightly/tests/test_material_deposition.cc(445): Entering test case "deposition_from_scan_path_3d"
42: /var/jenkins/workspace/adamantine-nightly/tests/test_material_deposition.cc(445): Leaving test case "deposition_from_scan_path_3d"; testing time: 225us
42: /var/jenkins/workspace/adamantine-nightly/tests/test_material_deposition.cc(499): Entering test case "deposition_from_L_scan_path_3d"
42: /var/jenkins/workspace/adamantine-nightly/tests/test_material_deposition.cc(499): Leaving test case "deposition_from_L_scan_path_3d"; testing time: 275us
42: /var/jenkins/workspace/adamantine-nightly/tests/test_material_deposition.cc(586): Entering test case "deposition_from_diagonal_scan_path_3d"
42: /var/jenkins/workspace/adamantine-nightly/tests/test_material_deposition.cc(499): Leaving test case "deposition_from_L_scan_path_3d"; testing time: 12319us
42: /var/jenkins/workspace/adamantine-nightly/tests/test_material_deposition.cc(586): Entering test case "deposition_from_diagonal_scan_path_3d"
42: /var/jenkins/workspace/adamantine-nightly/tests/test_material_deposition.cc(586): Leaving test case "deposition_from_diagonal_scan_path_3d"; testing time: 276us
42: /var/jenkins/workspace/adamantine-nightly/tests/test_material_deposition.cc(640): Entering test case "merge_multiple_deposition_paths"
42: /var/jenkins/workspace/adamantine-nightly/tests/test_material_deposition.cc(640): Leaving test case "merge_multiple_deposition_paths"; testing time: 174us
42: /var/jenkins/workspace/adamantine-nightly/tests/test_material_deposition.cc(697): Entering test case "deposition_quaternion_straight_line"
42: /var/jenkins/workspace/adamantine-nightly/tests/test_material_deposition.cc(586): Leaving test case "deposition_from_diagonal_scan_path_3d"; testing time: 11773us
42: /var/jenkins/workspace/adamantine-nightly/tests/test_material_deposition.cc(640): Entering test case "merge_multiple_deposition_paths"
42: /var/jenkins/workspace/adamantine-nightly/tests/test_material_deposition.cc(640): Leaving test case "merge_multiple_deposition_paths"; testing time: 144us
42: /var/jenkins/workspace/adamantine-nightly/tests/test_material_deposition.cc(697): Entering test case "deposition_quaternion_straight_line"
42: /var/jenkins/workspace/adamantine-nightly/tests/test_material_deposition.cc(697): Leaving test case "deposition_quaternion_straight_line"; testing time: 10824us
42: Leaving test module "MaterialDeposition"; testing time: 16797798us
42: /var/jenkins/workspace/adamantine-nightly/tests/test_material_deposition.cc(697): Leaving test case "deposition_quaternion_straight_line"; testing time: 12337us
42: Leaving test module "MaterialDeposition"; testing time: 16927610us
42: 
42: *** No errors detected
42: 
42: *** No errors detected
42: 
40/48 Test #42: test_material_deposition_2 ...............   Passed   23.16 sec
test 44
      Start 44: test_microstructure_2

44: Test command: /usr/bin/mpiexec "-n" "2" "/var/jenkins/workspace/adamantine-nightly/build/bin/test_microstructure"
44: Working Directory: /var/jenkins/workspace/adamantine-nightly/build/tests
44: Test timeout computed to be: 7200
44: Running 1 test case...
44: Entering test module "MicroStructure"
44: /var/jenkins/workspace/adamantine-nightly/tests/test_microstructure.cc(53): Entering test case "G_and_R"
44: Running 1 test case...
44: Entering test module "MicroStructure"
44: /var/jenkins/workspace/adamantine-nightly/tests/test_microstructure.cc(53): Entering test case "G_and_R"
44: Test case G_and_R did not check any assertions
44: /var/jenkins/workspace/adamantine-nightly/tests/test_microstructure.cc(53): Leaving test case "G_and_R"; testing time: 420669us
44: Leaving test module "MicroStructure"; testing time: 420714us
44: 
44: *** No errors detected
44: /var/jenkins/workspace/adamantine-nightly/tests/test_microstructure.cc(53): Leaving test case "G_and_R"; testing time: 463084us
44: Leaving test module "MicroStructure"; testing time: 463133us
44: 
44: *** No errors detected
44: 
41/48 Test #44: test_microstructure_2 ....................   Passed    6.56 sec
test 46
      Start 46: test_thermal_physics_2

46: Test command: /usr/bin/mpiexec "-n" "2" "/var/jenkins/workspace/adamantine-nightly/build/bin/test_thermal_physics"
46: Working Directory: /var/jenkins/workspace/adamantine-nightly/build/tests
46: Test timeout computed to be: 7200
46: Running 7 test cases...
46: Entering test module "ThermalPhysics"
46: /var/jenkins/workspace/adamantine-nightly/tests/test_thermal_physics.cc(15): Entering test case "thermal_2d_explicit_host"
46: Running 7 test cases...
46: Entering test module "ThermalPhysics"
46: /var/jenkins/workspace/adamantine-nightly/tests/test_thermal_physics.cc(15): Entering test case "thermal_2d_explicit_host"
46: /var/jenkins/workspace/adamantine-nightly/tests/test_thermal_physics.cc(15): Leaving test case "thermal_2d_explicit_host"; testing time: 332107us
46: /var/jenkins/workspace/adamantine-nightly/tests/test_thermal_physics.cc(28): Entering test case "thermal_2d_manufactured_solution_host"
46: /var/jenkins/workspace/adamantine-nightly/tests/test_thermal_physics.cc(15): Leaving test case "thermal_2d_explicit_host"; testing time: 255642us
46: /var/jenkins/workspace/adamantine-nightly/tests/test_thermal_physics.cc(28): Entering test case "thermal_2d_manufactured_solution_host"
46: /var/jenkins/workspace/adamantine-nightly/tests/test_thermal_physics.cc(28): Leaving test case "thermal_2d_manufactured_solution_host"; testing time: 239780us
46: /var/jenkins/workspace/adamantine-nightly/tests/test_thermal_physics.cc(33): Entering test case "initial_temperature_host"
46: /var/jenkins/workspace/adamantine-nightly/tests/test_thermal_physics.cc(28): Leaving test case "thermal_2d_manufactured_solution_host"; testing time: 239627us
46: /var/jenkins/workspace/adamantine-nightly/tests/test_thermal_physics.cc(33): Entering test case "initial_temperature_host"
46: /var/jenkins/workspace/adamantine-nightly/tests/test_thermal_physics.cc(33): Leaving test case "initial_temperature_host"; testing time: 233549us
46: /var/jenkins/workspace/adamantine-nightly/tests/test_thermal_physics.cc(38): Entering test case "energy_conservation_host"
46: /var/jenkins/workspace/adamantine-nightly/tests/test_thermal_physics.cc(33): Leaving test case "initial_temperature_host"; testing time: 233443us
46: /var/jenkins/workspace/adamantine-nightly/tests/test_thermal_physics.cc(38): Entering test case "energy_conservation_host"
46: /var/jenkins/workspace/adamantine-nightly/tests/test_thermal_physics.cc(38): Leaving test case "energy_conservation_host"; testing time: 9112887us
46: /var/jenkins/workspace/adamantine-nightly/tests/test_thermal_physics.cc(43): Entering test case "radiation_bcs_host"
46: /var/jenkins/workspace/adamantine-nightly/tests/test_thermal_physics.cc(38): Leaving test case "energy_conservation_host"; testing time: 9113056us
46: /var/jenkins/workspace/adamantine-nightly/tests/test_thermal_physics.cc(43): Entering test case "radiation_bcs_host"
46: /var/jenkins/workspace/adamantine-nightly/tests/test_thermal_physics.cc(43): Leaving test case "radiation_bcs_host"; testing time: 4882956us
46: /var/jenkins/workspace/adamantine-nightly/tests/test_thermal_physics.cc(48): Entering test case "convection_bcs_host"
46: /var/jenkins/workspace/adamantine-nightly/tests/test_thermal_physics.cc(43): Leaving test case "radiation_bcs_host"; testing time: 4882936us
46: /var/jenkins/workspace/adamantine-nightly/tests/test_thermal_physics.cc(48): Entering test case "convection_bcs_host"
40: 40% completed
46: /var/jenkins/workspace/adamantine-nightly/tests/test_thermal_physics.cc(48): Leaving test case "convection_bcs_host"; testing time: 80148572us
46: /var/jenkins/workspace/adamantine-nightly/tests/test_thermal_physics.cc(53): Entering test case "reference_temperature_host"
46: /var/jenkins/workspace/adamantine-nightly/tests/test_thermal_physics.cc(48): Leaving test case "convection_bcs_host"; testing time: 80148541us
46: /var/jenkins/workspace/adamantine-nightly/tests/test_thermal_physics.cc(53): Entering test case "reference_temperature_host"
46: 
46: *** No errors detected
46: /var/jenkins/workspace/adamantine-nightly/tests/test_thermal_physics.cc(53): Leaving test case "reference_temperature_host"; testing time: 191092us
46: Leaving test module "ThermalPhysics"; testing time: 95065259us
46: 
46: *** No errors detected
46: /var/jenkins/workspace/adamantine-nightly/tests/test_thermal_physics.cc(53): Leaving test case "reference_temperature_host"; testing time: 234860us
46: Leaving test module "ThermalPhysics"; testing time: 95198406us
46: 
42/48 Test #46: test_thermal_physics_2 ...................   Passed  101.99 sec
test 48
      Start 48: test_ensemble_management_2

48: Test command: /usr/bin/mpiexec "-n" "2" "/var/jenkins/workspace/adamantine-nightly/build/bin/test_ensemble_management"
48: Working Directory: /var/jenkins/workspace/adamantine-nightly/build/tests
48: Test timeout computed to be: 7200
48: Running 1 test case...
48: Entering test module "EnsembleManagement"
48: /var/jenkins/workspace/adamantine-nightly/tests/test_ensemble_management.cc(17): Entering test case "database_ensemble"
48: 
48: *** No errors detected
48: /var/jenkins/workspace/adamantine-nightly/tests/test_ensemble_management.cc(17): Leaving test case "database_ensemble"; testing time: 470us
48: Leaving test module "EnsembleManagement"; testing time: 497us
48: Running 1 test case...
48: Entering test module "EnsembleManagement"
48: /var/jenkins/workspace/adamantine-nightly/tests/test_ensemble_management.cc(17): Entering test case "database_ensemble"
48: /var/jenkins/workspace/adamantine-nightly/tests/test_ensemble_management.cc(17): Leaving test case "database_ensemble"; testing time: 50845us
48: Leaving test module "EnsembleManagement"; testing time: 50884us
48: 
48: *** No errors detected
48: 
43/48 Test #48: test_ensemble_management_2 ...............   Passed    7.46 sec
40: 20% completed
40: 50% completed
40: 60% completed
40: 70% completed
40: 30% completed
40: 80% completed
40: 90% completed
40: 40% completed
40: 100% completed
40: /var/jenkins/workspace/adamantine-nightly/tests/test_integration_thermoelastic.cc(47): Leaving test case "integration_thermoelastic_add_material"; testing time: 885908470us
40: Leaving test module "Integration_Thermoelastic"; testing time: 2734257548us
40: 
40: *** No errors detected
40: /var/jenkins/workspace/adamantine-nightly/tests/test_integration_thermoelastic.cc(47): Leaving test case "integration_thermoelastic_add_material"; testing time: 885908255us
40: Leaving test module "Integration_Thermoelastic"; testing time: 2734258029us
40: 
40: *** No errors detected
40: 
44/48 Test #40: test_integration_thermoelastic_2 .........   Passed  2735.00 sec
test 3
      Start  3: test_integration_da_3

3: Test command: /usr/bin/mpiexec "-n" "3" "/var/jenkins/workspace/adamantine-nightly/build/bin/test_integration_da"
3: Working Directory: /var/jenkins/workspace/adamantine-nightly/build/tests
3: Test timeout computed to be: 7200
3: Running 3 test cases...
3: Running 3 test cases...
3: Entering test module "Integration_Data_Assimilation"
3: Entering test module "Integration_Data_Assimilation"
3: /var/jenkins/workspace/adamantine-nightly/tests/test_integration_da.cc(78): Entering test case "integration_data_assimilation"
3: /var/jenkins/workspace/adamantine-nightly/tests/test_integration_da.cc(78): Entering test case "integration_data_assimilation"
3: Running 3 test cases...
3: Entering test module "Integration_Data_Assimilation"
3: /var/jenkins/workspace/adamantine-nightly/tests/test_integration_da.cc(78): Entering test case "integration_data_assimilation"
3: Reading the experimental log file...
3: Done. Log entries found for 1 camera(s), with 2 frame(s).
3: Starting the main time stepping loop...
3: 10% completed
3: 20% completed
3: 30% completed
3: 40% completed
3: Performing data assimilation at time 0.0211...
3: Rank: 0 | Old parameters for member 0: 
3: Rank: 1 | Old parameters for member 1: 
3: Rank: 2 | Old parameters for member 2: 
3: Rank: 0 | Number expt sites mapped to DOFs: 1
3: Rank: 1 | Number expt sites mapped to DOFs: 1
3: Rank: 2 | Number expt sites mapped to DOFs: 1
3: Getting the perturbed innovation...
3: Applying the Kalman gain...
3: Updating the ensemble members...
3: Done.
3: 50% completed
3: 60% completed
3: Performing data assimilation at time 0.0316...
3: Rank: 2 | Old parameters for member 2: 
3: Rank: 0 | Old parameters for member 0: 
3: Rank: 1 | Old parameters for member 1: 
3: Rank: 0 | Number expt sites mapped to DOFs: 1
3: Rank: 2 | Number expt sites mapped to DOFs: 1
3: Rank: 1 | Number expt sites mapped to DOFs: 1
3: Getting the perturbed innovation...
3: Applying the Kalman gain...
3: Updating the ensemble members...
3: Done.
3: 70% completed
3: 80% completed
3: 90% completed
3: 100% completed
3: Reading the experimental log file...
3: Done. Log entries found for 1 camera(s), with 2 frame(s).
3: Reading the experimental log file...
3: Done. Log entries found for 1 camera(s), with 2 frame(s).
3: Reading the experimental log file...
3: Done. Log entries found for 1 camera(s), with 2 frame(s).
3: Starting the main time stepping loop...
3: Starting the main time stepping loop...
3: Starting the main time stepping loop...
3: 10% completed
3: 10% completed
3: 10% completed
3: 20% completed
3: 20% completed
3: 20% completed
3: 30% completed
3: 30% completed
3: 30% completed
3: 40% completed
3: 40% completed
3: 40% completed
3: Performing data assimilation at time 0.0211...
3: Rank: 0 | Old parameters for member 0: 
3: Rank: 0 | Old parameters for member 1: 
3: Rank: 0 | Old parameters for member 2: 
3: Performing data assimilation at time 0.0211...
3: Rank: 0 | Old parameters for member 0: 
3: Rank: 0 | Old parameters for member 1: 
3: Rank: 0 | Old parameters for member 2: 
3: Rank: 0 | Number expt sites mapped to DOFs: 1
3: Rank: 0 | Number expt sites mapped to DOFs: 1
3: Performing data assimilation at time 0.0211...
3: Rank: 0 | Old parameters for member 0: 
3: Rank: 0 | Old parameters for member 1: 
3: Rank: 0 | Old parameters for member 2: 
3: Rank: 0 | Number expt sites mapped to DOFs: 1
3: Getting the perturbed innovation...
3: Applying the Kalman gain...
3: Getting the perturbed innovation...
3: Applying the Kalman gain...
3: Getting the perturbed innovation...
3: Applying the Kalman gain...
3: Updating the ensemble members...
3: Done.
3: Updating the ensemble members...
3: Done.
3: Updating the ensemble members...
3: Done.
3: 50% completed
3: 50% completed
3: 50% completed
3: 60% completed
3: 60% completed
3: 60% completed
3: Performing data assimilation at time 0.0316...
3: Rank: 0 | Old parameters for member 0: 
3: Rank: 0 | Old parameters for member 1: 
3: Rank: 0 | Old parameters for member 2: 
3: Rank: 0 | Number expt sites mapped to DOFs: 1
3: Performing data assimilation at time 0.0316...
3: Rank: 0 | Old parameters for member 0: 
3: Rank: 0 | Old parameters for member 1: 
3: Rank: 0 | Old parameters for member 2: 
3: Rank: 0 | Number expt sites mapped to DOFs: 1
3: Performing data assimilation at time 0.0316...
3: Rank: 0 | Old parameters for member 0: 
3: Rank: 0 | Old parameters for member 1: 
3: Rank: 0 | Old parameters for member 2: 
3: Rank: 0 | Number expt sites mapped to DOFs: 1
3: Getting the perturbed innovation...
3: Applying the Kalman gain...
3: Getting the perturbed innovation...
3: Applying the Kalman gain...
3: Getting the perturbed innovation...
3: Applying the Kalman gain...
3: Updating the ensemble members...
3: Done.
3: Updating the ensemble members...
3: Done.
3: Updating the ensemble members...
3: Done.
3: 70% completed
3: 70% completed
3: 70% completed
3: 80% completed
3: 80% completed
3: 80% completed
3: 90% completed
3: 90% completed
3: 90% completed
3: 100% completed
3: 100% completed
3: 100% completed
3: /var/jenkins/workspace/adamantine-nightly/tests/test_integration_da.cc(78): Leaving test case "integration_data_assimilation"; testing time: 39856398us
3: /var/jenkins/workspace/adamantine-nightly/tests/test_integration_da.cc(148): Entering test case "integration_3D_da_point_cloud_add_material"
3: /var/jenkins/workspace/adamantine-nightly/tests/test_integration_da.cc(78): Leaving test case "integration_data_assimilation"; testing time: 39861321us
3: /var/jenkins/workspace/adamantine-nightly/tests/test_integration_da.cc(148): Entering test case "integration_3D_da_point_cloud_add_material"
3: /var/jenkins/workspace/adamantine-nightly/tests/test_integration_da.cc(78): Leaving test case "integration_data_assimilation"; testing time: 39861453us
3: /var/jenkins/workspace/adamantine-nightly/tests/test_integration_da.cc(148): Entering test case "integration_3D_da_point_cloud_add_material"
3: Reading the experimental log file...
3: Done. Log entries found for 1 camera(s), with 1 frame(s).
3: Starting the main time stepping loop...
3: 10% completed
3: 20% completed
3: 30% completed
3: 40% completed
3: 50% completed
3: Rank: 1 | Old parameters for member 1: 
3: Rank: 1 | Number expt sites mapped to DOFs: 1
3: Performing data assimilation at time 0.12...
3: Rank: 0 | Old parameters for member 0: 
3: Rank: 2 | Old parameters for member 2: 
3: Rank: 0 | Number expt sites mapped to DOFs: 1
3: Rank: 2 | Number expt sites mapped to DOFs: 1
3: Getting the perturbed innovation...
3: Applying the Kalman gain...
3: Updating the ensemble members...
3: Done.
3: 60% completed
3: 70% completed
3: 80% completed
3: 90% completed
3: 100% completed
3: Reading the experimental log file...
3: Done. Log entries found for 1 camera(s), with 1 frame(s).
3: Reading the experimental log file...
3: Done. Log entries found for 1 camera(s), with 1 frame(s).
3: Reading the experimental log file...
3: Done. Log entries found for 1 camera(s), with 1 frame(s).
3: Starting the main time stepping loop...
3: Starting the main time stepping loop...
3: Starting the main time stepping loop...
3: 10% completed
3: 10% completed
3: 10% completed
3: 20% completed
3: 20% completed
3: 20% completed
3: 30% completed
3: 30% completed
3: 30% completed
3: 40% completed
3: 40% completed
3: 40% completed
3: 50% completed
3: 50% completed
3: 50% completed
3: Performing data assimilation at time 0.12...
3: Rank: 0 | Old parameters for member 0: 
3: Rank: 0 | Old parameters for member 1: 
3: Rank: 0 | Old parameters for member 2: 
3: Rank: 0 | Number expt sites mapped to DOFs: 1
3: Performing data assimilation at time 0.12...
3: Rank: 0 | Old parameters for member 0: 
3: Rank: 0 | Old parameters for member 1: 
3: Rank: 0 | Old parameters for member 2: 
3: Performing data assimilation at time 0.12...
3: Rank: 0 | Old parameters for member 0: 
3: Rank: 0 | Old parameters for member 1: 
3: Rank: 0 | Old parameters for member 2: 
3: Rank: 0 | Number expt sites mapped to DOFs: 1
3: Rank: 0 | Number expt sites mapped to DOFs: 1
3: Getting the perturbed innovation...
3: Applying the Kalman gain...
3: Getting the perturbed innovation...
3: Applying the Kalman gain...
3: Getting the perturbed innovation...
3: Applying the Kalman gain...
3: Updating the ensemble members...
3: Done.
3: 60% completed
3: Updating the ensemble members...
3: Updating the ensemble members...
3: Done.
3: 60% completed
3: Done.
3: 60% completed
3: 70% completed
3: 70% completed
3: 70% completed
3: 80% completed
3: 80% completed
3: 80% completed
3: 90% completed
3: 90% completed
3: 90% completed
3: 100% completed
3: 100% completed
3: 100% completed
3: /var/jenkins/workspace/adamantine-nightly/tests/test_integration_da.cc(148): Leaving test case "integration_3D_da_point_cloud_add_material"; testing time: 1674517us
3: /var/jenkins/workspace/adamantine-nightly/tests/test_integration_da.cc(231): Entering test case "integration_3D_da_ray_add_material"
3: /var/jenkins/workspace/adamantine-nightly/tests/test_integration_da.cc(148): Leaving test case "integration_3D_da_point_cloud_add_material"; testing time: 1707963us
3: /var/jenkins/workspace/adamantine-nightly/tests/test_integration_da.cc(231): Entering test case "integration_3D_da_ray_add_material"
3: /var/jenkins/workspace/adamantine-nightly/tests/test_integration_da.cc(148): Leaving test case "integration_3D_da_point_cloud_add_material"; testing time: 1703311us
3: /var/jenkins/workspace/adamantine-nightly/tests/test_integration_da.cc(231): Entering test case "integration_3D_da_ray_add_material"
3: Reading the experimental log file...
3: Done. Log entries found for 1 camera(s), with 1 frame(s).
3: Starting the main time stepping loop...
3: 10% completed
3: 20% completed
3: 30% completed
3: 40% completed
3: 50% completed
3: Rank: 2 | Old parameters for member 2: 
3: Rank: 1 | Old parameters for member 1: 
3: Performing data assimilation at time 0.12...
3: Rank: 0 | Old parameters for member 0: 
3: Rank: 2 | Number expt sites mapped to DOFs: 1
3: Rank: 1 | Number expt sites mapped to DOFs: 1
3: Rank: 0 | Number expt sites mapped to DOFs: 1
3: Getting the perturbed innovation...
3: Applying the Kalman gain...
3: Updating the ensemble members...
3: Done.
3: 60% completed
3: 70% completed
3: 80% completed
3: 90% completed
3: 100% completed
3: Reading the experimental log file...
3: Done. Log entries found for 1 camera(s), with 1 frame(s).
3: Reading the experimental log file...
3: Done. Log entries found for 1 camera(s), with 1 frame(s).
3: Reading the experimental log file...
3: Done. Log entries found for 1 camera(s), with 1 frame(s).
3: Starting the main time stepping loop...
3: Starting the main time stepping loop...
3: Starting the main time stepping loop...
3: 10% completed
3: 10% completed
3: 10% completed
3: 20% completed
3: 20% completed
3: 20% completed
3: 30% completed
3: 30% completed
3: 30% completed
3: 40% completed
3: 40% completed
3: 40% completed
3: 50% completed
3: 50% completed
3: 50% completed
3: Performing data assimilation at time 0.12...
3: Rank: 0 | Old parameters for member 0: 
3: Rank: 0 | Old parameters for member 1: 
3: Rank: 0 | Old parameters for member 2: 
3: Rank: 0 | Number expt sites mapped to DOFs: 1
3: Performing data assimilation at time 0.12...
3: Performing data assimilation at time 0.12...
3: Rank: 0 | Old parameters for member 0: 
3: Rank: 0 | Old parameters for member 1: 
3: Rank: 0 | Old parameters for member 2: 
3: Rank: 0 | Old parameters for member 0: 
3: Rank: 0 | Old parameters for member 1: 
3: Rank: 0 | Old parameters for member 2: 
3: Rank: 0 | Number expt sites mapped to DOFs: 1
3: Rank: 0 | Number expt sites mapped to DOFs: 1
3: Getting the perturbed innovation...
3: Applying the Kalman gain...
3: Getting the perturbed innovation...
3: Getting the perturbed innovation...
3: Applying the Kalman gain...
3: Applying the Kalman gain...
3: Updating the ensemble members...
3: Done.
3: 60% completed
3: Updating the ensemble members...
3: Done.
3: 60% completed
3: Updating the ensemble members...
3: Done.
3: 60% completed
3: 70% completed
3: 70% completed
3: 70% completed
3: 80% completed
3: 80% completed
3: 80% completed
3: 90% completed
3: 90% completed
3: 90% completed
3: 100% completed
3: 100% completed
3: 100% completed
3: /var/jenkins/workspace/adamantine-nightly/tests/test_integration_da.cc(231): Leaving test case "integration_3D_da_ray_add_material"; testing time: 1733812us
3: Leaving test module "Integration_Data_Assimilation"; testing time: 43269796us
3: 
3: *** No errors detected
3: /var/jenkins/workspace/adamantine-nightly/tests/test_integration_da.cc(231): Leaving test case "integration_3D_da_ray_add_material"; testing time: 1722804us
3: Leaving test module "Integration_Data_Assimilation"; testing time: 43287375us
3: 
3: *** No errors detected
3: /var/jenkins/workspace/adamantine-nightly/tests/test_integration_da.cc(231): Leaving test case "integration_3D_da_ray_add_material"; testing time: 1733502us
3: Leaving test module "Integration_Data_Assimilation"; testing time: 43298436us
3: 
3: *** No errors detected
3: 
45/48 Test  #3: test_integration_da_3 ....................   Passed   43.93 sec
test 4
      Start  4: test_integration_da_6

4: Test command: /usr/bin/mpiexec "-n" "6" "/var/jenkins/workspace/adamantine-nightly/build/bin/test_integration_da"
4: Working Directory: /var/jenkins/workspace/adamantine-nightly/build/tests
4: Test timeout computed to be: 7200
4: Running 3 test cases...
4: Running 3 test cases...
4: Running 3 test cases...
4: Running 3 test cases...
4: Entering test module "Integration_Data_Assimilation"
4: /var/jenkins/workspace/adamantine-nightly/tests/test_integration_da.cc(78): Entering test case "integration_data_assimilation"
4: Entering test module "Integration_Data_Assimilation"
4: /var/jenkins/workspace/adamantine-nightly/tests/test_integration_da.cc(78): Entering test case "integration_data_assimilation"
4: Running 3 test cases...
4: Entering test module "Integration_Data_Assimilation"
4: /var/jenkins/workspace/adamantine-nightly/tests/test_integration_da.cc(78): Entering test case "integration_data_assimilation"
4: Entering test module "Integration_Data_Assimilation"
4: /var/jenkins/workspace/adamantine-nightly/tests/test_integration_da.cc(78): Entering test case "integration_data_assimilation"
4: Entering test module "Integration_Data_Assimilation"
4: /var/jenkins/workspace/adamantine-nightly/tests/test_integration_da.cc(78): Entering test case "integration_data_assimilation"
4: Running 3 test cases...
4: Entering test module "Integration_Data_Assimilation"
4: /var/jenkins/workspace/adamantine-nightly/tests/test_integration_da.cc(78): Entering test case "integration_data_assimilation"
4: Reading the experimental log file...
4: Done. Log entries found for 1 camera(s), with 2 frame(s).
4: Starting the main time stepping loop...
4: 10% completed
4: 20% completed
4: 30% completed
4: 40% completed
4: Rank: 1 | Old parameters for member 0: 
4: Performing data assimilation at time 0.0211...
4: Rank: 0 | Old parameters for member 0: 
4: Rank: 3 | Old parameters for member 1: 
4: Rank: 2 | Old parameters for member 1: 
4: Rank: 1 | Number expt sites mapped to DOFs: 1
4: Rank: 0 | Number expt sites mapped to DOFs: 1
4: Rank: 4 | Old parameters for member 2: 
4: Rank: 5 | Old parameters for member 2: 
4: Rank: 2 | Number expt sites mapped to DOFs: 1
4: Rank: 3 | Number expt sites mapped to DOFs: 1
4: Rank: 4 | Number expt sites mapped to DOFs: 1
4: Rank: 5 | Number expt sites mapped to DOFs: 1
4: Getting the perturbed innovation...
4: Applying the Kalman gain...
4: Updating the ensemble members...
4: Done.
4: 50% completed
4: 60% completed
4: Rank: 3 | Old parameters for member 1: 
4: Rank: 2 | Old parameters for member 1: 
4: Rank: 3 | Number expt sites mapped to DOFs: 1
4: Rank: 2 | Number expt sites mapped to DOFs: 1
4: Rank: 4 | Old parameters for member 2: 
4: Rank: 5 | Old parameters for member 2: 
4: Performing data assimilation at time 0.0316...
4: Rank: 0 | Old parameters for member 0: 
4: Rank: 1 | Old parameters for member 0: 
4: Rank: 5 | Number expt sites mapped to DOFs: 1
4: Rank: 4 | Number expt sites mapped to DOFs: 1
4: Rank: 0 | Number expt sites mapped to DOFs: 1
4: Rank: 1 | Number expt sites mapped to DOFs: 1
4: Getting the perturbed innovation...
4: Applying the Kalman gain...
4: Updating the ensemble members...
4: Done.
4: 70% completed
4: 80% completed
4: 90% completed
4: 100% completed
4: Reading the experimental log file...
4: Done. Log entries found for 1 camera(s), with 2 frame(s).
4: Reading the experimental log file...
4: Done. Log entries found for 1 camera(s), with 2 frame(s).
4: Reading the experimental log file...
4: Done. Log entries found for 1 camera(s), with 2 frame(s).
4: Reading the experimental log file...
4: Done. Log entries found for 1 camera(s), with 2 frame(s).
4: Reading the experimental log file...
4: Reading the experimental log file...
4: Done. Log entries found for 1 camera(s), with 2 frame(s).
4: Done. Log entries found for 1 camera(s), with 2 frame(s).
4: Starting the main time stepping loop...
4: Starting the main time stepping loop...
4: Starting the main time stepping loop...
4: Starting the main time stepping loop...
4: Starting the main time stepping loop...
4: Starting the main time stepping loop...
4: 10% completed
4: 10% completed
4: 10% completed
4: 10% completed
4: 10% completed
4: 10% completed
4: 20% completed
4: 20% completed
4: 20% completed
4: 20% completed
4: 20% completed
4: 20% completed
4: 30% completed
4: 30% completed
4: 30% completed
4: 30% completed
4: 30% completed
4: 30% completed
4: 40% completed
4: 40% completed
4: 40% completed
4: 40% completed
4: 40% completed
4: 40% completed
4: Performing data assimilation at time 0.0211...
4: Rank: 0 | Old parameters for member 0: 
4: Rank: 0 | Old parameters for member 1: 
4: Rank: 0 | Old parameters for member 2: 
4: Performing data assimilation at time 0.0211...
4: Rank: 0 | Old parameters for member 0: 
4: Rank: 0 | Old parameters for member 1: 
4: Rank: 0 | Old parameters for member 2: 
4: Performing data assimilation at time 0.0211...
4: Rank: 0 | Old parameters for member 0: 
4: Rank: 0 | Old parameters for member 1: 
4: Rank: 0 | Old parameters for member 2: 
4: Rank: 0 | Number expt sites mapped to DOFs: 1
4: Rank: 0 | Number expt sites mapped to DOFs: 1
4: Rank: 0 | Number expt sites mapped to DOFs: 1
4: Performing data assimilation at time 0.0211...
4: Rank: 0 | Old parameters for member 0: 
4: Rank: 0 | Old parameters for member 1: 
4: Rank: 0 | Old parameters for member 2: 
4: Rank: 0 | Number expt sites mapped to DOFs: 1
4: Performing data assimilation at time 0.0211...
4: Rank: 0 | Old parameters for member 0: 
4: Rank: 0 | Old parameters for member 1: 
4: Rank: 0 | Old parameters for member 2: 
4: Performing data assimilation at time 0.0211...
4: Rank: 0 | Old parameters for member 0: 
4: Rank: 0 | Old parameters for member 1: 
4: Rank: 0 | Old parameters for member 2: 
4: Rank: 0 | Number expt sites mapped to DOFs: 1
4: Rank: 0 | Number expt sites mapped to DOFs: 1
4: Getting the perturbed innovation...
4: Applying the Kalman gain...
4: Getting the perturbed innovation...
4: Applying the Kalman gain...
4: Getting the perturbed innovation...
4: Applying the Kalman gain...
4: Getting the perturbed innovation...
4: Applying the Kalman gain...
4: Getting the perturbed innovation...
4: Applying the Kalman gain...
4: Getting the perturbed innovation...
4: Applying the Kalman gain...
4: Updating the ensemble members...
4: Done.
4: Updating the ensemble members...
4: Updating the ensemble members...
4: Done.
4: Done.
4: Updating the ensemble members...
4: Done.
4: Updating the ensemble members...
4: Done.
4: Updating the ensemble members...
4: Done.
4: 50% completed
4: 50% completed
4: 50% completed
4: 50% completed
4: 50% completed
4: 50% completed
4: 60% completed
4: 60% completed
4: 60% completed
4: 60% completed
4: 60% completed
4: 60% completed
4: Performing data assimilation at time 0.0316...
4: Rank: 0 | Old parameters for member 0: 
4: Rank: 0 | Old parameters for member 1: 
4: Rank: 0 | Old parameters for member 2: 
4: Rank: 0 | Number expt sites mapped to DOFs: 1
4: Performing data assimilation at time 0.0316...
4: Rank: 0 | Old parameters for member 0: 
4: Rank: 0 | Old parameters for member 1: 
4: Rank: 0 | Old parameters for member 2: 
4: Rank: 0 | Number expt sites mapped to DOFs: 1
4: Performing data assimilation at time 0.0316...
4: Rank: 0 | Old parameters for member 0: 
4: Rank: 0 | Old parameters for member 1: 
4: Rank: 0 | Old parameters for member 2: 
4: Rank: 0 | Number expt sites mapped to DOFs: 1
4: Performing data assimilation at time 0.0316...
4: Rank: 0 | Old parameters for member 0: 
4: Rank: 0 | Old parameters for member 1: 
4: Rank: 0 | Old parameters for member 2: 
4: Rank: 0 | Number expt sites mapped to DOFs: 1
4: Performing data assimilation at time 0.0316...
4: Rank: 0 | Old parameters for member 0: 
4: Rank: 0 | Old parameters for member 1: 
4: Rank: 0 | Old parameters for member 2: 
4: Rank: 0 | Number expt sites mapped to DOFs: 1
4: Performing data assimilation at time 0.0316...
4: Rank: 0 | Old parameters for member 0: 
4: Rank: 0 | Old parameters for member 1: 
4: Rank: 0 | Old parameters for member 2: 
4: Rank: 0 | Number expt sites mapped to DOFs: 1
4: Getting the perturbed innovation...
4: Applying the Kalman gain...
4: Getting the perturbed innovation...
4: Applying the Kalman gain...
4: Getting the perturbed innovation...
4: Applying the Kalman gain...
4: Getting the perturbed innovation...
4: Applying the Kalman gain...
4: Getting the perturbed innovation...
4: Applying the Kalman gain...
4: Getting the perturbed innovation...
4: Applying the Kalman gain...
4: Updating the ensemble members...
4: Done.
4: Updating the ensemble members...
4: Done.
4: Updating the ensemble members...
4: Done.
4: Updating the ensemble members...
4: Done.
4: Updating the ensemble members...
4: Done.
4: Updating the ensemble members...
4: Done.
4: 70% completed
4: 70% completed
4: 70% completed
4: 70% completed
4: 70% completed
4: 70% completed
4: 80% completed
4: 80% completed
4: 80% completed
4: 80% completed
4: 80% completed
4: 80% completed
4: 90% completed
4: 90% completed
4: 90% completed
4: 90% completed
4: 90% completed
4: 90% completed
4: 100% completed
4: 100% completed
4: 100% completed
4: /var/jenkins/workspace/adamantine-nightly/tests/test_integration_da.cc(78): Leaving test case "integration_data_assimilation"; testing time: 36937193us
4: /var/jenkins/workspace/adamantine-nightly/tests/test_integration_da.cc(148): Entering test case "integration_3D_da_point_cloud_add_material"
4: /var/jenkins/workspace/adamantine-nightly/tests/test_integration_da.cc(78): Leaving test case "integration_data_assimilation"; testing time: 36954454us
4: /var/jenkins/workspace/adamantine-nightly/tests/test_integration_da.cc(148): Entering test case "integration_3D_da_point_cloud_add_material"
4: /var/jenkins/workspace/adamantine-nightly/tests/test_integration_da.cc(78): Leaving test case "integration_data_assimilation"; testing time: 37033144us
4: /var/jenkins/workspace/adamantine-nightly/tests/test_integration_da.cc(148): Entering test case "integration_3D_da_point_cloud_add_material"
4: 100% completed
4: 100% completed
4: /var/jenkins/workspace/adamantine-nightly/tests/test_integration_da.cc(78): Leaving test case "integration_data_assimilation"; testing time: 37201212us
4: /var/jenkins/workspace/adamantine-nightly/tests/test_integration_da.cc(148): Entering test case "integration_3D_da_point_cloud_add_material"
4: 100% completed
4: /var/jenkins/workspace/adamantine-nightly/tests/test_integration_da.cc(78): Leaving test case "integration_data_assimilation"; testing time: 37319039us
4: /var/jenkins/workspace/adamantine-nightly/tests/test_integration_da.cc(148): Entering test case "integration_3D_da_point_cloud_add_material"
4: /var/jenkins/workspace/adamantine-nightly/tests/test_integration_da.cc(78): Leaving test case "integration_data_assimilation"; testing time: 37457819us
4: /var/jenkins/workspace/adamantine-nightly/tests/test_integration_da.cc(148): Entering test case "integration_3D_da_point_cloud_add_material"
4: Reading the experimental log file...
4: Done. Log entries found for 1 camera(s), with 1 frame(s).
4: Starting the main time stepping loop...
4: 10% completed
4: 20% completed
4: 30% completed
4: 40% completed
4: 50% completed
4: Performing data assimilation at time 0.12...
4: Rank: 1 | Old parameters for member 0: 
4: Rank: 0 | Old parameters for member 0: 
4: Rank: 1 | Number expt sites mapped to DOFs: 1
4: Rank: 0 | Number expt sites mapped to DOFs: 1
4: Rank: 4 | Old parameters for member 2: 
4: Rank: 3 | Old parameters for member 1: 
4: Rank: 2 | Old parameters for member 1: 
4: Rank: 5 | Old parameters for member 2: 
4: Rank: 5 | Number expt sites mapped to DOFs: 1
4: Rank: 4 | Number expt sites mapped to DOFs: 1
4: Rank: 2 | Number expt sites mapped to DOFs: 1
4: Rank: 3 | Number expt sites mapped to DOFs: 1
4: Getting the perturbed innovation...
4: Applying the Kalman gain...
4: Updating the ensemble members...
4: Done.
4: 60% completed
4: 70% completed
4: 80% completed
4: 90% completed
4: 100% completed
4: Reading the experimental log file...
4: Done. Log entries found for 1 camera(s), with 1 frame(s).
4: Reading the experimental log file...
4: Done. Log entries found for 1 camera(s), with 1 frame(s).
4: Reading the experimental log file...
4: Done. Log entries found for 1 camera(s), with 1 frame(s).
4: Reading the experimental log file...
4: Done. Log entries found for 1 camera(s), with 1 frame(s).
4: Reading the experimental log file...
4: Done. Log entries found for 1 camera(s), with 1 frame(s).
4: Reading the experimental log file...
4: Done. Log entries found for 1 camera(s), with 1 frame(s).
4: Starting the main time stepping loop...
4: Starting the main time stepping loop...
4: Starting the main time stepping loop...
4: Starting the main time stepping loop...
4: Starting the main time stepping loop...
4: Starting the main time stepping loop...
4: 10% completed
4: 10% completed
4: 10% completed
4: 10% completed
4: 10% completed
4: 10% completed
4: 20% completed
4: 20% completed
4: 20% completed
4: 20% completed
4: 20% completed
4: 20% completed
4: 30% completed
4: 30% completed
4: 30% completed
4: 30% completed
4: 30% completed
4: 40% completed
4: 30% completed
4: 40% completed
4: 50% completed
4: 40% completed
4: 40% completed
4: 40% completed
4: 40% completed
4: 50% completed
4: Performing data assimilation at time 0.12...
4: Rank: 0 | Old parameters for member 0: 
4: Rank: 0 | Old parameters for member 1: 
4: Rank: 0 | Old parameters for member 2: 
4: Rank: 0 | Number expt sites mapped to DOFs: 1
4: Performing data assimilation at time 0.12...
4: Rank: 0 | Old parameters for member 0: 
4: Rank: 0 | Old parameters for member 1: 
4: Rank: 0 | Old parameters for member 2: 
4: Rank: 0 | Number expt sites mapped to DOFs: 1
4: 50% completed
4: 50% completed
4: 50% completed
4: 50% completed
4: Performing data assimilation at time 0.12...
4: Performing data assimilation at time 0.12...
4: Rank: 0 | Old parameters for member 0: 
4: Rank: 0 | Old parameters for member 1: 
4: Rank: 0 | Old parameters for member 2: 
4: Performing data assimilation at time 0.12...
4: Rank: 0 | Old parameters for member 0: 
4: Rank: 0 | Old parameters for member 1: 
4: Rank: 0 | Old parameters for member 2: 
4: Rank: 0 | Old parameters for member 0: 
4: Rank: 0 | Old parameters for member 1: 
4: Rank: 0 | Old parameters for member 2: 
4: Performing data assimilation at time 0.12...
4: Rank: 0 | Old parameters for member 0: 
4: Rank: 0 | Old parameters for member 1: 
4: Rank: 0 | Old parameters for member 2: 
4: Rank: 0 | Number expt sites mapped to DOFs: 1
4: Rank: 0 | Number expt sites mapped to DOFs: 1
4: Rank: 0 | Number expt sites mapped to DOFs: 1
4: Rank: 0 | Number expt sites mapped to DOFs: 1
4: Getting the perturbed innovation...
4: Applying the Kalman gain...
4: Getting the perturbed innovation...
4: Applying the Kalman gain...
4: Getting the perturbed innovation...
4: Applying the Kalman gain...
4: Getting the perturbed innovation...
4: Applying the Kalman gain...
4: Getting the perturbed innovation...
4: Applying the Kalman gain...
4: Getting the perturbed innovation...
4: Applying the Kalman gain...
4: Updating the ensemble members...
4: Done.
4: 60% completed
4: Updating the ensemble members...
4: Done.
4: 60% completed
4: 70% completed
4: 70% completed
4: Updating the ensemble members...
4: Done.
4: 60% completed
4: Updating the ensemble members...
4: Updating the ensemble members...
4: Done.
4: 60% completed
4: Done.
4: 60% completed
4: 80% completed
4: 80% completed
4: Updating the ensemble members...
4: Done.
4: 60% completed
4: 70% completed
4: 90% completed
4: 90% completed
4: 70% completed
4: 70% completed
4: 70% completed
4: 80% completed
4: 80% completed
4: 80% completed
4: 80% completed
4: 90% completed
4: 90% completed
4: 90% completed
4: 90% completed
4: 100% completed
4: 100% completed
4: /var/jenkins/workspace/adamantine-nightly/tests/test_integration_da.cc(148): Leaving test case "integration_3D_da_point_cloud_add_material"; testing time: 1843603us
4: /var/jenkins/workspace/adamantine-nightly/tests/test_integration_da.cc(231): Entering test case "integration_3D_da_ray_add_material"
4: /var/jenkins/workspace/adamantine-nightly/tests/test_integration_da.cc(148): Leaving test case "integration_3D_da_point_cloud_add_material"; testing time: 1965937us
4: /var/jenkins/workspace/adamantine-nightly/tests/test_integration_da.cc(231): Entering test case "integration_3D_da_ray_add_material"
4: 100% completed
4: 100% completed
4: 100% completed
4: /var/jenkins/workspace/adamantine-nightly/tests/test_integration_da.cc(148): Leaving test case "integration_3D_da_point_cloud_add_material"; testing time: 2254459us
4: /var/jenkins/workspace/adamantine-nightly/tests/test_integration_da.cc(231): Entering test case "integration_3D_da_ray_add_material"
4: 100% completed
4: /var/jenkins/workspace/adamantine-nightly/tests/test_integration_da.cc(148): Leaving test case "integration_3D_da_point_cloud_add_material"; testing time: 2290509us
4: /var/jenkins/workspace/adamantine-nightly/tests/test_integration_da.cc(231): Entering test case "integration_3D_da_ray_add_material"
4: /var/jenkins/workspace/adamantine-nightly/tests/test_integration_da.cc(148): Leaving test case "integration_3D_da_point_cloud_add_material"; testing time: 2199968us
4: /var/jenkins/workspace/adamantine-nightly/tests/test_integration_da.cc(231): Entering test case "integration_3D_da_ray_add_material"
4: /var/jenkins/workspace/adamantine-nightly/tests/test_integration_da.cc(148): Leaving test case "integration_3D_da_point_cloud_add_material"; testing time: 1791360us
4: /var/jenkins/workspace/adamantine-nightly/tests/test_integration_da.cc(231): Entering test case "integration_3D_da_ray_add_material"
4: Reading the experimental log file...
4: Done. Log entries found for 1 camera(s), with 1 frame(s).
4: Starting the main time stepping loop...
4: 10% completed
4: 20% completed
4: 30% completed
4: 40% completed
4: 50% completed
4: Rank: 3 | Old parameters for member 1: 
4: Rank: 2 | Old parameters for member 1: 
4: Performing data assimilation at time 0.12...
4: Rank: 0 | Old parameters for member 0: 
4: Rank: 1 | Old parameters for member 0: 
4: Rank: 2 | Number expt sites mapped to DOFs: 1
4: Rank: 3 | Number expt sites mapped to DOFs: 1
4: Rank: 0 | Number expt sites mapped to DOFs: 1
4: Rank: 1 | Number expt sites mapped to DOFs: 1
4: Rank: 4 | Old parameters for member 2: 
4: Rank: 5 | Old parameters for member 2: 
4: Rank: 4 | Number expt sites mapped to DOFs: 1
4: Rank: 5 | Number expt sites mapped to DOFs: 1
4: Getting the perturbed innovation...
4: Applying the Kalman gain...
4: Updating the ensemble members...
4: Done.
4: 60% completed
4: 70% completed
4: 80% completed
4: 90% completed
4: 100% completed
4: Reading the experimental log file...
4: Done. Log entries found for 1 camera(s), with 1 frame(s).
4: Reading the experimental log file...
4: Done. Log entries found for 1 camera(s), with 1 frame(s).
4: Reading the experimental log file...
4: Done. Log entries found for 1 camera(s), with 1 frame(s).
4: Reading the experimental log file...
4: Done. Log entries found for 1 camera(s), with 1 frame(s).
4: Reading the experimental log file...
4: Done. Log entries found for 1 camera(s), with 1 frame(s).
4: Reading the experimental log file...
4: Done. Log entries found for 1 camera(s), with 1 frame(s).
4: Starting the main time stepping loop...
4: Starting the main time stepping loop...
4: Starting the main time stepping loop...
4: Starting the main time stepping loop...
4: Starting the main time stepping loop...
4: Starting the main time stepping loop...
4: 10% completed
4: 10% completed
4: 10% completed
4: 10% completed
4: 10% completed
4: 10% completed
4: 20% completed
4: 20% completed
4: 20% completed
4: 20% completed
4: 20% completed
4: 30% completed
4: 20% completed
4: 30% completed
4: 30% completed
4: 30% completed
4: 40% completed
4: 30% completed
4: 30% completed
4: 40% completed
4: 40% completed
4: 40% completed
4: 50% completed
4: 50% completed
4: 40% completed
4: 50% completed
4: 40% completed
4: Performing data assimilation at time 0.12...
4: Rank: 0 | Old parameters for member 0: 
4: Rank: 0 | Old parameters for member 1: 
4: Rank: 0 | Old parameters for member 2: 
4: 50% completed
4: Rank: 0 | Number expt sites mapped to DOFs: 1
4: Performing data assimilation at time 0.12...
4: Performing data assimilation at time 0.12...
4: Rank: 0 | Old parameters for member 0: 
4: Rank: 0 | Old parameters for member 1: 
4: Rank: 0 | Old parameters for member 2: 
4: Rank: 0 | Old parameters for member 0: 
4: Rank: 0 | Old parameters for member 1: 
4: Rank: 0 | Old parameters for member 2: 
4: 50% completed
4: 50% completed
4: Rank: 0 | Number expt sites mapped to DOFs: 1
4: Rank: 0 | Number expt sites mapped to DOFs: 1
4: Performing data assimilation at time 0.12...
4: Rank: 0 | Old parameters for member 0: 
4: Rank: 0 | Old parameters for member 1: 
4: Rank: 0 | Old parameters for member 2: 
4: Rank: 0 | Number expt sites mapped to DOFs: 1
4: Performing data assimilation at time 0.12...
4: Performing data assimilation at time 0.12...
4: Rank: 0 | Old parameters for member 0: 
4: Rank: 0 | Old parameters for member 1: 
4: Rank: 0 | Old parameters for member 2: 
4: Rank: 0 | Old parameters for member 0: 
4: Rank: 0 | Old parameters for member 1: 
4: Rank: 0 | Old parameters for member 2: 
4: Rank: 0 | Number expt sites mapped to DOFs: 1
4: Rank: 0 | Number expt sites mapped to DOFs: 1
4: Getting the perturbed innovation...
4: Applying the Kalman gain...
4: Getting the perturbed innovation...
4: Applying the Kalman gain...
4: Getting the perturbed innovation...
4: Applying the Kalman gain...
4: Getting the perturbed innovation...
4: Applying the Kalman gain...
4: Getting the perturbed innovation...
4: Applying the Kalman gain...
4: Getting the perturbed innovation...
4: Applying the Kalman gain...
4: Updating the ensemble members...
4: Done.
4: 60% completed
4: Updating the ensemble members...
4: Done.
4: 60% completed
4: Updating the ensemble members...
4: Done.
4: 60% completed
4: Updating the ensemble members...
4: Done.
4: 60% completed
4: 70% completed
4: Updating the ensemble members...
4: 70% completed
4: 70% completed
4: Done.
4: 60% completed
4: Updating the ensemble members...
4: Done.
4: 60% completed
4: 70% completed
4: 80% completed
4: 70% completed
4: 70% completed
4: 80% completed
4: 80% completed
4: 80% completed
4: 90% completed
4: 80% completed
4: 80% completed
4: 90% completed
4: 90% completed
4: 90% completed
4: 90% completed
4: 90% completed
4: 100% completed
4: 100% completed
4: 100% completed
4: 100% completed
4: /var/jenkins/workspace/adamantine-nightly/tests/test_integration_da.cc(231): Leaving test case "integration_3D_da_ray_add_material"; testing time: 1684392us
4: Leaving test module "Integration_Data_Assimilation"; testing time: 40933872us
4: 
4: *** No errors detected
4: 100% completed
4: 100% completed
4: /var/jenkins/workspace/adamantine-nightly/tests/test_integration_da.cc(231): Leaving test case "integration_3D_da_ray_add_material"; testing time: 1752706us
4: Leaving test module "Integration_Data_Assimilation"; testing time: 40961821us
4: 
4: *** No errors detected
4: /var/jenkins/workspace/adamantine-nightly/tests/test_integration_da.cc(231): Leaving test case "integration_3D_da_ray_add_material"; testing time: 1731972us
4: Leaving test module "Integration_Data_Assimilation"; testing time: 40965310us
4: 
4: *** No errors detected
4: /var/jenkins/workspace/adamantine-nightly/tests/test_integration_da.cc(231): Leaving test case "integration_3D_da_ray_add_material"; testing time: 1809215us
4: Leaving test module "Integration_Data_Assimilation"; testing time: 40972121us
4: 
4: *** No errors detected
4: /var/jenkins/workspace/adamantine-nightly/tests/test_integration_da.cc(231): Leaving test case "integration_3D_da_ray_add_material"; testing time: 1756528us
4: Leaving test module "Integration_Data_Assimilation"; testing time: 40984469us
4: 
4: *** No errors detected
4: /var/jenkins/workspace/adamantine-nightly/tests/test_integration_da.cc(231): Leaving test case "integration_3D_da_ray_add_material"; testing time: 1824507us
4: Leaving test module "Integration_Data_Assimilation"; testing time: 40991866us
4: 
4: *** No errors detected
4: 
46/48 Test  #4: test_integration_da_6 ....................   Passed   41.69 sec
test 7
      Start  7: test_closest_source_point_adaptation_3

7: Test command: /usr/bin/mpiexec "-n" "3" "/var/jenkins/workspace/adamantine-nightly/build/bin/test_closest_source_point_adaptation"
7: Working Directory: /var/jenkins/workspace/adamantine-nightly/build/tests
7: Test timeout computed to be: 7200
7: Running 1 test case...
7: Running 1 test case...
7: Entering test module "ClosestSourcePointAdaptation"
7: /var/jenkins/workspace/adamantine-nightly/tests/test_closest_source_point_adaptation.cc(123): Entering test case "closest_source_point_adaptation"
7: Entering test module "ClosestSourcePointAdaptation"
7: /var/jenkins/workspace/adamantine-nightly/tests/test_closest_source_point_adaptation.cc(123): Entering test case "closest_source_point_adaptation"
7: Running 1 test case...
7: Entering test module "ClosestSourcePointAdaptation"
7: /var/jenkins/workspace/adamantine-nightly/tests/test_closest_source_point_adaptation.cc(123): Entering test case "closest_source_point_adaptation"
7: 
7: *** No errors detected
7: /var/jenkins/workspace/adamantine-nightly/tests/test_closest_source_point_adaptation.cc(123): Leaving test case "closest_source_point_adaptation"; testing time: 5573330us
7: Leaving test module "ClosestSourcePointAdaptation"; testing time: 5573391us
7: /var/jenkins/workspace/adamantine-nightly/tests/test_closest_source_point_adaptation.cc(123): Leaving test case "closest_source_point_adaptation"; testing time: 5573655us
7: Leaving test module "ClosestSourcePointAdaptation"; testing time: 5573713us
7: 
7: *** No errors detected
7: /var/jenkins/workspace/adamantine-nightly/tests/test_closest_source_point_adaptation.cc(123): Leaving test case "closest_source_point_adaptation"; testing time: 5573873us
7: Leaving test module "ClosestSourcePointAdaptation"; testing time: 5573963us
7: 
7: *** No errors detected
7: 
47/48 Test  #7: test_closest_source_point_adaptation_3 ...   Passed    6.20 sec
test 8
      Start  8: test_closest_source_point_adaptation_6

8: Test command: /usr/bin/mpiexec "-n" "6" "/var/jenkins/workspace/adamantine-nightly/build/bin/test_closest_source_point_adaptation"
8: Working Directory: /var/jenkins/workspace/adamantine-nightly/build/tests
8: Test timeout computed to be: 7200
8: Running 1 test case...
8: Running 1 test case...
8: Entering test module "ClosestSourcePointAdaptation"
8: Running 1 test case...
8: Entering test module "ClosestSourcePointAdaptation"
8: /var/jenkins/workspace/adamantine-nightly/tests/test_closest_source_point_adaptation.cc(123): Entering test case "closest_source_point_adaptation"
8: Running 1 test case...
8: Running 1 test case...
8: Entering test module "ClosestSourcePointAdaptation"
8: /var/jenkins/workspace/adamantine-nightly/tests/test_closest_source_point_adaptation.cc(123): Entering test case "closest_source_point_adaptation"
8: Entering test module "ClosestSourcePointAdaptation"
8: /var/jenkins/workspace/adamantine-nightly/tests/test_closest_source_point_adaptation.cc(123): Entering test case "closest_source_point_adaptation"
8: Entering test module "ClosestSourcePointAdaptation"
8: /var/jenkins/workspace/adamantine-nightly/tests/test_closest_source_point_adaptation.cc(123): Entering test case "closest_source_point_adaptation"
8: /var/jenkins/workspace/adamantine-nightly/tests/test_closest_source_point_adaptation.cc(123): Entering test case "closest_source_point_adaptation"
8: Running 1 test case...
8: Entering test module "ClosestSourcePointAdaptation"
8: /var/jenkins/workspace/adamantine-nightly/tests/test_closest_source_point_adaptation.cc(123): Entering test case "closest_source_point_adaptation"
8: /var/jenkins/workspace/adamantine-nightly/tests/test_closest_source_point_adaptation.cc(123): Leaving test case "closest_source_point_adaptation"; testing time: 3505783us
8: Leaving test module "ClosestSourcePointAdaptation"; testing time: 3505832us
8: /var/jenkins/workspace/adamantine-nightly/tests/test_closest_source_point_adaptation.cc(123): Leaving test case "closest_source_point_adaptation"; testing time: 3505777us
8: Leaving test module "ClosestSourcePointAdaptation"; testing time: 3505839us
8: 
8: *** No errors detected
8: 
8: *** No errors detected
8: /var/jenkins/workspace/adamantine-nightly/tests/test_closest_source_point_adaptation.cc(123): Leaving test case "closest_source_point_adaptation"; testing time: 3505892us
8: Leaving test module "ClosestSourcePointAdaptation"; testing time: 3505945us
8: 
8: *** No errors detected
8: /var/jenkins/workspace/adamantine-nightly/tests/test_closest_source_point_adaptation.cc(123): Leaving test case "closest_source_point_adaptation"; testing time: 3506034us
8: Leaving test module "ClosestSourcePointAdaptation"; testing time: 3506091us
8: 
8: *** No errors detected
8: /var/jenkins/workspace/adamantine-nightly/tests/test_closest_source_point_adaptation.cc(123): Leaving test case "closest_source_point_adaptation"; testing time: 3506138us
8: Leaving test module "ClosestSourcePointAdaptation"; testing time: 3506210us
8: 
8: *** No errors detected
8: /var/jenkins/workspace/adamantine-nightly/tests/test_closest_source_point_adaptation.cc(123): Leaving test case "closest_source_point_adaptation"; testing time: 3506620us
8: Leaving test module "ClosestSourcePointAdaptation"; testing time: 3506695us
8: 
8: *** No errors detected
8: 
48/48 Test  #8: test_closest_source_point_adaptation_6 ...   Passed    4.20 sec

The following tests passed:
	test_closest_source_point_adaptation_1
	test_data_assimilator_1
	test_experimental_data_1
	test_geometry_1
	test_heat_source_1
	test_integration_da_2
	test_closest_source_point_adaptation_2
	test_material_property_device_1
	test_material_property_1
	test_integration_da_1
	test_post_processor_1
	test_quaternion_1
	test_scan_path_1
	test_thermal_operator_1
	test_thermal_operator_device_1
	test_mechanical_operator_1
	test_timer_1
	test_utils_1
	test_validate_input_database_1
	test_integration_2d_1
	test_integration_2d_device_1
	test_thermal_physics_device_1
	test_mechanical_physics_1
	test_integration_3d_amr_1
	test_integration_3d_amr_device_1
	test_integration_da_augmented_1
	test_material_deposition_1
	test_microstructure_1
	test_thermal_physics_1
	test_ensemble_management_1
	test_integration_3d_device_1
	test_integration_2d_2
	test_integration_2d_device_2
	test_integration_3d_amr_2
	test_integration_3d_amr_device_2
	test_integration_da_augmented_2
	test_material_deposition_2
	test_microstructure_2
	test_thermal_physics_2
	test_ensemble_management_2
	test_integration_thermoelastic_2
	test_integration_da_3
	test_integration_da_6
	test_closest_source_point_adaptation_3
	test_closest_source_point_adaptation_6

94% tests passed, 3 tests failed out of 48

Total Test time (real) = 10999.84 sec

The following tests FAILED:
	 31 - test_integration_3d_1 (Timeout)
	 32 - test_integration_3d_2 (Timeout)
	 39 - test_integration_thermoelastic_1 (Timeout)
Errors while running CTest
Output from these tests are in: /var/jenkins/workspace/adamantine-nightly/build/Testing/Temporary/LastTest.log
Use "--rerun-failed --output-on-failure" to re-run the failed cases verbosely.
[Pipeline] }
[Pipeline] // dir
Post stage
[Pipeline] xunit
INFO: Processing CTest-Version 3.x (default)
[Pipeline] }
[Pipeline] // withEnv
[Pipeline] }
$ docker stop --time=1 2dd7f5a46e6db3c8c6dfc91c784cb6b3131809a9dcbbab034399de92c18bb14e
INFO: [CTest-Version 3.x (default)] - 1 test report file(s) were found with the pattern 'build/Testing/**/Test.xml' relative to '/var/jenkins/workspace/adamantine-nightly' for the testing framework 'CTest-Version 3.x (default)'.
$ docker rm -f --volumes 2dd7f5a46e6db3c8c6dfc91c784cb6b3131809a9dcbbab034399de92c18bb14e
[Pipeline] // withDockerContainer
[Pipeline] }
[Pipeline] // withEnv
[Pipeline] }
[Pipeline] // node
[Pipeline] }
[Pipeline] // stage
[Pipeline] }
Failed in branch CPU
40: 50% completed
40: 60% completed
40: 70% completed
40: 80% completed
40: 90% completed
40: 100% completed
40: /var/jenkins/workspace/adamantine-nightly/tests/test_integration_thermoelastic.cc(19): Leaving test case "integration_thermoelastic"; testing time: 2803140468us
40: /var/jenkins/workspace/adamantine-nightly/tests/test_integration_thermoelastic.cc(47): Entering test case "integration_thermoelastic_add_material"
40: /var/jenkins/workspace/adamantine-nightly/tests/test_integration_thermoelastic.cc(19): Leaving test case "integration_thermoelastic"; testing time: 2803099678us
40: /var/jenkins/workspace/adamantine-nightly/tests/test_integration_thermoelastic.cc(47): Entering test case "integration_thermoelastic_add_material"
40: 10% completed
40: 20% completed
40: 30% completed
40: 40% completed
40: 50% completed
40: 60% completed
40: 70% completed
40: 80% completed
40: 90% completed
40: 100% completed
40: /var/jenkins/workspace/adamantine-nightly/tests/test_integration_thermoelastic.cc(47): Leaving test case "integration_thermoelastic_add_material"; testing time: 1430337900us
40: Leaving test module "Integration_Thermoelastic"; testing time: 4233441271us
40: /var/jenkins/workspace/adamantine-nightly/tests/test_integration_thermoelastic.cc(47): Leaving test case "integration_thermoelastic_add_material"; testing time: 1430337958us
40: Leaving test module "Integration_Thermoelastic"; testing time: 4233482061us
40: 
40: *** No errors detected
40: 
40: *** No errors detected
40: 
44/48 Test #40: test_integration_thermoelastic_2 .........   Passed  4242.38 sec
test 3
      Start  3: test_integration_da_3

3: Test command: /usr/bin/mpiexec "-n" "3" "/var/jenkins/workspace/adamantine-nightly/build/bin/test_integration_da"
3: Working Directory: /var/jenkins/workspace/adamantine-nightly/build/tests
3: Test timeout computed to be: 7200
3: Running 3 test cases...
3: Entering test module "Integration_Data_Assimilation"
3: /var/jenkins/workspace/adamantine-nightly/tests/test_integration_da.cc(78): Entering test case "integration_data_assimilation"
3: Running 3 test cases...
3: Entering test module "Integration_Data_Assimilation"
3: /var/jenkins/workspace/adamantine-nightly/tests/test_integration_da.cc(78): Entering test case "integration_data_assimilation"
3: Running 3 test cases...
3: Entering test module "Integration_Data_Assimilation"
3: /var/jenkins/workspace/adamantine-nightly/tests/test_integration_da.cc(78): Entering test case "integration_data_assimilation"
3: Reading the experimental log file...
3: Done. Log entries found for 1 camera(s), with 2 frame(s).
3: Starting the main time stepping loop...
3: 10% completed
3: 20% completed
3: 30% completed
3: 40% completed
3: Rank: 2 | Old parameters for member 2: 
3: Performing data assimilation at time 0.0211...
3: Rank: 0 | Old parameters for member 0: 
3: Rank: 1 | Old parameters for member 1: 
3: Rank: 2 | Number expt sites mapped to DOFs: 1
3: Rank: 0 | Number expt sites mapped to DOFs: 1
3: Rank: 1 | Number expt sites mapped to DOFs: 1
3: Getting the perturbed innovation...
3: Applying the Kalman gain...
3: Updating the ensemble members...
3: Done.
3: 50% completed
3: 60% completed
3: Performing data assimilation at time 0.0316...
3: Rank: 0 | Old parameters for member 0: 
3: Rank: 0 | Number expt sites mapped to DOFs: 1
3: Rank: 2 | Old parameters for member 2: 
3: Rank: 1 | Old parameters for member 1: 
3: Rank: 2 | Number expt sites mapped to DOFs: 1
3: Rank: 1 | Number expt sites mapped to DOFs: 1
3: Getting the perturbed innovation...
3: Applying the Kalman gain...
3: Updating the ensemble members...
3: Done.
3: 70% completed
3: 80% completed
3: 90% completed
3: 100% completed
3: Reading the experimental log file...
3: Done. Log entries found for 1 camera(s), with 2 frame(s).
3: Reading the experimental log file...
3: Done. Log entries found for 1 camera(s), with 2 frame(s).
3: Reading the experimental log file...
3: Done. Log entries found for 1 camera(s), with 2 frame(s).
3: Starting the main time stepping loop...
3: Starting the main time stepping loop...
3: Starting the main time stepping loop...
3: 10% completed
3: 10% completed
3: 10% completed
3: 20% completed
3: 20% completed
3: 20% completed
3: 30% completed
3: 30% completed
3: 30% completed
3: 40% completed
3: 40% completed
3: 40% completed
3: Performing data assimilation at time 0.0211...
3: Rank: 0 | Old parameters for member 0: 
3: Rank: 0 | Old parameters for member 1: 
3: Rank: 0 | Old parameters for member 2: 
3: Rank: 0 | Number expt sites mapped to DOFs: 1
3: Performing data assimilation at time 0.0211...
3: Rank: 0 | Old parameters for member 0: 
3: Rank: 0 | Old parameters for member 1: 
3: Rank: 0 | Old parameters for member 2: 
3: Rank: 0 | Number expt sites mapped to DOFs: 1
3: Performing data assimilation at time 0.0211...
3: Rank: 0 | Old parameters for member 0: 
3: Rank: 0 | Old parameters for member 1: 
3: Rank: 0 | Old parameters for member 2: 
3: Rank: 0 | Number expt sites mapped to DOFs: 1
3: Getting the perturbed innovation...
3: Applying the Kalman gain...
3: Getting the perturbed innovation...
3: Applying the Kalman gain...
3: Getting the perturbed innovation...
3: Applying the Kalman gain...
3: Updating the ensemble members...
3: Done.
3: Updating the ensemble members...
3: Done.
3: Updating the ensemble members...
3: Done.
3: 50% completed
3: 50% completed
3: 50% completed
3: 60% completed
3: 60% completed
3: 60% completed
3: Performing data assimilation at time 0.0316...
3: Rank: 0 | Old parameters for member 0: 
3: Rank: 0 | Old parameters for member 1: 
3: Rank: 0 | Old parameters for member 2: 
3: Rank: 0 | Number expt sites mapped to DOFs: 1
3: Performing data assimilation at time 0.0316...
3: Rank: 0 | Old parameters for member 0: 
3: Rank: 0 | Old parameters for member 1: 
3: Rank: 0 | Old parameters for member 2: 
3: Rank: 0 | Number expt sites mapped to DOFs: 1
3: Performing data assimilation at time 0.0316...
3: Rank: 0 | Old parameters for member 0: 
3: Rank: 0 | Old parameters for member 1: 
3: Rank: 0 | Old parameters for member 2: 
3: Rank: 0 | Number expt sites mapped to DOFs: 1
3: Getting the perturbed innovation...
3: Applying the Kalman gain...
3: Getting the perturbed innovation...
3: Applying the Kalman gain...
3: Getting the perturbed innovation...
3: Applying the Kalman gain...
3: Updating the ensemble members...
3: Done.
3: Updating the ensemble members...
3: Done.
3: Updating the ensemble members...
3: Done.
3: 70% completed
3: 70% completed
3: 70% completed
3: 80% completed
3: 80% completed
3: 80% completed
3: 90% completed
3: 90% completed
3: 90% completed
3: 100% completed
3: /var/jenkins/workspace/adamantine-nightly/tests/test_integration_da.cc(78): Leaving test case "integration_data_assimilation"; testing time: 62670925us
3: /var/jenkins/workspace/adamantine-nightly/tests/test_integration_da.cc(148): Entering test case "integration_3D_da_point_cloud_add_material"
3: 100% completed
3: /var/jenkins/workspace/adamantine-nightly/tests/test_integration_da.cc(78): Leaving test case "integration_data_assimilation"; testing time: 63137872us
3: /var/jenkins/workspace/adamantine-nightly/tests/test_integration_da.cc(148): Entering test case "integration_3D_da_point_cloud_add_material"
3: 100% completed
3: /var/jenkins/workspace/adamantine-nightly/tests/test_integration_da.cc(78): Leaving test case "integration_data_assimilation"; testing time: 63401470us
3: /var/jenkins/workspace/adamantine-nightly/tests/test_integration_da.cc(148): Entering test case "integration_3D_da_point_cloud_add_material"
3: Reading the experimental log file...
3: Done. Log entries found for 1 camera(s), with 1 frame(s).
3: Starting the main time stepping loop...
3: 10% completed
3: 20% completed
3: 30% completed
3: 40% completed
3: 50% completed
3: Rank: 1 | Old parameters for member 1: 
3: Rank: 2 | Old parameters for member 2: 
3: Rank: 1 | Number expt sites mapped to DOFs: 1
3: Rank: 2 | Number expt sites mapped to DOFs: 1
3: Performing data assimilation at time 0.12...
3: Rank: 0 | Old parameters for member 0: 
3: Rank: 0 | Number expt sites mapped to DOFs: 1
3: Getting the perturbed innovation...
3: Applying the Kalman gain...
3: Updating the ensemble members...
3: Done.
3: 60% completed
3: 70% completed
3: 80% completed
3: 90% completed
3: 100% completed
3: Reading the experimental log file...
3: Done. Log entries found for 1 camera(s), with 1 frame(s).
3: Reading the experimental log file...
3: Done. Log entries found for 1 camera(s), with 1 frame(s).
3: Reading the experimental log file...
3: Done. Log entries found for 1 camera(s), with 1 frame(s).
3: Starting the main time stepping loop...
3: Starting the main time stepping loop...
3: Starting the main time stepping loop...
3: 10% completed
3: 10% completed
3: 10% completed
3: 20% completed
3: 20% completed
3: 20% completed
3: 30% completed
3: 30% completed
3: 30% completed
3: 40% completed
3: 40% completed
3: 40% completed
3: 50% completed
3: 50% completed
3: 50% completed
3: Performing data assimilation at time 0.12...
3: Rank: 0 | Old parameters for member 0: 
3: Rank: 0 | Old parameters for member 1: 
3: Rank: 0 | Old parameters for member 2: 
3: Rank: 0 | Number expt sites mapped to DOFs: 1
3: Performing data assimilation at time 0.12...
3: Rank: 0 | Old parameters for member 0: 
3: Rank: 0 | Old parameters for member 1: 
3: Rank: 0 | Old parameters for member 2: 
3: Performing data assimilation at time 0.12...
3: Rank: 0 | Old parameters for member 0: 
3: Rank: 0 | Old parameters for member 1: 
3: Rank: 0 | Old parameters for member 2: 
3: Rank: 0 | Number expt sites mapped to DOFs: 1
3: Rank: 0 | Number expt sites mapped to DOFs: 1
3: Getting the perturbed innovation...
3: Applying the Kalman gain...
3: Getting the perturbed innovation...
3: Applying the Kalman gain...
3: Getting the perturbed innovation...
3: Applying the Kalman gain...
3: Updating the ensemble members...
3: Done.
3: 60% completed
3: Updating the ensemble members...
3: Done.
3: 60% completed
3: Updating the ensemble members...
3: Done.
3: 60% completed
3: 70% completed
3: 70% completed
3: 70% completed
3: 80% completed
3: 80% completed
3: 80% completed
3: 90% completed
3: 90% completed
3: 90% completed
3: 100% completed
3: 100% completed
3: 100% completed
3: /var/jenkins/workspace/adamantine-nightly/tests/test_integration_da.cc(148): Leaving test case "integration_3D_da_point_cloud_add_material"; testing time: 2608056us
3: /var/jenkins/workspace/adamantine-nightly/tests/test_integration_da.cc(231): Entering test case "integration_3D_da_ray_add_material"
3: /var/jenkins/workspace/adamantine-nightly/tests/test_integration_da.cc(148): Leaving test case "integration_3D_da_point_cloud_add_material"; testing time: 2353768us
3: /var/jenkins/workspace/adamantine-nightly/tests/test_integration_da.cc(231): Entering test case "integration_3D_da_ray_add_material"
3: /var/jenkins/workspace/adamantine-nightly/tests/test_integration_da.cc(148): Leaving test case "integration_3D_da_point_cloud_add_material"; testing time: 3086230us
3: /var/jenkins/workspace/adamantine-nightly/tests/test_integration_da.cc(231): Entering test case "integration_3D_da_ray_add_material"
3: Reading the experimental log file...
3: Done. Log entries found for 1 camera(s), with 1 frame(s).
3: Starting the main time stepping loop...
3: 10% completed
3: 20% completed
3: 30% completed
3: 40% completed
3: 50% completed
3: Rank: 2 | Old parameters for member 2: 
3: Performing data assimilation at time 0.12...
3: Rank: 0 | Old parameters for member 0: 
3: Rank: 1 | Old parameters for member 1: 
3: Rank: 1 | Number expt sites mapped to DOFs: 1
3: Rank: 0 | Number expt sites mapped to DOFs: 1
3: Rank: 2 | Number expt sites mapped to DOFs: 1
3: Getting the perturbed innovation...
3: Applying the Kalman gain...
3: Updating the ensemble members...
3: Done.
3: 60% completed
3: 70% completed
3: 80% completed
3: 90% completed
3: 100% completed
3: Reading the experimental log file...
3: Done. Log entries found for 1 camera(s), with 1 frame(s).
3: Reading the experimental log file...
3: Done. Log entries found for 1 camera(s), with 1 frame(s).
3: Reading the experimental log file...
3: Done. Log entries found for 1 camera(s), with 1 frame(s).
3: Starting the main time stepping loop...
3: Starting the main time stepping loop...
3: Starting the main time stepping loop...
3: 10% completed
3: 10% completed
3: 10% completed
3: 20% completed
3: 20% completed
3: 20% completed
3: 30% completed
3: 30% completed
3: 30% completed
3: 40% completed
3: 40% completed
3: 40% completed
3: 50% completed
3: 50% completed
3: 50% completed
3: Performing data assimilation at time 0.12...
3: Rank: 0 | Old parameters for member 0: 
3: Rank: 0 | Old parameters for member 1: 
3: Rank: 0 | Old parameters for member 2: 
3: Rank: 0 | Number expt sites mapped to DOFs: 1
3: Performing data assimilation at time 0.12...
3: Rank: 0 | Old parameters for member 0: 
3: Rank: 0 | Old parameters for member 1: 
3: Rank: 0 | Old parameters for member 2: 
3: Rank: 0 | Number expt sites mapped to DOFs: 1
3: Performing data assimilation at time 0.12...
3: Rank: 0 | Old parameters for member 0: 
3: Rank: 0 | Old parameters for member 1: 
3: Rank: 0 | Old parameters for member 2: 
3: Rank: 0 | Number expt sites mapped to DOFs: 1
3: Getting the perturbed innovation...
3: Applying the Kalman gain...
3: Getting the perturbed innovation...
3: Applying the Kalman gain...
3: Getting the perturbed innovation...
3: Applying the Kalman gain...
3: Updating the ensemble members...
3: Done.
3: 60% completed
3: Updating the ensemble members...
3: Done.
3: 60% completed
3: Updating the ensemble members...
3: Done.
3: 60% completed
3: 70% completed
3: 70% completed
3: 70% completed
3: 80% completed
3: 80% completed
3: 80% completed
3: 90% completed
3: 90% completed
3: 90% completed
3: 100% completed
3: 100% completed
3: 100% completed
3: 
3: *** No errors detected
3: /var/jenkins/workspace/adamantine-nightly/tests/test_integration_da.cc(231): Leaving test case "integration_3D_da_ray_add_material"; testing time: 2375547us
3: Leaving test module "Integration_Data_Assimilation"; testing time: 68132827us
3: /var/jenkins/workspace/adamantine-nightly/tests/test_integration_da.cc(231): Leaving test case "integration_3D_da_ray_add_material"; testing time: 2393138us
3: Leaving test module "Integration_Data_Assimilation"; testing time: 68139238us
3: 
3: *** No errors detected
3: /var/jenkins/workspace/adamantine-nightly/tests/test_integration_da.cc(231): Leaving test case "integration_3D_da_ray_add_material"; testing time: 2381807us
3: Leaving test module "Integration_Data_Assimilation"; testing time: 68137174us
3: 
3: *** No errors detected
3: 
45/48 Test  #3: test_integration_da_3 ....................   Passed   69.53 sec
test 4
      Start  4: test_integration_da_6

4: Test command: /usr/bin/mpiexec "-n" "6" "/var/jenkins/workspace/adamantine-nightly/build/bin/test_integration_da"
4: Working Directory: /var/jenkins/workspace/adamantine-nightly/build/tests
4: Test timeout computed to be: 7200
4: Running 3 test cases...
4: Entering test module "Integration_Data_Assimilation"
4: /var/jenkins/workspace/adamantine-nightly/tests/test_integration_da.cc(78): Entering test case "integration_data_assimilation"
4: Running 3 test cases...
4: Entering test module "Integration_Data_Assimilation"
4: /var/jenkins/workspace/adamantine-nightly/tests/test_integration_da.cc(78): Entering test case "integration_data_assimilation"
4: Running 3 test cases...
4: Entering test module "Integration_Data_Assimilation"
4: /var/jenkins/workspace/adamantine-nightly/tests/test_integration_da.cc(78): Entering test case "integration_data_assimilation"
4: Running 3 test cases...
4: Entering test module "Integration_Data_Assimilation"
4: /var/jenkins/workspace/adamantine-nightly/tests/test_integration_da.cc(78): Entering test case "integration_data_assimilation"
4: Running 3 test cases...
4: Entering test module "Integration_Data_Assimilation"
4: /var/jenkins/workspace/adamantine-nightly/tests/test_integration_da.cc(78): Entering test case "integration_data_assimilation"
4: Running 3 test cases...
4: Entering test module "Integration_Data_Assimilation"
4: /var/jenkins/workspace/adamantine-nightly/tests/test_integration_da.cc(78): Entering test case "integration_data_assimilation"
4: Reading the experimental log file...
4: Done. Log entries found for 1 camera(s), with 2 frame(s).
4: Starting the main time stepping loop...
4: 10% completed
4: 20% completed
4: 30% completed
4: 40% completed
4: Performing data assimilation at time 0.0211...
4: Rank: 0 | Old parameters for member 0: 
4: Rank: 1 | Old parameters for member 0: 
4: Rank: 3 | Old parameters for member 1: 
4: Rank: 2 | Old parameters for member 1: 
4: Rank: 5 | Old parameters for member 2: 
4: Rank: 4 | Old parameters for member 2: 
4: Rank: 0 | Number expt sites mapped to DOFs: 1
4: Rank: 1 | Number expt sites mapped to DOFs: 1
4: Rank: 4 | Number expt sites mapped to DOFs: 1
4: Rank: 5 | Number expt sites mapped to DOFs: 1
4: Rank: 2 | Number expt sites mapped to DOFs: 1
4: Rank: 3 | Number expt sites mapped to DOFs: 1
4: Getting the perturbed innovation...
4: Applying the Kalman gain...
4: Updating the ensemble members...
4: Done.
4: 50% completed
4: 60% completed
4: Performing data assimilation at time 0.0316...
4: Rank: 0 | Old parameters for member 0: 
4: Rank: 1 | Old parameters for member 0: 
4: Rank: 3 | Old parameters for member 1: 
4: Rank: 2 | Old parameters for member 1: 
4: Rank: 0 | Number expt sites mapped to DOFs: 1
4: Rank: 1 | Number expt sites mapped to DOFs: 1
4: Rank: 2 | Number expt sites mapped to DOFs: 1
4: Rank: 3 | Number expt sites mapped to DOFs: 1
4: Rank: 4 | Old parameters for member 2: 
4: Rank: 5 | Old parameters for member 2: 
4: Rank: 4 | Number expt sites mapped to DOFs: 1
4: Rank: 5 | Number expt sites mapped to DOFs: 1
4: Getting the perturbed innovation...
4: Applying the Kalman gain...
4: Updating the ensemble members...
4: Done.
4: 70% completed
4: 80% completed
4: 90% completed
4: 100% completed
4: Reading the experimental log file...
4: Done. Log entries found for 1 camera(s), with 2 frame(s).
4: Reading the experimental log file...
4: Done. Log entries found for 1 camera(s), with 2 frame(s).
4: Reading the experimental log file...
4: Done. Log entries found for 1 camera(s), with 2 frame(s).
4: Reading the experimental log file...
4: Done. Log entries found for 1 camera(s), with 2 frame(s).
4: Reading the experimental log file...
4: Done. Log entries found for 1 camera(s), with 2 frame(s).
4: Reading the experimental log file...
4: Done. Log entries found for 1 camera(s), with 2 frame(s).
4: Starting the main time stepping loop...
4: Starting the main time stepping loop...
4: Starting the main time stepping loop...
4: Starting the main time stepping loop...
4: Starting the main time stepping loop...
4: Starting the main time stepping loop...
4: 10% completed
4: 10% completed
4: 10% completed
4: 10% completed
4: 10% completed
4: 10% completed
4: 20% completed
4: 20% completed
4: 20% completed
4: 20% completed
4: 20% completed
4: 20% completed
4: 30% completed
4: 30% completed
4: 30% completed
4: 30% completed
4: 30% completed
4: 30% completed
4: 40% completed
4: 40% completed
4: 40% completed
4: 40% completed
4: 40% completed
4: 40% completed
4: Performing data assimilation at time 0.0211...
4: Rank: 0 | Old parameters for member 0: 
4: Rank: 0 | Old parameters for member 1: 
4: Rank: 0 | Old parameters for member 2: 
4: Performing data assimilation at time 0.0211...
4: Rank: 0 | Old parameters for member 0: 
4: Rank: 0 | Old parameters for member 1: 
4: Rank: 0 | Old parameters for member 2: 
4: Rank: 0 | Number expt sites mapped to DOFs: 1
4: Rank: 0 | Number expt sites mapped to DOFs: 1
4: Performing data assimilation at time 0.0211...
4: Rank: 0 | Old parameters for member 0: 
4: Rank: 0 | Old parameters for member 1: 
4: Rank: 0 | Old parameters for member 2: 
4: Performing data assimilation at time 0.0211...
4: Rank: 0 | Old parameters for member 0: 
4: Rank: 0 | Old parameters for member 1: 
4: Rank: 0 | Old parameters for member 2: 
4: Rank: 0 | Number expt sites mapped to DOFs: 1
4: Rank: 0 | Number expt sites mapped to DOFs: 1
4: Performing data assimilation at time 0.0211...
4: Rank: 0 | Old parameters for member 0: 
4: Rank: 0 | Old parameters for member 1: 
4: Rank: 0 | Old parameters for member 2: 
4: Rank: 0 | Number expt sites mapped to DOFs: 1
4: Performing data assimilation at time 0.0211...
4: Rank: 0 | Old parameters for member 0: 
4: Rank: 0 | Old parameters for member 1: 
4: Rank: 0 | Old parameters for member 2: 
4: Rank: 0 | Number expt sites mapped to DOFs: 1
4: Getting the perturbed innovation...
4: Applying the Kalman gain...
4: Getting the perturbed innovation...
4: Applying the Kalman gain...
4: Getting the perturbed innovation...
4: Applying the Kalman gain...
4: Getting the perturbed innovation...
4: Applying the Kalman gain...
4: Getting the perturbed innovation...
4: Applying the Kalman gain...
4: Getting the perturbed innovation...
4: Applying the Kalman gain...
4: Updating the ensemble members...
4: Done.
4: Updating the ensemble members...
4: Done.
4: Updating the ensemble members...
4: Done.
4: Updating the ensemble members...
4: Done.
4: Updating the ensemble members...
4: Done.
4: Updating the ensemble members...
4: Done.
4: 50% completed
4: 50% completed
4: 50% completed
4: 50% completed
4: 50% completed
4: 50% completed
4: 60% completed
4: 60% completed
4: 60% completed
4: 60% completed
4: 60% completed
4: 60% completed
4: Performing data assimilation at time 0.0316...
4: Rank: 0 | Old parameters for member 0: 
4: Rank: 0 | Old parameters for member 1: 
4: Rank: 0 | Old parameters for member 2: 
4: Rank: 0 | Number expt sites mapped to DOFs: 1
4: Performing data assimilation at time 0.0316...
4: Rank: 0 | Old parameters for member 0: 
4: Rank: 0 | Old parameters for member 1: 
4: Rank: 0 | Old parameters for member 2: 
4: Rank: 0 | Number expt sites mapped to DOFs: 1
4: Performing data assimilation at time 0.0316...
4: Rank: 0 | Old parameters for member 0: 
4: Rank: 0 | Old parameters for member 1: 
4: Rank: 0 | Old parameters for member 2: 
4: Rank: 0 | Number expt sites mapped to DOFs: 1
4: Performing data assimilation at time 0.0316...
4: Rank: 0 | Old parameters for member 0: 
4: Rank: 0 | Old parameters for member 1: 
4: Rank: 0 | Old parameters for member 2: 
4: Rank: 0 | Number expt sites mapped to DOFs: 1
4: Performing data assimilation at time 0.0316...
4: Rank: 0 | Old parameters for member 0: 
4: Rank: 0 | Old parameters for member 1: 
4: Rank: 0 | Old parameters for member 2: 
4: Rank: 0 | Number expt sites mapped to DOFs: 1
4: Performing data assimilation at time 0.0316...
4: Rank: 0 | Old parameters for member 0: 
4: Rank: 0 | Old parameters for member 1: 
4: Rank: 0 | Old parameters for member 2: 
4: Rank: 0 | Number expt sites mapped to DOFs: 1
4: Getting the perturbed innovation...
4: Applying the Kalman gain...
4: Getting the perturbed innovation...
4: Applying the Kalman gain...
4: Getting the perturbed innovation...
4: Applying the Kalman gain...
4: Getting the perturbed innovation...
4: Applying the Kalman gain...
4: Getting the perturbed innovation...
4: Applying the Kalman gain...
4: Getting the perturbed innovation...
4: Applying the Kalman gain...
4: Updating the ensemble members...
4: Updating the ensemble members...
4: Done.
4: Done.
4: Updating the ensemble members...
4: Done.
4: Updating the ensemble members...
4: Done.
4: Updating the ensemble members...
4: Done.
4: Updating the ensemble members...
4: Done.
4: 70% completed
4: 70% completed
4: 70% completed
4: 70% completed
4: 70% completed
4: 70% completed
4: 80% completed
4: 80% completed
4: 80% completed
4: 80% completed
4: 80% completed
4: 80% completed
4: 90% completed
4: 90% completed
4: 90% completed
4: 90% completed
4: 90% completed
4: 90% completed
4: 100% completed
4: 100% completed
4: /var/jenkins/workspace/adamantine-nightly/tests/test_integration_da.cc(78): Leaving test case "integration_data_assimilation"; testing time: 57702693us
4: /var/jenkins/workspace/adamantine-nightly/tests/test_integration_da.cc(148): Entering test case "integration_3D_da_point_cloud_add_material"
4: /var/jenkins/workspace/adamantine-nightly/tests/test_integration_da.cc(78): Leaving test case "integration_data_assimilation"; testing time: 57711560us
4: /var/jenkins/workspace/adamantine-nightly/tests/test_integration_da.cc(148): Entering test case "integration_3D_da_point_cloud_add_material"
4: 100% completed
4: 100% completed
4: 100% completed
4: /var/jenkins/workspace/adamantine-nightly/tests/test_integration_da.cc(78): Leaving test case "integration_data_assimilation"; testing time: 57989344us
4: /var/jenkins/workspace/adamantine-nightly/tests/test_integration_da.cc(148): Entering test case "integration_3D_da_point_cloud_add_material"
4: /var/jenkins/workspace/adamantine-nightly/tests/test_integration_da.cc(78): Leaving test case "integration_data_assimilation"; testing time: 58040964us
4: /var/jenkins/workspace/adamantine-nightly/tests/test_integration_da.cc(148): Entering test case "integration_3D_da_point_cloud_add_material"
4: 100% completed
4: /var/jenkins/workspace/adamantine-nightly/tests/test_integration_da.cc(78): Leaving test case "integration_data_assimilation"; testing time: 58291132us
4: /var/jenkins/workspace/adamantine-nightly/tests/test_integration_da.cc(148): Entering test case "integration_3D_da_point_cloud_add_material"
4: /var/jenkins/workspace/adamantine-nightly/tests/test_integration_da.cc(78): Leaving test case "integration_data_assimilation"; testing time: 58518812us
4: /var/jenkins/workspace/adamantine-nightly/tests/test_integration_da.cc(148): Entering test case "integration_3D_da_point_cloud_add_material"
4: Reading the experimental log file...
4: Done. Log entries found for 1 camera(s), with 1 frame(s).
4: Starting the main time stepping loop...
4: 10% completed
4: 20% completed
4: 30% completed
4: 40% completed
4: 50% completed
4: Rank: 4 | Old parameters for member 2: 
4: Rank: 5 | Old parameters for member 2: 
4: Performing data assimilation at time 0.12...
4: Rank: 0 | Old parameters for member 0: 
4: Rank: 1 | Old parameters for member 0: 
4: Rank: 2 | Old parameters for member 1: 
4: Rank: 4 | Number expt sites mapped to DOFs: 1
4: Rank: 3 | Old parameters for member 1: 
4: Rank: 5 | Number expt sites mapped to DOFs: 1
4: Rank: 1 | Number expt sites mapped to DOFs: 1
4: Rank: 0 | Number expt sites mapped to DOFs: 1
4: Rank: 3 | Number expt sites mapped to DOFs: 1
4: Rank: 2 | Number expt sites mapped to DOFs: 1
4: Getting the perturbed innovation...
4: Applying the Kalman gain...
4: Updating the ensemble members...
4: Done.
4: 60% completed
4: 70% completed
4: 80% completed
4: 90% completed
4: 100% completed
4: Reading the experimental log file...
4: Done. Log entries found for 1 camera(s), with 1 frame(s).
4: Reading the experimental log file...
4: Done. Log entries found for 1 camera(s), with 1 frame(s).
4: Reading the experimental log file...
4: Done. Log entries found for 1 camera(s), with 1 frame(s).
4: Reading the experimental log file...
4: Done. Log entries found for 1 camera(s), with 1 frame(s).
4: Reading the experimental log file...
4: Done. Log entries found for 1 camera(s), with 1 frame(s).
4: Reading the experimental log file...
4: Done. Log entries found for 1 camera(s), with 1 frame(s).
4: Starting the main time stepping loop...
4: Starting the main time stepping loop...
4: Starting the main time stepping loop...
4: Starting the main time stepping loop...
4: Starting the main time stepping loop...
4: Starting the main time stepping loop...
4: 10% completed
4: 10% completed
4: 10% completed
4: 10% completed
4: 10% completed
4: 20% completed
4: 10% completed
4: 20% completed
4: 20% completed
4: 20% completed
4: 20% completed
4: 30% completed
4: 30% completed
4: 20% completed
4: 30% completed
4: 40% completed
4: 30% completed
4: 30% completed
4: 30% completed
4: 40% completed
4: 40% completed
4: 50% completed
4: 40% completed
4: 40% completed
4: 40% completed
4: 50% completed
4: 50% completed
4: Performing data assimilation at time 0.12...
4: Rank: 0 | Old parameters for member 0: 
4: Rank: 0 | Old parameters for member 1: 
4: Rank: 0 | Old parameters for member 2: 
4: Rank: 0 | Number expt sites mapped to DOFs: 1
4: Performing data assimilation at time 0.12...
4: Rank: 0 | Old parameters for member 0: 
4: Rank: 0 | Old parameters for member 1: 
4: Rank: 0 | Old parameters for member 2: 
4: Rank: 0 | Number expt sites mapped to DOFs: 1
4: 50% completed
4: 50% completed
4: 50% completed
4: Performing data assimilation at time 0.12...
4: Rank: 0 | Old parameters for member 0: 
4: Rank: 0 | Old parameters for member 1: 
4: Rank: 0 | Old parameters for member 2: 
4: Rank: 0 | Number expt sites mapped to DOFs: 1
4: Performing data assimilation at time 0.12...
4: Rank: 0 | Old parameters for member 0: 
4: Rank: 0 | Old parameters for member 1: 
4: Rank: 0 | Old parameters for member 2: 
4: Performing data assimilation at time 0.12...
4: Rank: 0 | Old parameters for member 0: 
4: Rank: 0 | Old parameters for member 1: 
4: Rank: 0 | Old parameters for member 2: 
4: Performing data assimilation at time 0.12...
4: Rank: 0 | Old parameters for member 0: 
4: Rank: 0 | Old parameters for member 1: 
4: Rank: 0 | Old parameters for member 2: 
4: Rank: 0 | Number expt sites mapped to DOFs: 1
4: Rank: 0 | Number expt sites mapped to DOFs: 1
4: Rank: 0 | Number expt sites mapped to DOFs: 1
4: Getting the perturbed innovation...
4: Applying the Kalman gain...
4: Getting the perturbed innovation...
4: Applying the Kalman gain...
4: Getting the perturbed innovation...
4: Applying the Kalman gain...
4: Getting the perturbed innovation...
4: Applying the Kalman gain...
4: Getting the perturbed innovation...
4: Applying the Kalman gain...
4: Getting the perturbed innovation...
4: Applying the Kalman gain...
4: Updating the ensemble members...
4: Done.
4: 60% completed
4: Updating the ensemble members...
4: Done.
4: 60% completed
4: 70% completed
4: Updating the ensemble members...
4: Done.
4: 60% completed
4: 70% completed
4: Updating the ensemble members...
4: Updating the ensemble members...
4: Done.
4: 60% completed
4: Done.
4: 60% completed
4: Updating the ensemble members...
4: Done.
4: 60% completed
4: 80% completed
4: 70% completed
4: 80% completed
4: 70% completed
4: 70% completed
4: 70% completed
4: 90% completed
4: 80% completed
4: 90% completed
4: 80% completed
4: 80% completed
4: 80% completed
4: 90% completed
4: 90% completed
4: 90% completed
4: 90% completed
4: 100% completed
4: 100% completed
4: 100% completed
4: /var/jenkins/workspace/adamantine-nightly/tests/test_integration_da.cc(148): Leaving test case "integration_3D_da_point_cloud_add_material"; testing time: 3063983us
4: /var/jenkins/workspace/adamantine-nightly/tests/test_integration_da.cc(231): Entering test case "integration_3D_da_ray_add_material"
4: /var/jenkins/workspace/adamantine-nightly/tests/test_integration_da.cc(148): Leaving test case "integration_3D_da_point_cloud_add_material"; testing time: 2805964us
4: /var/jenkins/workspace/adamantine-nightly/tests/test_integration_da.cc(231): Entering test case "integration_3D_da_ray_add_material"
4: 100% completed
4: 100% completed
4: /var/jenkins/workspace/adamantine-nightly/tests/test_integration_da.cc(148): Leaving test case "integration_3D_da_point_cloud_add_material"; testing time: 2786027us
4: /var/jenkins/workspace/adamantine-nightly/tests/test_integration_da.cc(231): Entering test case "integration_3D_da_ray_add_material"
4: 100% completed
4: /var/jenkins/workspace/adamantine-nightly/tests/test_integration_da.cc(148): Leaving test case "integration_3D_da_point_cloud_add_material"; testing time: 2561521us
4: /var/jenkins/workspace/adamantine-nightly/tests/test_integration_da.cc(231): Entering test case "integration_3D_da_ray_add_material"
4: /var/jenkins/workspace/adamantine-nightly/tests/test_integration_da.cc(148): Leaving test case "integration_3D_da_point_cloud_add_material"; testing time: 2337521us
4: /var/jenkins/workspace/adamantine-nightly/tests/test_integration_da.cc(231): Entering test case "integration_3D_da_ray_add_material"
4: /var/jenkins/workspace/adamantine-nightly/tests/test_integration_da.cc(148): Leaving test case "integration_3D_da_point_cloud_add_material"; testing time: 3151102us
4: /var/jenkins/workspace/adamantine-nightly/tests/test_integration_da.cc(231): Entering test case "integration_3D_da_ray_add_material"
4: Reading the experimental log file...
4: Done. Log entries found for 1 camera(s), with 1 frame(s).
4: Starting the main time stepping loop...
4: 10% completed
4: 20% completed
4: 30% completed
4: 40% completed
4: 50% completed
4: Rank: 5 | Old parameters for member 2: 
4: Rank: 4 | Old parameters for member 2: 
4: Rank: 3 | Old parameters for member 1: 
4: Rank: 2 | Old parameters for member 1: 
4: Rank: 1 | Old parameters for member 0: 
4: Performing data assimilation at time 0.12...
4: Rank: 0 | Old parameters for member 0: 
4: Rank: 4 | Number expt sites mapped to DOFs: 1
4: Rank: 5 | Number expt sites mapped to DOFs: 1
4: Rank: 2 | Number expt sites mapped to DOFs: 1
4: Rank: 3 | Number expt sites mapped to DOFs: 1
4: Rank: 1 | Number expt sites mapped to DOFs: 1
4: Rank: 0 | Number expt sites mapped to DOFs: 1
4: Getting the perturbed innovation...
4: Applying the Kalman gain...
4: Updating the ensemble members...
4: Done.
4: 60% completed
4: 70% completed
4: 80% completed
4: 90% completed
4: 100% completed
4: Reading the experimental log file...
4: Done. Log entries found for 1 camera(s), with 1 frame(s).
4: Reading the experimental log file...
4: Done. Log entries found for 1 camera(s), with 1 frame(s).
4: Reading the experimental log file...
4: Done. Log entries found for 1 camera(s), with 1 frame(s).
4: Reading the experimental log file...
4: Done. Log entries found for 1 camera(s), with 1 frame(s).
4: Reading the experimental log file...
4: Done. Log entries found for 1 camera(s), with 1 frame(s).
4: Starting the main time stepping loop...
4: Reading the experimental log file...
4: Done. Log entries found for 1 camera(s), with 1 frame(s).
4: Starting the main time stepping loop...
4: Starting the main time stepping loop...
4: Starting the main time stepping loop...
4: Starting the main time stepping loop...
4: Starting the main time stepping loop...
4: 10% completed
4: 10% completed
4: 10% completed
4: 10% completed
4: 10% completed
4: 20% completed
4: 10% completed
4: 30% completed
4: 20% completed
4: 20% completed
4: 20% completed
4: 20% completed
4: 20% completed
4: 40% completed
4: 30% completed
4: 30% completed
4: 30% completed
4: 30% completed
4: 30% completed
4: 50% completed
4: Performing data assimilation at time 0.12...
4: Rank: 0 | Old parameters for member 0: 
4: Rank: 0 | Old parameters for member 1: 
4: Rank: 0 | Old parameters for member 2: 
4: 40% completed
4: 40% completed
4: 40% completed
4: 40% completed
4: 40% completed
4: Rank: 0 | Number expt sites mapped to DOFs: 1
4: 50% completed
4: 50% completed
4: 50% completed
4: 50% completed
4: 50% completed
4: Performing data assimilation at time 0.12...
4: Rank: 0 | Old parameters for member 0: 
4: Rank: 0 | Old parameters for member 1: 
4: Rank: 0 | Old parameters for member 2: 
4: Rank: 0 | Number expt sites mapped to DOFs: 1
4: Performing data assimilation at time 0.12...
4: Rank: 0 | Old parameters for member 0: 
4: Rank: 0 | Old parameters for member 1: 
4: Rank: 0 | Old parameters for member 2: 
4: Performing data assimilation at time 0.12...
4: Rank: 0 | Old parameters for member 0: 
4: Rank: 0 | Old parameters for member 1: 
4: Rank: 0 | Old parameters for member 2: 
4: Performing data assimilation at time 0.12...
4: Rank: 0 | Old parameters for member 0: 
4: Rank: 0 | Old parameters for member 1: 
4: Rank: 0 | Old parameters for member 2: 
4: Performing data assimilation at time 0.12...
4: Rank: 0 | Old parameters for member 0: 
4: Rank: 0 | Old parameters for member 1: 
4: Rank: 0 | Old parameters for member 2: 
4: Rank: 0 | Number expt sites mapped to DOFs: 1
4: Rank: 0 | Number expt sites mapped to DOFs: 1
4: Rank: 0 | Number expt sites mapped to DOFs: 1
4: Rank: 0 | Number expt sites mapped to DOFs: 1
4: Getting the perturbed innovation...
4: Applying the Kalman gain...
4: Getting the perturbed innovation...
4: Applying the Kalman gain...
4: Getting the perturbed innovation...
4: Applying the Kalman gain...
4: Getting the perturbed innovation...
4: Applying the Kalman gain...
4: Getting the perturbed innovation...
4: Applying the Kalman gain...
4: Getting the perturbed innovation...
4: Applying the Kalman gain...
4: Updating the ensemble members...
4: Done.
4: 60% completed
4: 70% completed
4: 80% completed
4: Updating the ensemble members...
4: Done.
4: 60% completed
4: Updating the ensemble members...
4: Done.
4: 60% completed
4: Updating the ensemble members...
4: Updating the ensemble members...
4: Done.
4: 60% completed
4: Updating the ensemble members...
4: Done.
4: 60% completed
4: Done.
4: 60% completed
4: 90% completed
4: 70% completed
4: 70% completed
4: 70% completed
4: 70% completed
4: 70% completed
4: 80% completed
4: 80% completed
4: 80% completed
4: 80% completed
4: 80% completed
4: 90% completed
4: 90% completed
4: 90% completed
4: 90% completed
4: 90% completed
4: 100% completed
4: 
4: *** No errors detected
4: /var/jenkins/workspace/adamantine-nightly/tests/test_integration_da.cc(231): Leaving test case "integration_3D_da_ray_add_material"; testing time: 2431432us
4: Leaving test module "Integration_Data_Assimilation"; testing time: 63226869us
4: 100% completed
4: 100% completed
4: 100% completed
4: /var/jenkins/workspace/adamantine-nightly/tests/test_integration_da.cc(231): Leaving test case "integration_3D_da_ray_add_material"; testing time: 2514307us
4: Leaving test module "Integration_Data_Assimilation"; testing time: 63281119us
4: 
4: *** No errors detected
4: 100% completed
4: 100% completed
4: 
4: *** No errors detected
4: /var/jenkins/workspace/adamantine-nightly/tests/test_integration_da.cc(231): Leaving test case "integration_3D_da_ray_add_material"; testing time: 2467252us
4: Leaving test module "Integration_Data_Assimilation"; testing time: 63320063us
4: /var/jenkins/workspace/adamantine-nightly/tests/test_integration_da.cc(231): Leaving test case "integration_3D_da_ray_add_material"; testing time: 2510067us
4: Leaving test module "Integration_Data_Assimilation"; testing time: 63337186us
4: 
4: *** No errors detected
4: /var/jenkins/workspace/adamantine-nightly/tests/test_integration_da.cc(231): Leaving test case "integration_3D_da_ray_add_material"; testing time: 2481883us
4: Leaving test module "Integration_Data_Assimilation"; testing time: 63338356us
4: 
4: *** No errors detected
4: 
4: *** No errors detected
4: /var/jenkins/workspace/adamantine-nightly/tests/test_integration_da.cc(231): Leaving test case "integration_3D_da_ray_add_material"; testing time: 2489909us
4: Leaving test module "Integration_Data_Assimilation"; testing time: 63352707us
4: 
46/48 Test  #4: test_integration_da_6 ....................   Passed   65.26 sec
test 7
      Start  7: test_closest_source_point_adaptation_3

7: Test command: /usr/bin/mpiexec "-n" "3" "/var/jenkins/workspace/adamantine-nightly/build/bin/test_closest_source_point_adaptation"
7: Working Directory: /var/jenkins/workspace/adamantine-nightly/build/tests
7: Test timeout computed to be: 7200
7: Running 1 test case...
7: Entering test module "ClosestSourcePointAdaptation"
7: /var/jenkins/workspace/adamantine-nightly/tests/test_closest_source_point_adaptation.cc(123): Entering test case "closest_source_point_adaptation"
7: Running 1 test case...
7: Entering test module "ClosestSourcePointAdaptation"
7: /var/jenkins/workspace/adamantine-nightly/tests/test_closest_source_point_adaptation.cc(123): Entering test case "closest_source_point_adaptation"
7: Running 1 test case...
7: Entering test module "ClosestSourcePointAdaptation"
7: /var/jenkins/workspace/adamantine-nightly/tests/test_closest_source_point_adaptation.cc(123): Entering test case "closest_source_point_adaptation"
7: /var/jenkins/workspace/adamantine-nightly/tests/test_closest_source_point_adaptation.cc(123): Leaving test case "closest_source_point_adaptation"; testing time: 6898388us
7: Leaving test module "ClosestSourcePointAdaptation"; testing time: 6898439us
7: 
7: *** No errors detected
7: /var/jenkins/workspace/adamantine-nightly/tests/test_closest_source_point_adaptation.cc(123): Leaving test case "closest_source_point_adaptation"; testing time: 6895508us
7: Leaving test module "ClosestSourcePointAdaptation"; testing time: 6895554us
7: 
7: *** No errors detected
7: /var/jenkins/workspace/adamantine-nightly/tests/test_closest_source_point_adaptation.cc(123): Leaving test case "closest_source_point_adaptation"; testing time: 6892858us
7: Leaving test module "ClosestSourcePointAdaptation"; testing time: 6892917us
7: 
7: *** No errors detected
7: 
47/48 Test  #7: test_closest_source_point_adaptation_3 ...   Passed    8.22 sec
test 8
      Start  8: test_closest_source_point_adaptation_6

8: Test command: /usr/bin/mpiexec "-n" "6" "/var/jenkins/workspace/adamantine-nightly/build/bin/test_closest_source_point_adaptation"
8: Working Directory: /var/jenkins/workspace/adamantine-nightly/build/tests
8: Test timeout computed to be: 7200
8: Running 1 test case...
8: Entering test module "ClosestSourcePointAdaptation"
8: /var/jenkins/workspace/adamantine-nightly/tests/test_closest_source_point_adaptation.cc(123): Entering test case "closest_source_point_adaptation"
8: Running 1 test case...
8: Entering test module "ClosestSourcePointAdaptation"
8: /var/jenkins/workspace/adamantine-nightly/tests/test_closest_source_point_adaptation.cc(123): Entering test case "closest_source_point_adaptation"
8: Running 1 test case...
8: Entering test module "ClosestSourcePointAdaptation"
8: /var/jenkins/workspace/adamantine-nightly/tests/test_closest_source_point_adaptation.cc(123): Entering test case "closest_source_point_adaptation"
8: Running 1 test case...
8: Entering test module "ClosestSourcePointAdaptation"
8: /var/jenkins/workspace/adamantine-nightly/tests/test_closest_source_point_adaptation.cc(123): Entering test case "closest_source_point_adaptation"
8: Running 1 test case...
8: Entering test module "ClosestSourcePointAdaptation"
8: /var/jenkins/workspace/adamantine-nightly/tests/test_closest_source_point_adaptation.cc(123): Entering test case "closest_source_point_adaptation"
8: Running 1 test case...
8: Entering test module "ClosestSourcePointAdaptation"
8: /var/jenkins/workspace/adamantine-nightly/tests/test_closest_source_point_adaptation.cc(123): Entering test case "closest_source_point_adaptation"
8: 
8: *** No errors detected
8: 
8: *** No errors detected
8: /var/jenkins/workspace/adamantine-nightly/tests/test_closest_source_point_adaptation.cc(123): Leaving test case "closest_source_point_adaptation"; testing time: 4365726us
8: Leaving test module "ClosestSourcePointAdaptation"; testing time: 4365778us
8: /var/jenkins/workspace/adamantine-nightly/tests/test_closest_source_point_adaptation.cc(123): Leaving test case "closest_source_point_adaptation"; testing time: 4363438us
8: Leaving test module "ClosestSourcePointAdaptation"; testing time: 4363489us
8: /var/jenkins/workspace/adamantine-nightly/tests/test_closest_source_point_adaptation.cc(123): Leaving test case "closest_source_point_adaptation"; testing time: 4378706us
8: Leaving test module "ClosestSourcePointAdaptation"; testing time: 4378773us
8: 
8: *** No errors detected
8: /var/jenkins/workspace/adamantine-nightly/tests/test_closest_source_point_adaptation.cc(123): Leaving test case "closest_source_point_adaptation"; testing time: 4388775us
8: Leaving test module "ClosestSourcePointAdaptation"; testing time: 4388829us
8: 
8: *** No errors detected
8: /var/jenkins/workspace/adamantine-nightly/tests/test_closest_source_point_adaptation.cc(123): Leaving test case "closest_source_point_adaptation"; testing time: 4382845us
8: Leaving test module "ClosestSourcePointAdaptation"; testing time: 4382900us
8: 
8: *** No errors detected
8: /var/jenkins/workspace/adamantine-nightly/tests/test_closest_source_point_adaptation.cc(123): Leaving test case "closest_source_point_adaptation"; testing time: 4369163us
8: Leaving test module "ClosestSourcePointAdaptation"; testing time: 4369224us
8: 
8: *** No errors detected
8: 
48/48 Test  #8: test_closest_source_point_adaptation_6 ...   Passed    6.32 sec

The following tests passed:
	test_closest_source_point_adaptation_1
	test_data_assimilator_1
	test_experimental_data_1
	test_geometry_1
	test_heat_source_1
	test_integration_da_2
	test_closest_source_point_adaptation_2
	test_material_property_device_1
	test_material_property_1
	test_integration_da_1
	test_post_processor_1
	test_quaternion_1
	test_scan_path_1
	test_mechanical_operator_1
	test_thermal_operator_1
	test_thermal_operator_device_1
	test_timer_1
	test_utils_1
	test_validate_input_database_1
	test_integration_2d_1
	test_integration_2d_device_1
	test_mechanical_physics_1
	test_thermal_physics_device_1
	test_integration_3d_amr_device_1
	test_integration_3d_amr_1
	test_integration_da_augmented_1
	test_material_deposition_1
	test_microstructure_1
	test_thermal_physics_1
	test_ensemble_management_1
	test_integration_3d_device_1
	test_integration_2d_2
	test_integration_2d_device_2
	test_integration_3d_amr_2
	test_integration_3d_amr_device_2
	test_integration_da_augmented_2
	test_material_deposition_2
	test_microstructure_2
	test_thermal_physics_2
	test_ensemble_management_2
	test_integration_thermoelastic_2
	test_integration_da_3
	test_integration_da_6
	test_closest_source_point_adaptation_3
	test_closest_source_point_adaptation_6

94% tests passed, 3 tests failed out of 48

Total Test time (real) = 13010.20 sec

The following tests FAILED:
	 31 - test_integration_3d_1 (Timeout)
	 32 - test_integration_3d_2 (Timeout)
	 39 - test_integration_thermoelastic_1 (Timeout)
Errors while running CTest
Output from these tests are in: /var/jenkins/workspace/adamantine-nightly/build/Testing/Temporary/LastTest.log
Use "--rerun-failed --output-on-failure" to re-run the failed cases verbosely.
[Pipeline] }
[Pipeline] // dir
Post stage
[Pipeline] xunit
INFO: Processing CTest-Version 3.x (default)
[Pipeline] }
[Pipeline] // withEnv
[Pipeline] }
$ docker stop --time=1 c7a1041193c3e81387b9de7953ab1b6925ed9918538e420a84265f7031d60958
INFO: [CTest-Version 3.x (default)] - 1 test report file(s) were found with the pattern 'build/Testing/**/Test.xml' relative to '/var/jenkins/workspace/adamantine-nightly' for the testing framework 'CTest-Version 3.x (default)'.
$ docker rm -f --volumes c7a1041193c3e81387b9de7953ab1b6925ed9918538e420a84265f7031d60958
[Pipeline] // withDockerContainer
[Pipeline] }
[Pipeline] // withEnv
[Pipeline] }
[Pipeline] // node
[Pipeline] }
[Pipeline] // stage
[Pipeline] }
Failed in branch CUDA
[Pipeline] // parallel
[Pipeline] }
[Pipeline] // stage
[Pipeline] }
[Pipeline] // timeout
[Pipeline] }
[Pipeline] // withEnv
[Pipeline] End of Pipeline
ERROR: script returned exit code 8
Finished: FAILURE