38: Done.
38: Rank: 0 | New parameters for member 0: 0.121104
38: Rank: 0 | New parameters for member 1: 0.142225
38: 80% completed
38: Rank: 1 | New parameters for member 2: 0.107206
38: 90% completed
38: 100% completed
38:
38: [1;32;49m*** No errors detected
38: [0;39;49m[1;34;49m/var/jenkins/workspace/adamantine-nightly/tests/test_integration_da_augmented.cc(19): Leaving test case "integration_3D_data_assimilation_augmented"; testing time: 39021064us
38: [0;39;49m[1;34;49mLeaving test module "Integration_Data_Assimilation_Augmented"; testing time: 39021536us
38: [0;39;49m[1;34;49m/var/jenkins/workspace/adamantine-nightly/tests/test_integration_da_augmented.cc(19): Leaving test case "integration_3D_data_assimilation_augmented"; testing time: 39020954us
38: [0;39;49m[1;34;49mLeaving test module "Integration_Data_Assimilation_Augmented"; testing time: 39021342us
38: [0;39;49m
38: [1;32;49m*** No errors detected
38: [0;39;49m
38/48 Test #38: test_integration_da_augmented_2 .......... Passed 39.78 sec
test 40
Start 40: test_integration_thermoelastic_2
40: Test command: /usr/bin/mpiexec "-n" "2" "/var/jenkins/workspace/adamantine-nightly/build/bin/test_integration_thermoelastic"
40: Working Directory: /var/jenkins/workspace/adamantine-nightly/build/tests
40: Test timeout computed to be: 7200
40: Running 2 test cases...
40: [1;34;49mEntering test module "Integration_Thermoelastic"
40: [0;39;49m[1;34;49m/var/jenkins/workspace/adamantine-nightly/tests/test_integration_thermoelastic.cc(19): Entering test case "integration_thermoelastic"
40: Running 2 test cases...
40: [1;34;49mEntering test module "Integration_Thermoelastic"
40: [0;39;49m[1;34;49m/var/jenkins/workspace/adamantine-nightly/tests/test_integration_thermoelastic.cc(19): Entering test case "integration_thermoelastic"
32: n_time_step: 577 time: 5.76 n_dofs (thermal) after cell activation: 1219
32: n_time_step: 601 time: 6 n_dofs (thermal) after cell activation: 1220
32: 60% completed
32: n_time_step: 624 time: 6.23 n_dofs (thermal) after cell activation: 1221
31: 20% completed
32: n_time_step: 647 time: 6.46 n_dofs (thermal) after cell activation: 1222
34/48 Test #31: test_integration_3d_1 ....................***Timeout 7200.03 sec
32: n_time_step: 671 time: 6.7 n_dofs (thermal) after cell activation: 1223
32: n_time_step: 694 time: 6.93 n_dofs (thermal) after cell activation: 1224
32: 70% completed
32: n_time_step: 717 time: 7.16 n_dofs (thermal) after cell activation: 1226
32: n_time_step: 740 time: 7.39 n_dofs (thermal) after cell activation: 1227
40: [0;39;49m[0;39;49m10% completed
32: n_time_step: 763 time: 7.62 n_dofs (thermal) after cell activation: 1228
32: 50% completed
39: 50% completed
32: n_time_step: 787 time: 7.86 n_dofs (thermal) after cell activation: 1229
32: 80% completed
32: n_time_step: 810 time: 8.09 n_dofs (thermal) after cell activation: 1230
32: n_time_step: 833 time: 8.32 n_dofs (thermal) after cell activation: 1231
32: n_time_step: 857 time: 8.56 n_dofs (thermal) after cell activation: 1232
39/48 Test #32: test_integration_3d_2 ....................***Timeout 7200.02 sec
test 42
Start 42: test_material_deposition_2
42: Test command: /usr/bin/mpiexec "-n" "2" "/var/jenkins/workspace/adamantine-nightly/build/bin/test_material_deposition"
42: Working Directory: /var/jenkins/workspace/adamantine-nightly/build/tests
42: Test timeout computed to be: 7200
42: Running 11 test cases...
42: Running 11 test cases...
42: [1;34;49mEntering test module "MaterialDeposition"
42: [0;39;49m[1;34;49m/var/jenkins/workspace/adamantine-nightly/tests/test_material_deposition.cc(50): Entering test case "read_material_deposition_file_2d"
42: [1;34;49mEntering test module "MaterialDeposition"
42: [0;39;49m[1;34;49m/var/jenkins/workspace/adamantine-nightly/tests/test_material_deposition.cc(50): Entering test case "read_material_deposition_file_2d"
42: [0;39;49m[1;34;49m/var/jenkins/workspace/adamantine-nightly/tests/test_material_deposition.cc(50): Leaving test case "read_material_deposition_file_2d"; testing time: 288us
42: [0;39;49m[1;34;49m/var/jenkins/workspace/adamantine-nightly/tests/test_material_deposition.cc(92): Entering test case "read_material_deposition_file_3d"
42: [0;39;49m[1;34;49m/var/jenkins/workspace/adamantine-nightly/tests/test_material_deposition.cc(50): Leaving test case "read_material_deposition_file_2d"; testing time: 296us
42: [0;39;49m[1;34;49m/var/jenkins/workspace/adamantine-nightly/tests/test_material_deposition.cc(92): Leaving test case "read_material_deposition_file_3d"; testing time: 188us
42: [0;39;49m[1;33;49m/var/jenkins/workspace/adamantine-nightly/tests/test_material_deposition.cc(134): Test case "get_elements_to_activate_2d" is skipped because precondition failed: the test only works in serial
42: [0;39;49m[1;33;49m/var/jenkins/workspace/adamantine-nightly/tests/test_material_deposition.cc(195): Test case "get_elements_to_activate_3d" is skipped because precondition failed: the test only works in serial
42: [0;39;49m[1;34;49m/var/jenkins/workspace/adamantine-nightly/tests/test_material_deposition.cc(262): Entering test case "material_deposition"
42: [0;39;49m[1;34;49m/var/jenkins/workspace/adamantine-nightly/tests/test_material_deposition.cc(92): Entering test case "read_material_deposition_file_3d"
42: [0;39;49m[1;34;49m/var/jenkins/workspace/adamantine-nightly/tests/test_material_deposition.cc(92): Leaving test case "read_material_deposition_file_3d"; testing time: 191us
42: [0;39;49m[1;33;49m/var/jenkins/workspace/adamantine-nightly/tests/test_material_deposition.cc(134): Test case "get_elements_to_activate_2d" is skipped because precondition failed: the test only works in serial
42: [0;39;49m[1;33;49m/var/jenkins/workspace/adamantine-nightly/tests/test_material_deposition.cc(195): Test case "get_elements_to_activate_3d" is skipped because precondition failed: the test only works in serial
42: [0;39;49m[1;34;49m/var/jenkins/workspace/adamantine-nightly/tests/test_material_deposition.cc(262): Entering test case "material_deposition"
42: [0;39;49m[1;34;49m/var/jenkins/workspace/adamantine-nightly/tests/test_material_deposition.cc(262): Leaving test case "material_deposition"; testing time: 10934365us
42: [0;39;49m[1;34;49m/var/jenkins/workspace/adamantine-nightly/tests/test_material_deposition.cc(262): Leaving test case "material_deposition"; testing time: 10926065us
42: [0;39;49m[1;34;49m/var/jenkins/workspace/adamantine-nightly/tests/test_material_deposition.cc(395): Entering test case "deposition_from_scan_path_2d"
42: [0;39;49m[1;34;49m/var/jenkins/workspace/adamantine-nightly/tests/test_material_deposition.cc(395): Entering test case "deposition_from_scan_path_2d"
42: [0;39;49m[1;34;49m/var/jenkins/workspace/adamantine-nightly/tests/test_material_deposition.cc(395): Leaving test case "deposition_from_scan_path_2d"; testing time: 277us
42: [0;39;49m[1;34;49m/var/jenkins/workspace/adamantine-nightly/tests/test_material_deposition.cc(445): Entering test case "deposition_from_scan_path_3d"
42: [0;39;49m[1;34;49m/var/jenkins/workspace/adamantine-nightly/tests/test_material_deposition.cc(395): Leaving test case "deposition_from_scan_path_2d"; testing time: 285us
42: [0;39;49m[1;34;49m/var/jenkins/workspace/adamantine-nightly/tests/test_material_deposition.cc(445): Entering test case "deposition_from_scan_path_3d"
42: [0;39;49m[1;34;49m/var/jenkins/workspace/adamantine-nightly/tests/test_material_deposition.cc(445): Leaving test case "deposition_from_scan_path_3d"; testing time: 195us
42: [0;39;49m[1;34;49m/var/jenkins/workspace/adamantine-nightly/tests/test_material_deposition.cc(445): Leaving test case "deposition_from_scan_path_3d"; testing time: 184us
42: [0;39;49m[1;34;49m/var/jenkins/workspace/adamantine-nightly/tests/test_material_deposition.cc(499): Entering test case "deposition_from_L_scan_path_3d"
42: [0;39;49m[1;34;49m/var/jenkins/workspace/adamantine-nightly/tests/test_material_deposition.cc(499): Entering test case "deposition_from_L_scan_path_3d"
42: [0;39;49m[1;34;49m/var/jenkins/workspace/adamantine-nightly/tests/test_material_deposition.cc(499): Leaving test case "deposition_from_L_scan_path_3d"; testing time: 219us
42: [0;39;49m[1;34;49m/var/jenkins/workspace/adamantine-nightly/tests/test_material_deposition.cc(586): Entering test case "deposition_from_diagonal_scan_path_3d"
42: [0;39;49m[1;34;49m/var/jenkins/workspace/adamantine-nightly/tests/test_material_deposition.cc(499): Leaving test case "deposition_from_L_scan_path_3d"; testing time: 209us
42: [0;39;49m[1;34;49m/var/jenkins/workspace/adamantine-nightly/tests/test_material_deposition.cc(586): Entering test case "deposition_from_diagonal_scan_path_3d"
42: [0;39;49m[1;34;49m/var/jenkins/workspace/adamantine-nightly/tests/test_material_deposition.cc(586): Leaving test case "deposition_from_diagonal_scan_path_3d"; testing time: 165us
42: [0;39;49m[1;34;49m/var/jenkins/workspace/adamantine-nightly/tests/test_material_deposition.cc(640): Entering test case "merge_multiple_deposition_paths"
42: [0;39;49m[1;34;49m/var/jenkins/workspace/adamantine-nightly/tests/test_material_deposition.cc(586): Leaving test case "deposition_from_diagonal_scan_path_3d"; testing time: 170us
42: [0;39;49m[1;34;49m/var/jenkins/workspace/adamantine-nightly/tests/test_material_deposition.cc(640): Entering test case "merge_multiple_deposition_paths"
42: [0;39;49m[1;34;49m/var/jenkins/workspace/adamantine-nightly/tests/test_material_deposition.cc(640): Leaving test case "merge_multiple_deposition_paths"; testing time: 109us
42: [0;39;49m[1;34;49m/var/jenkins/workspace/adamantine-nightly/tests/test_material_deposition.cc(697): Entering test case "deposition_quaternion_straight_line"
42: [0;39;49m[1;34;49m/var/jenkins/workspace/adamantine-nightly/tests/test_material_deposition.cc(640): Leaving test case "merge_multiple_deposition_paths"; testing time: 107us
42: [0;39;49m[1;34;49m/var/jenkins/workspace/adamantine-nightly/tests/test_material_deposition.cc(697): Entering test case "deposition_quaternion_straight_line"
42: [0;39;49m[1;34;49m/var/jenkins/workspace/adamantine-nightly/tests/test_material_deposition.cc(697): Leaving test case "deposition_quaternion_straight_line"; testing time: 504us
42: [0;39;49m[1;34;49mLeaving test module "MaterialDeposition"; testing time: 10950282us
42: [0;39;49m[1;34;49m/var/jenkins/workspace/adamantine-nightly/tests/test_material_deposition.cc(697): Leaving test case "deposition_quaternion_straight_line"; testing time: 508us
42: [0;39;49m[0;39;49m[1;34;49mLeaving test module "MaterialDeposition"; testing time: 10950323us
42: [0;39;49m
42: [1;32;49m*** No errors detected
42: [0;39;49m
42: [1;32;49m*** No errors detected
42: [0;39;49m
40/48 Test #42: test_material_deposition_2 ............... Passed 11.61 sec
test 44
Start 44: test_microstructure_2
44: Test command: /usr/bin/mpiexec "-n" "2" "/var/jenkins/workspace/adamantine-nightly/build/bin/test_microstructure"
44: Working Directory: /var/jenkins/workspace/adamantine-nightly/build/tests
44: Test timeout computed to be: 7200
44: Running 1 test case...
44: Running 1 test case...
44: [1;34;49mEntering test module "MicroStructure"
44: [1;34;49mEntering test module "MicroStructure"
44: [0;39;49m[1;34;49m/var/jenkins/workspace/adamantine-nightly/tests/test_microstructure.cc(53): Entering test case "G_and_R"
44: [0;39;49m[1;34;49m/var/jenkins/workspace/adamantine-nightly/tests/test_microstructure.cc(53): Entering test case "G_and_R"
44:
44: [1;32;49m*** No errors detected
44: [0;39;49m[0;39;49m[1;36;49mTest case G_and_R did not check any assertions[0;39;49m
44: [1;34;49m/var/jenkins/workspace/adamantine-nightly/tests/test_microstructure.cc(53): Leaving test case "G_and_R"; testing time: 189467us
44: [0;39;49m[1;34;49mLeaving test module "MicroStructure"; testing time: 189526us
44: [0;39;49m[0;39;49m[1;34;49m/var/jenkins/workspace/adamantine-nightly/tests/test_microstructure.cc(53): Leaving test case "G_and_R"; testing time: 190568us
44: [0;39;49m[1;34;49mLeaving test module "MicroStructure"; testing time: 190615us
44: [0;39;49m
44: [1;32;49m*** No errors detected
44: [0;39;49m
41/48 Test #44: test_microstructure_2 .................... Passed 0.86 sec
test 46
Start 46: test_thermal_physics_2
46: Test command: /usr/bin/mpiexec "-n" "2" "/var/jenkins/workspace/adamantine-nightly/build/bin/test_thermal_physics"
46: Working Directory: /var/jenkins/workspace/adamantine-nightly/build/tests
46: Test timeout computed to be: 7200
46: Running 7 test cases...
46: Running 7 test cases...
46: [1;34;49mEntering test module "ThermalPhysics"
46: [1;34;49mEntering test module "ThermalPhysics"
46: [0;39;49m[1;34;49m/var/jenkins/workspace/adamantine-nightly/tests/test_thermal_physics.cc(15): Entering test case "thermal_2d_explicit_host"
46: [0;39;49m[1;34;49m/var/jenkins/workspace/adamantine-nightly/tests/test_thermal_physics.cc(15): Entering test case "thermal_2d_explicit_host"
46: [0;39;49m[1;34;49m/var/jenkins/workspace/adamantine-nightly/tests/test_thermal_physics.cc(15): Leaving test case "thermal_2d_explicit_host"; testing time: 311835us
46: [0;39;49m[1;34;49m/var/jenkins/workspace/adamantine-nightly/tests/test_thermal_physics.cc(28): Entering test case "thermal_2d_manufactured_solution_host"
46: [0;39;49m[1;34;49m/var/jenkins/workspace/adamantine-nightly/tests/test_thermal_physics.cc(15): Leaving test case "thermal_2d_explicit_host"; testing time: 324849us
46: [0;39;49m[1;34;49m/var/jenkins/workspace/adamantine-nightly/tests/test_thermal_physics.cc(28): Entering test case "thermal_2d_manufactured_solution_host"
46: [0;39;49m[1;34;49m/var/jenkins/workspace/adamantine-nightly/tests/test_thermal_physics.cc(28): Leaving test case "thermal_2d_manufactured_solution_host"; testing time: 196098us
46: [0;39;49m[1;34;49m/var/jenkins/workspace/adamantine-nightly/tests/test_thermal_physics.cc(33): Entering test case "initial_temperature_host"
46: [0;39;49m[1;34;49m/var/jenkins/workspace/adamantine-nightly/tests/test_thermal_physics.cc(28): Leaving test case "thermal_2d_manufactured_solution_host"; testing time: 209140us
46: [0;39;49m[1;34;49m/var/jenkins/workspace/adamantine-nightly/tests/test_thermal_physics.cc(33): Entering test case "initial_temperature_host"
46: [0;39;49m[1;34;49m/var/jenkins/workspace/adamantine-nightly/tests/test_thermal_physics.cc(33): Leaving test case "initial_temperature_host"; testing time: 147430us
46: [0;39;49m[1;34;49m/var/jenkins/workspace/adamantine-nightly/tests/test_thermal_physics.cc(38): Entering test case "energy_conservation_host"
46: [0;39;49m[1;34;49m/var/jenkins/workspace/adamantine-nightly/tests/test_thermal_physics.cc(33): Leaving test case "initial_temperature_host"; testing time: 147493us
46: [0;39;49m[1;34;49m/var/jenkins/workspace/adamantine-nightly/tests/test_thermal_physics.cc(38): Entering test case "energy_conservation_host"
46: [0;39;49m[1;34;49m/var/jenkins/workspace/adamantine-nightly/tests/test_thermal_physics.cc(38): Leaving test case "energy_conservation_host"; testing time: 3601996us
46: [0;39;49m[1;34;49m/var/jenkins/workspace/adamantine-nightly/tests/test_thermal_physics.cc(38): Leaving test case "energy_conservation_host"; testing time: 3602082us
46: [0;39;49m[1;34;49m/var/jenkins/workspace/adamantine-nightly/tests/test_thermal_physics.cc(43): Entering test case "radiation_bcs_host"
46: [0;39;49m[1;34;49m/var/jenkins/workspace/adamantine-nightly/tests/test_thermal_physics.cc(43): Entering test case "radiation_bcs_host"
46: [0;39;49m[1;34;49m/var/jenkins/workspace/adamantine-nightly/tests/test_thermal_physics.cc(43): Leaving test case "radiation_bcs_host"; testing time: 2597682us
46: [0;39;49m[1;34;49m/var/jenkins/workspace/adamantine-nightly/tests/test_thermal_physics.cc(48): Entering test case "convection_bcs_host"
46: [0;39;49m[1;34;49m/var/jenkins/workspace/adamantine-nightly/tests/test_thermal_physics.cc(43): Leaving test case "radiation_bcs_host"; testing time: 2615612us
46: [0;39;49m[1;34;49m/var/jenkins/workspace/adamantine-nightly/tests/test_thermal_physics.cc(48): Entering test case "convection_bcs_host"
35/48 Test #39: test_integration_thermoelastic_1 .........***Timeout 7200.11 sec
test 34
Start 34: test_integration_3d_amr_2
34: Test command: /usr/bin/mpiexec "-n" "2" "/var/jenkins/workspace/adamantine-nightly/build/bin/test_integration_3d_amr"
34: Working Directory: /var/jenkins/workspace/adamantine-nightly/build/tests
34: Test timeout computed to be: 7200
34: Running 2 test cases...
34: [1;34;49mEntering test module "Integration_3D_AMR"
34: [0;39;49m[1;34;49m/var/jenkins/workspace/adamantine-nightly/tests/test_integration_3d_amr.cc(19): Entering test case "integration_3D_amr"
34: Running 2 test cases...
34: [1;34;49mEntering test module "Integration_3D_AMR"
34: [0;39;49m[1;34;49m/var/jenkins/workspace/adamantine-nightly/tests/test_integration_3d_amr.cc(19): Entering test case "integration_3D_amr"
46: [0;39;49m[1;34;49m/var/jenkins/workspace/adamantine-nightly/tests/test_thermal_physics.cc(48): Leaving test case "convection_bcs_host"; testing time: 42769947us
46: [0;39;49m[1;34;49m/var/jenkins/workspace/adamantine-nightly/tests/test_thermal_physics.cc(53): Entering test case "reference_temperature_host"
46: [0;39;49m[1;34;49m/var/jenkins/workspace/adamantine-nightly/tests/test_thermal_physics.cc(48): Leaving test case "convection_bcs_host"; testing time: 42764132us
46: [0;39;49m[1;34;49m/var/jenkins/workspace/adamantine-nightly/tests/test_thermal_physics.cc(53): Entering test case "reference_temperature_host"
46: [0;39;49m[1;34;49m/var/jenkins/workspace/adamantine-nightly/tests/test_thermal_physics.cc(53): Leaving test case "reference_temperature_host"; testing time: 137370us
46: [0;39;49m[1;34;49mLeaving test module "ThermalPhysics"; testing time: 49788307us
46: [0;39;49m
46: [1;32;49m*** No errors detected
46: [0;39;49m[0;39;49m[1;34;49m/var/jenkins/workspace/adamantine-nightly/tests/test_thermal_physics.cc(53): Leaving test case "reference_temperature_host"; testing time: 161095us
46: [0;39;49m[1;34;49mLeaving test module "ThermalPhysics"; testing time: 49824965us
46: [0;39;49m
46: [1;32;49m*** No errors detected
46: [0;39;49m
42/48 Test #46: test_thermal_physics_2 ................... Passed 50.53 sec
test 48
Start 48: test_ensemble_management_2
48: Test command: /usr/bin/mpiexec "-n" "2" "/var/jenkins/workspace/adamantine-nightly/build/bin/test_ensemble_management"
48: Working Directory: /var/jenkins/workspace/adamantine-nightly/build/tests
48: Test timeout computed to be: 7200
48: Running 1 test case...
48: Running 1 test case...
48: [1;34;49mEntering test module "EnsembleManagement"
48: [1;34;49mEntering test module "EnsembleManagement"
48: [0;39;49m[1;34;49m/var/jenkins/workspace/adamantine-nightly/tests/test_ensemble_management.cc(17): Entering test case "database_ensemble"
48: [0;39;49m[1;34;49m/var/jenkins/workspace/adamantine-nightly/tests/test_ensemble_management.cc(17): Entering test case "database_ensemble"
48: [0;39;49m[1;34;49m/var/jenkins/workspace/adamantine-nightly/tests/test_ensemble_management.cc(17): Leaving test case "database_ensemble"; testing time: 868us
48: [0;39;49m[1;34;49mLeaving test module "EnsembleManagement"; testing time: 902us
48: [0;39;49m
48: [1;32;49m*** No errors detected
48: [0;39;49m[0;39;49m[1;34;49m/var/jenkins/workspace/adamantine-nightly/tests/test_ensemble_management.cc(17): Leaving test case "database_ensemble"; testing time: 2214us
48: [0;39;49m[1;34;49mLeaving test module "EnsembleManagement"; testing time: 2246us
48: [0;39;49m
48: [1;32;49m*** No errors detected
48: [0;39;49m
43/48 Test #48: test_ensemble_management_2 ............... Passed 0.67 sec
40: 20% completed
34: [0;39;49m10% completed
34: 20% completed
34: 30% completed
34: 40% completed
34: 50% completed
34: 60% completed
34: 70% completed
34: 80% completed
34: 90% completed
34: 100% completed
34: [1;34;49m/var/jenkins/workspace/adamantine-nightly/tests/test_integration_3d_amr.cc(19): Leaving test case "integration_3D_amr"; testing time: 15111499us
34: [0;39;49m[1;34;49m/var/jenkins/workspace/adamantine-nightly/tests/test_integration_3d_amr.cc(60): Entering test case "integration_3D_amr_refine_coarsen"
34: [0;39;49m[1;34;49m/var/jenkins/workspace/adamantine-nightly/tests/test_integration_3d_amr.cc(19): Leaving test case "integration_3D_amr"; testing time: 15056636us
34: [0;39;49m[1;34;49m/var/jenkins/workspace/adamantine-nightly/tests/test_integration_3d_amr.cc(60): Entering test case "integration_3D_amr_refine_coarsen"
34: [0;39;49m10% completed
34: 20% completed
34: 30% completed
34: 40% completed
32: 60% completed
34: 50% completed
40: 30% completed
34: 60% completed
34: 70% completed
34: 80% completed
34: 90% completed
34: 100% completed
34:
34: [1;32;49m*** No errors detected
34: [0;39;49m[1;34;49m/var/jenkins/workspace/adamantine-nightly/tests/test_integration_3d_amr.cc(60): Leaving test case "integration_3D_amr_refine_coarsen"; testing time: 144699274us
34: [0;39;49m[1;34;49mLeaving test module "Integration_3D_AMR"; testing time: 159812018us
34: [0;39;49m
34: [1;32;49m*** No errors detected
34: [0;39;49m[0;39;49m[1;34;49m/var/jenkins/workspace/adamantine-nightly/tests/test_integration_3d_amr.cc(60): Leaving test case "integration_3D_amr_refine_coarsen"; testing time: 144699179us
34: [0;39;49m[1;34;49mLeaving test module "Integration_3D_AMR"; testing time: 159769735us
34: [0;39;49m
36/48 Test #34: test_integration_3d_amr_2 ................ Passed 166.23 sec
test 36
Start 36: test_integration_3d_amr_device_2
36: Test command: /usr/bin/mpiexec "-n" "2" "/var/jenkins/workspace/adamantine-nightly/build/bin/test_integration_3d_amr_device"
36: Working Directory: /var/jenkins/workspace/adamantine-nightly/build/tests
36: Test timeout computed to be: 7200
36: Running 1 test case...
36: [1;34;49mEntering test module "Integration_3D_AMR"
36: [0;39;49m[1;34;49m/var/jenkins/workspace/adamantine-nightly/tests/test_integration_3d_amr_device.cc(19): Entering test case "integration_3D_amr_device"
36: Running 1 test case...
36: [1;34;49mEntering test module "Integration_3D_AMR"
36: [0;39;49m[1;34;49m/var/jenkins/workspace/adamantine-nightly/tests/test_integration_3d_amr_device.cc(19): Entering test case "integration_3D_amr_device"
36: [0;39;49m10% completed
36: 20% completed
36: 30% completed
36: 40% completed
36: 50% completed
36: 60% completed
36: 70% completed
40: 40% completed
36: 80% completed
36: 90% completed
36: 100% completed
36: [1;34;49m/var/jenkins/workspace/adamantine-nightly/tests/test_integration_3d_amr_device.cc(19): Leaving test case "integration_3D_amr_device"; testing time: 116621876us
36: [0;39;49m[1;34;49mLeaving test module "Integration_3D_AMR"; testing time: 116622192us
36: [0;39;49m[0;39;49m[1;34;49m/var/jenkins/workspace/adamantine-nightly/tests/test_integration_3d_amr_device.cc(19): Leaving test case "integration_3D_amr_device"; testing time: 116699413us
36: [0;39;49m[1;34;49mLeaving test module "Integration_3D_AMR"; testing time: 116699733us
36: [0;39;49m
36: [1;32;49m*** No errors detected
36: [0;39;49m
36: [1;32;49m*** No errors detected
36: [0;39;49m
37/48 Test #36: test_integration_3d_amr_device_2 ......... Passed 124.57 sec
test 38
Start 38: test_integration_da_augmented_2
38: Test command: /usr/bin/mpiexec "-n" "2" "/var/jenkins/workspace/adamantine-nightly/build/bin/test_integration_da_augmented"
38: Working Directory: /var/jenkins/workspace/adamantine-nightly/build/tests
38: Test timeout computed to be: 7200
38: Running 1 test case...
38: [1;34;49mEntering test module "Integration_Data_Assimilation_Augmented"
38: [0;39;49m[1;34;49m/var/jenkins/workspace/adamantine-nightly/tests/test_integration_da_augmented.cc(19): Entering test case "integration_3D_data_assimilation_augmented"
38: Running 1 test case...
38: [1;34;49mEntering test module "Integration_Data_Assimilation_Augmented"
38: [0;39;49m[1;34;49m/var/jenkins/workspace/adamantine-nightly/tests/test_integration_da_augmented.cc(19): Entering test case "integration_3D_data_assimilation_augmented"
38: [0;39;49mReading the experimental log file...
38: Done. Log entries found for 1 camera(s), with 2 frame(s).
38: Starting the main time stepping loop...
38: 10% completed
38: 20% completed
38: 30% completed
38: [0;39;49mRank: 1 | Old parameters for member 2: 0.446065
38: Rank: 1 | Number expt sites mapped to DOFs: 2
38: 40% completed
38: 50% completed
38: 60% completed
38: 70% completed
38: Performing data assimilation at time 0.04...
38: Rank: 0 | Old parameters for member 0: 0.413453
38: Rank: 0 | Old parameters for member 1: 0.385362
38: Rank: 0 | Number expt sites mapped to DOFs: 2
38: Getting the perturbed innovation...
38: Applying the Kalman gain...
38: Updating the ensemble members...
38: Rank: 1 | New parameters for member 2: 0.107206
38: Done.
38: Rank: 0 | New parameters for member 0: 0.121104
38: Rank: 0 | New parameters for member 1: 0.142225
38: 80% completed
38: 90% completed
38: 100% completed
38:
38: [1;32;49m*** No errors detected
38: [0;39;49m[1;34;49m/var/jenkins/workspace/adamantine-nightly/tests/test_integration_da_augmented.cc(19): Leaving test case "integration_3D_data_assimilation_augmented"; testing time: 68198889us
38: [0;39;49m[1;34;49mLeaving test module "Integration_Data_Assimilation_Augmented"; testing time: 68199221us
38: [0;39;49m[1;34;49m/var/jenkins/workspace/adamantine-nightly/tests/test_integration_da_augmented.cc(19): Leaving test case "integration_3D_data_assimilation_augmented"; testing time: 68221375us
38: [0;39;49m[1;34;49mLeaving test module "Integration_Data_Assimilation_Augmented"; testing time: 68221717us
38: [0;39;49m
38: [1;32;49m*** No errors detected
38: [0;39;49m
38/48 Test #38: test_integration_da_augmented_2 .......... Passed 76.78 sec
test 40
Start 40: test_integration_thermoelastic_2
40: Test command: /usr/bin/mpiexec "-n" "2" "/var/jenkins/workspace/adamantine-nightly/build/bin/test_integration_thermoelastic"
40: Working Directory: /var/jenkins/workspace/adamantine-nightly/build/tests
40: Test timeout computed to be: 7200
40: Running 2 test cases...
40: [1;34;49mEntering test module "Integration_Thermoelastic"
40: [0;39;49m[1;34;49m/var/jenkins/workspace/adamantine-nightly/tests/test_integration_thermoelastic.cc(19): Entering test case "integration_thermoelastic"
40: Running 2 test cases...
40: [1;34;49mEntering test module "Integration_Thermoelastic"
40: [0;39;49m[1;34;49m/var/jenkins/workspace/adamantine-nightly/tests/test_integration_thermoelastic.cc(19): Entering test case "integration_thermoelastic"
40: 50% completed
40: 60% completed
32: 70% completed
40: 70% completed
40: 80% completed
40: 90% completed
40: 100% completed
40: [1;34;49m/var/jenkins/workspace/adamantine-nightly/tests/test_integration_thermoelastic.cc(19): Leaving test case "integration_thermoelastic"; testing time: 1765348978us
40: [0;39;49m[1;34;49m/var/jenkins/workspace/adamantine-nightly/tests/test_integration_thermoelastic.cc(47): Entering test case "integration_thermoelastic_add_material"
40: [1;34;49m/var/jenkins/workspace/adamantine-nightly/tests/test_integration_thermoelastic.cc(19): Leaving test case "integration_thermoelastic"; testing time: 1765348697us
40: [0;39;49m[1;34;49m/var/jenkins/workspace/adamantine-nightly/tests/test_integration_thermoelastic.cc(47): Entering test case "integration_thermoelastic_add_material"
40: [0;39;49m[0;39;49m10% completed
32: 80% completed
40: [0;39;49m[0;39;49m10% completed
40: 20% completed
40: 30% completed
39/48 Test #32: test_integration_3d_2 ....................***Timeout 7200.11 sec
test 42
Start 42: test_material_deposition_2
42: Test command: /usr/bin/mpiexec "-n" "2" "/var/jenkins/workspace/adamantine-nightly/build/bin/test_material_deposition"
42: Working Directory: /var/jenkins/workspace/adamantine-nightly/build/tests
42: Test timeout computed to be: 7200
42: Running 11 test cases...
42: [1;34;49mEntering test module "MaterialDeposition"
42: [0;39;49m[1;34;49m/var/jenkins/workspace/adamantine-nightly/tests/test_material_deposition.cc(50): Entering test case "read_material_deposition_file_2d"
42: [0;39;49m[1;34;49m/var/jenkins/workspace/adamantine-nightly/tests/test_material_deposition.cc(50): Leaving test case "read_material_deposition_file_2d"; testing time: 380us
42: [0;39;49m[1;34;49m/var/jenkins/workspace/adamantine-nightly/tests/test_material_deposition.cc(92): Entering test case "read_material_deposition_file_3d"
42: [0;39;49m[1;34;49m/var/jenkins/workspace/adamantine-nightly/tests/test_material_deposition.cc(92): Leaving test case "read_material_deposition_file_3d"; testing time: 225us
42: [0;39;49m[1;33;49m/var/jenkins/workspace/adamantine-nightly/tests/test_material_deposition.cc(134): Test case "get_elements_to_activate_2d" is skipped because precondition failed: the test only works in serial
42: [0;39;49m[1;33;49m/var/jenkins/workspace/adamantine-nightly/tests/test_material_deposition.cc(195): Test case "get_elements_to_activate_3d" is skipped because precondition failed: the test only works in serial
42: [0;39;49m[1;34;49m/var/jenkins/workspace/adamantine-nightly/tests/test_material_deposition.cc(262): Entering test case "material_deposition"
42: Running 11 test cases...
42: [1;34;49mEntering test module "MaterialDeposition"
42: [0;39;49m[1;34;49m/var/jenkins/workspace/adamantine-nightly/tests/test_material_deposition.cc(50): Entering test case "read_material_deposition_file_2d"
42: [0;39;49m[1;34;49m/var/jenkins/workspace/adamantine-nightly/tests/test_material_deposition.cc(50): Leaving test case "read_material_deposition_file_2d"; testing time: 488us
42: [0;39;49m[1;34;49m/var/jenkins/workspace/adamantine-nightly/tests/test_material_deposition.cc(92): Entering test case "read_material_deposition_file_3d"
42: [0;39;49m[1;34;49m/var/jenkins/workspace/adamantine-nightly/tests/test_material_deposition.cc(92): Leaving test case "read_material_deposition_file_3d"; testing time: 240us
42: [0;39;49m[1;33;49m/var/jenkins/workspace/adamantine-nightly/tests/test_material_deposition.cc(134): Test case "get_elements_to_activate_2d" is skipped because precondition failed: the test only works in serial
42: [0;39;49m[1;33;49m/var/jenkins/workspace/adamantine-nightly/tests/test_material_deposition.cc(195): Test case "get_elements_to_activate_3d" is skipped because precondition failed: the test only works in serial
42: [0;39;49m[1;34;49m/var/jenkins/workspace/adamantine-nightly/tests/test_material_deposition.cc(262): Entering test case "material_deposition"
42: [0;39;49m[1;34;49m/var/jenkins/workspace/adamantine-nightly/tests/test_material_deposition.cc(262): Leaving test case "material_deposition"; testing time: 16637807us
42: [0;39;49m[1;34;49m/var/jenkins/workspace/adamantine-nightly/tests/test_material_deposition.cc(395): Entering test case "deposition_from_scan_path_2d"
42: [0;39;49m[1;34;49m/var/jenkins/workspace/adamantine-nightly/tests/test_material_deposition.cc(395): Leaving test case "deposition_from_scan_path_2d"; testing time: 294us
42: [0;39;49m[1;34;49m/var/jenkins/workspace/adamantine-nightly/tests/test_material_deposition.cc(445): Entering test case "deposition_from_scan_path_3d"
42: [0;39;49m[1;34;49m/var/jenkins/workspace/adamantine-nightly/tests/test_material_deposition.cc(262): Leaving test case "material_deposition"; testing time: 16609410us
42: [0;39;49m[1;34;49m/var/jenkins/workspace/adamantine-nightly/tests/test_material_deposition.cc(395): Entering test case "deposition_from_scan_path_2d"
42: [0;39;49m[1;34;49m/var/jenkins/workspace/adamantine-nightly/tests/test_material_deposition.cc(445): Leaving test case "deposition_from_scan_path_3d"; testing time: 234us
42: [0;39;49m[1;34;49m/var/jenkins/workspace/adamantine-nightly/tests/test_material_deposition.cc(499): Entering test case "deposition_from_L_scan_path_3d"
42: [0;39;49m[1;34;49m/var/jenkins/workspace/adamantine-nightly/tests/test_material_deposition.cc(499): Leaving test case "deposition_from_L_scan_path_3d"; testing time: 253us
42: [0;39;49m[1;34;49m/var/jenkins/workspace/adamantine-nightly/tests/test_material_deposition.cc(395): Leaving test case "deposition_from_scan_path_2d"; testing time: 361us
42: [0;39;49m[1;34;49m/var/jenkins/workspace/adamantine-nightly/tests/test_material_deposition.cc(445): Entering test case "deposition_from_scan_path_3d"
42: [0;39;49m[1;34;49m/var/jenkins/workspace/adamantine-nightly/tests/test_material_deposition.cc(586): Entering test case "deposition_from_diagonal_scan_path_3d"
42: [0;39;49m[1;34;49m/var/jenkins/workspace/adamantine-nightly/tests/test_material_deposition.cc(445): Leaving test case "deposition_from_scan_path_3d"; testing time: 261us
42: [0;39;49m[1;34;49m/var/jenkins/workspace/adamantine-nightly/tests/test_material_deposition.cc(499): Entering test case "deposition_from_L_scan_path_3d"
42: [0;39;49m[1;34;49m/var/jenkins/workspace/adamantine-nightly/tests/test_material_deposition.cc(586): Leaving test case "deposition_from_diagonal_scan_path_3d"; testing time: 263us
42: [0;39;49m[1;34;49m/var/jenkins/workspace/adamantine-nightly/tests/test_material_deposition.cc(640): Entering test case "merge_multiple_deposition_paths"
42: [0;39;49m[1;34;49m/var/jenkins/workspace/adamantine-nightly/tests/test_material_deposition.cc(640): Leaving test case "merge_multiple_deposition_paths"; testing time: 157us
42: [0;39;49m[1;34;49m/var/jenkins/workspace/adamantine-nightly/tests/test_material_deposition.cc(697): Entering test case "deposition_quaternion_straight_line"
42: [0;39;49m[1;34;49m/var/jenkins/workspace/adamantine-nightly/tests/test_material_deposition.cc(499): Leaving test case "deposition_from_L_scan_path_3d"; testing time: 271us
42: [0;39;49m[1;34;49m/var/jenkins/workspace/adamantine-nightly/tests/test_material_deposition.cc(586): Entering test case "deposition_from_diagonal_scan_path_3d"
42: [0;39;49m[1;34;49m/var/jenkins/workspace/adamantine-nightly/tests/test_material_deposition.cc(586): Leaving test case "deposition_from_diagonal_scan_path_3d"; testing time: 230us
42: [0;39;49m[1;34;49m/var/jenkins/workspace/adamantine-nightly/tests/test_material_deposition.cc(640): Entering test case "merge_multiple_deposition_paths"
42:
42: [1;32;49m*** No errors detected
42: [0;39;49m[0;39;49m[1;34;49m/var/jenkins/workspace/adamantine-nightly/tests/test_material_deposition.cc(697): Leaving test case "deposition_quaternion_straight_line"; testing time: 698us
42: [0;39;49m[1;34;49mLeaving test module "MaterialDeposition"; testing time: 16642303us
42: [0;39;49m[0;39;49m[1;34;49m/var/jenkins/workspace/adamantine-nightly/tests/test_material_deposition.cc(640): Leaving test case "merge_multiple_deposition_paths"; testing time: 140us
42: [0;39;49m[1;34;49m/var/jenkins/workspace/adamantine-nightly/tests/test_material_deposition.cc(697): Entering test case "deposition_quaternion_straight_line"
42: [0;39;49m[1;34;49m/var/jenkins/workspace/adamantine-nightly/tests/test_material_deposition.cc(697): Leaving test case "deposition_quaternion_straight_line"; testing time: 688us
42: [0;39;49m[1;34;49mLeaving test module "MaterialDeposition"; testing time: 16614149us
42: [0;39;49m
42: [1;32;49m*** No errors detected
42: [0;39;49m
40/48 Test #42: test_material_deposition_2 ............... Passed 23.00 sec
test 44
Start 44: test_microstructure_2
44: Test command: /usr/bin/mpiexec "-n" "2" "/var/jenkins/workspace/adamantine-nightly/build/bin/test_microstructure"
44: Working Directory: /var/jenkins/workspace/adamantine-nightly/build/tests
44: Test timeout computed to be: 7200
44: Running 1 test case...
44: [1;34;49mEntering test module "MicroStructure"
44: [0;39;49m[1;34;49m/var/jenkins/workspace/adamantine-nightly/tests/test_microstructure.cc(53): Entering test case "G_and_R"
44: Running 1 test case...
44: [1;34;49mEntering test module "MicroStructure"
44: [0;39;49m[1;34;49m/var/jenkins/workspace/adamantine-nightly/tests/test_microstructure.cc(53): Entering test case "G_and_R"
44: [0;39;49m[1;36;49mTest case G_and_R did not check any assertions[0;39;49m
44: [1;34;49m/var/jenkins/workspace/adamantine-nightly/tests/test_microstructure.cc(53): Leaving test case "G_and_R"; testing time: 523507us
44: [0;39;49m[1;34;49mLeaving test module "MicroStructure"; testing time: 523566us
44: [0;39;49m
44: [1;32;49m*** No errors detected
44: [0;39;49m[0;39;49m[1;34;49m/var/jenkins/workspace/adamantine-nightly/tests/test_microstructure.cc(53): Leaving test case "G_and_R"; testing time: 473188us
44: [0;39;49m[1;34;49mLeaving test module "MicroStructure"; testing time: 473233us
44: [0;39;49m
44: [1;32;49m*** No errors detected
44: [0;39;49m
41/48 Test #44: test_microstructure_2 .................... Passed 7.30 sec
test 46
Start 46: test_thermal_physics_2
46: Test command: /usr/bin/mpiexec "-n" "2" "/var/jenkins/workspace/adamantine-nightly/build/bin/test_thermal_physics"
46: Working Directory: /var/jenkins/workspace/adamantine-nightly/build/tests
46: Test timeout computed to be: 7200
46: Running 7 test cases...
46: [1;34;49mEntering test module "ThermalPhysics"
46: [0;39;49m[1;34;49m/var/jenkins/workspace/adamantine-nightly/tests/test_thermal_physics.cc(15): Entering test case "thermal_2d_explicit_host"
46: Running 7 test cases...
46: [1;34;49mEntering test module "ThermalPhysics"
46: [0;39;49m[1;34;49m/var/jenkins/workspace/adamantine-nightly/tests/test_thermal_physics.cc(15): Entering test case "thermal_2d_explicit_host"
46: [0;39;49m[1;34;49m/var/jenkins/workspace/adamantine-nightly/tests/test_thermal_physics.cc(15): Leaving test case "thermal_2d_explicit_host"; testing time: 340103us
46: [0;39;49m[1;34;49m/var/jenkins/workspace/adamantine-nightly/tests/test_thermal_physics.cc(28): Entering test case "thermal_2d_manufactured_solution_host"
46: [0;39;49m[1;34;49m/var/jenkins/workspace/adamantine-nightly/tests/test_thermal_physics.cc(15): Leaving test case "thermal_2d_explicit_host"; testing time: 324915us
46: [0;39;49m[1;34;49m/var/jenkins/workspace/adamantine-nightly/tests/test_thermal_physics.cc(28): Entering test case "thermal_2d_manufactured_solution_host"
46: [0;39;49m[1;34;49m/var/jenkins/workspace/adamantine-nightly/tests/test_thermal_physics.cc(28): Leaving test case "thermal_2d_manufactured_solution_host"; testing time: 229839us
46: [0;39;49m[1;34;49m/var/jenkins/workspace/adamantine-nightly/tests/test_thermal_physics.cc(33): Entering test case "initial_temperature_host"
46: [0;39;49m[1;34;49m/var/jenkins/workspace/adamantine-nightly/tests/test_thermal_physics.cc(28): Leaving test case "thermal_2d_manufactured_solution_host"; testing time: 229587us
46: [0;39;49m[1;34;49m/var/jenkins/workspace/adamantine-nightly/tests/test_thermal_physics.cc(33): Entering test case "initial_temperature_host"
46: [0;39;49m[1;34;49m/var/jenkins/workspace/adamantine-nightly/tests/test_thermal_physics.cc(33): Leaving test case "initial_temperature_host"; testing time: 202067us
46: [0;39;49m[1;34;49m/var/jenkins/workspace/adamantine-nightly/tests/test_thermal_physics.cc(38): Entering test case "energy_conservation_host"
46: [0;39;49m[1;34;49m/var/jenkins/workspace/adamantine-nightly/tests/test_thermal_physics.cc(33): Leaving test case "initial_temperature_host"; testing time: 202063us
46: [0;39;49m[1;34;49m/var/jenkins/workspace/adamantine-nightly/tests/test_thermal_physics.cc(38): Entering test case "energy_conservation_host"
46: [0;39;49m[1;34;49m/var/jenkins/workspace/adamantine-nightly/tests/test_thermal_physics.cc(38): Leaving test case "energy_conservation_host"; testing time: 7762473us
46: [0;39;49m[1;34;49m/var/jenkins/workspace/adamantine-nightly/tests/test_thermal_physics.cc(43): Entering test case "radiation_bcs_host"
46: [0;39;49m[1;34;49m/var/jenkins/workspace/adamantine-nightly/tests/test_thermal_physics.cc(38): Leaving test case "energy_conservation_host"; testing time: 7762489us
46: [0;39;49m[1;34;49m/var/jenkins/workspace/adamantine-nightly/tests/test_thermal_physics.cc(43): Entering test case "radiation_bcs_host"
46: [0;39;49m[1;34;49m/var/jenkins/workspace/adamantine-nightly/tests/test_thermal_physics.cc(43): Leaving test case "radiation_bcs_host"; testing time: 4678677us
46: [0;39;49m[1;34;49m/var/jenkins/workspace/adamantine-nightly/tests/test_thermal_physics.cc(48): Entering test case "convection_bcs_host"
46: [0;39;49m[1;34;49m/var/jenkins/workspace/adamantine-nightly/tests/test_thermal_physics.cc(43): Leaving test case "radiation_bcs_host"; testing time: 4678573us
46: [0;39;49m[1;34;49m/var/jenkins/workspace/adamantine-nightly/tests/test_thermal_physics.cc(48): Entering test case "convection_bcs_host"
40: 40% completed
46: [0;39;49m[1;34;49m/var/jenkins/workspace/adamantine-nightly/tests/test_thermal_physics.cc(48): Leaving test case "convection_bcs_host"; testing time: 80616161us
46: [0;39;49m[1;34;49m/var/jenkins/workspace/adamantine-nightly/tests/test_thermal_physics.cc(53): Entering test case "reference_temperature_host"
46: [0;39;49m[1;34;49m/var/jenkins/workspace/adamantine-nightly/tests/test_thermal_physics.cc(48): Leaving test case "convection_bcs_host"; testing time: 80616486us
46: [0;39;49m[1;34;49m/var/jenkins/workspace/adamantine-nightly/tests/test_thermal_physics.cc(53): Entering test case "reference_temperature_host"
46: [0;39;49m[1;34;49m/var/jenkins/workspace/adamantine-nightly/tests/test_thermal_physics.cc(53): Leaving test case "reference_temperature_host"; testing time: 182306us
46: [0;39;49m[1;34;49mLeaving test module "ThermalPhysics"; testing time: 94012806us
46: [0;39;49m
46: [1;32;49m*** No errors detected
46: [0;39;49m
46: [1;32;49m*** No errors detected
46: [0;39;49m[0;39;49m[1;34;49m/var/jenkins/workspace/adamantine-nightly/tests/test_thermal_physics.cc(53): Leaving test case "reference_temperature_host"; testing time: 239778us
46: [0;39;49m[1;34;49mLeaving test module "ThermalPhysics"; testing time: 94055081us
46: [0;39;49m
42/48 Test #46: test_thermal_physics_2 ................... Passed 101.10 sec
test 48
Start 48: test_ensemble_management_2
48: Test command: /usr/bin/mpiexec "-n" "2" "/var/jenkins/workspace/adamantine-nightly/build/bin/test_ensemble_management"
48: Working Directory: /var/jenkins/workspace/adamantine-nightly/build/tests
48: Test timeout computed to be: 7200
48: Running 1 test case...
48: [1;34;49mEntering test module "EnsembleManagement"
48: [0;39;49m[1;34;49m/var/jenkins/workspace/adamantine-nightly/tests/test_ensemble_management.cc(17): Entering test case "database_ensemble"
48: [0;39;49m[1;34;49m/var/jenkins/workspace/adamantine-nightly/tests/test_ensemble_management.cc(17): Leaving test case "database_ensemble"; testing time: 499us
48: [0;39;49m[1;34;49mLeaving test module "EnsembleManagement"; testing time: 533us
48: [0;39;49m
48: [1;32;49m*** No errors detected
48: [0;39;49mRunning 1 test case...
48: [1;34;49mEntering test module "EnsembleManagement"
48: [0;39;49m[1;34;49m/var/jenkins/workspace/adamantine-nightly/tests/test_ensemble_management.cc(17): Entering test case "database_ensemble"
48: [0;39;49m[1;34;49m/var/jenkins/workspace/adamantine-nightly/tests/test_ensemble_management.cc(17): Leaving test case "database_ensemble"; testing time: 52345us
48: [0;39;49m[1;34;49mLeaving test module "EnsembleManagement"; testing time: 52380us
48: [0;39;49m
48: [1;32;49m*** No errors detected
48: [0;39;49m
43/48 Test #48: test_ensemble_management_2 ............... Passed 6.32 sec
40: 50% completed
40: 20% completed
40: 60% completed
40: 70% completed
40: 30% completed
40: 80% completed
40: 90% completed
40: 100% completed
40: [1;34;49m/var/jenkins/workspace/adamantine-nightly/tests/test_integration_thermoelastic.cc(47): Leaving test case "integration_thermoelastic_add_material"; testing time: 820909622us
40: [0;39;49m[1;34;49mLeaving test module "Integration_Thermoelastic"; testing time: 2586259915us
40: [0;39;49m[1;34;49m/var/jenkins/workspace/adamantine-nightly/tests/test_integration_thermoelastic.cc(47): Leaving test case "integration_thermoelastic_add_material"; testing time: 820909760us
40: [0;39;49m[1;34;49mLeaving test module "Integration_Thermoelastic"; testing time: 2586260253us
40: [0;39;49m
40: [1;32;49m*** No errors detected
40: [0;39;49m
40: [1;32;49m*** No errors detected
40: [0;39;49m
44/48 Test #40: test_integration_thermoelastic_2 ......... Passed 2587.00 sec
test 3
Start 3: test_integration_da_3
3: Test command: /usr/bin/mpiexec "-n" "3" "/var/jenkins/workspace/adamantine-nightly/build/bin/test_integration_da"
3: Working Directory: /var/jenkins/workspace/adamantine-nightly/build/tests
3: Test timeout computed to be: 7200
3: Running 3 test cases...
3: Running 3 test cases...
3: [1;34;49mEntering test module "Integration_Data_Assimilation"
3: [1;34;49mEntering test module "Integration_Data_Assimilation"
3: [0;39;49m[1;34;49m/var/jenkins/workspace/adamantine-nightly/tests/test_integration_da.cc(78): Entering test case "integration_data_assimilation"
3: [0;39;49m[1;34;49m/var/jenkins/workspace/adamantine-nightly/tests/test_integration_da.cc(78): Entering test case "integration_data_assimilation"
3: Running 3 test cases...
3: [1;34;49mEntering test module "Integration_Data_Assimilation"
3: [0;39;49m[1;34;49m/var/jenkins/workspace/adamantine-nightly/tests/test_integration_da.cc(78): Entering test case "integration_data_assimilation"
3: [0;39;49mReading the experimental log file...
3: Done. Log entries found for 1 camera(s), with 2 frame(s).
3: Starting the main time stepping loop...
3: 10% completed
3: 20% completed
3: 30% completed
3: 40% completed
3: [0;39;49mRank: 2 | Old parameters for member 2:
3: [0;39;49mRank: 1 | Old parameters for member 1:
3: Rank: 2 | Number expt sites mapped to DOFs: 1
3: Rank: 1 | Number expt sites mapped to DOFs: 1
3: Performing data assimilation at time 0.0211...
3: Rank: 0 | Old parameters for member 0:
3: Rank: 0 | Number expt sites mapped to DOFs: 1
3: Getting the perturbed innovation...
3: Applying the Kalman gain...
3: Updating the ensemble members...
3: Done.
3: 50% completed
3: 60% completed
3: Rank: 2 | Old parameters for member 2:
3: Rank: 1 | Old parameters for member 1:
3: Rank: 2 | Number expt sites mapped to DOFs: 1
3: Rank: 1 | Number expt sites mapped to DOFs: 1
3: Performing data assimilation at time 0.0316...
3: Rank: 0 | Old parameters for member 0:
3: Rank: 0 | Number expt sites mapped to DOFs: 1
3: Getting the perturbed innovation...
3: Applying the Kalman gain...
3: Updating the ensemble members...
3: Done.
3: 70% completed
3: 80% completed
3: 90% completed
3: 100% completed
3: Reading the experimental log file...
3: Done. Log entries found for 1 camera(s), with 2 frame(s).
3: Reading the experimental log file...
3: Done. Log entries found for 1 camera(s), with 2 frame(s).
3: Starting the main time stepping loop...
3: Starting the main time stepping loop...
3: Reading the experimental log file...
3: Done. Log entries found for 1 camera(s), with 2 frame(s).
3: Starting the main time stepping loop...
3: 10% completed
3: 10% completed
3: 10% completed
3: 20% completed
3: 20% completed
3: 20% completed
3: 30% completed
3: 30% completed
3: 30% completed
3: 40% completed
3: 40% completed
3: 40% completed
3: Performing data assimilation at time 0.0211...
3: Rank: 0 | Old parameters for member 0:
3: Rank: 0 | Old parameters for member 1:
3: Rank: 0 | Old parameters for member 2:
3: Performing data assimilation at time 0.0211...
3: Rank: 0 | Old parameters for member 0:
3: Rank: 0 | Old parameters for member 1:
3: Rank: 0 | Old parameters for member 2:
3: Performing data assimilation at time 0.0211...
3: Rank: 0 | Old parameters for member 0:
3: Rank: 0 | Old parameters for member 1:
3: Rank: 0 | Old parameters for member 2:
3: Rank: 0 | Number expt sites mapped to DOFs: 1
3: Rank: 0 | Number expt sites mapped to DOFs: 1
3: Rank: 0 | Number expt sites mapped to DOFs: 1
3: Getting the perturbed innovation...
3: Applying the Kalman gain...
3: Getting the perturbed innovation...
3: Applying the Kalman gain...
3: Getting the perturbed innovation...
3: Applying the Kalman gain...
3: Updating the ensemble members...
3: Done.
3: Updating the ensemble members...
3: Done.
3: Updating the ensemble members...
3: Done.
3: 50% completed
3: 50% completed
3: 50% completed
3: 60% completed
3: 60% completed
3: 60% completed
3: Performing data assimilation at time 0.0316...
3: Rank: 0 | Old parameters for member 0:
3: Rank: 0 | Old parameters for member 1:
3: Rank: 0 | Old parameters for member 2:
3: Rank: 0 | Number expt sites mapped to DOFs: 1
3: Performing data assimilation at time 0.0316...
3: Rank: 0 | Old parameters for member 0:
3: Rank: 0 | Old parameters for member 1:
3: Rank: 0 | Old parameters for member 2:
3: Performing data assimilation at time 0.0316...
3: Rank: 0 | Old parameters for member 0:
3: Rank: 0 | Old parameters for member 1:
3: Rank: 0 | Old parameters for member 2:
3: Rank: 0 | Number expt sites mapped to DOFs: 1
3: Rank: 0 | Number expt sites mapped to DOFs: 1
3: Getting the perturbed innovation...
3: Applying the Kalman gain...
3: Getting the perturbed innovation...
3: Applying the Kalman gain...
3: Getting the perturbed innovation...
3: Applying the Kalman gain...
40: 40% completed
3: Updating the ensemble members...
3: Done.
3: Updating the ensemble members...
3: Done.
3: Updating the ensemble members...
3: Done.
3: 70% completed
3: 70% completed
3: 70% completed
3: 80% completed
3: 80% completed
3: 80% completed
3: 90% completed
3: 90% completed
3: 90% completed
3: 100% completed
3: 100% completed
3: 100% completed
3: [1;34;49m/var/jenkins/workspace/adamantine-nightly/tests/test_integration_da.cc(78): Leaving test case "integration_data_assimilation"; testing time: 39836889us
3: [0;39;49m[1;34;49m/var/jenkins/workspace/adamantine-nightly/tests/test_integration_da.cc(148): Entering test case "integration_3D_da_point_cloud_add_material"
3: [1;34;49m/var/jenkins/workspace/adamantine-nightly/tests/test_integration_da.cc(78): Leaving test case "integration_data_assimilation"; testing time: 39936107us
3: [0;39;49m[1;34;49m/var/jenkins/workspace/adamantine-nightly/tests/test_integration_da.cc(148): Entering test case "integration_3D_da_point_cloud_add_material"
3: [1;34;49m/var/jenkins/workspace/adamantine-nightly/tests/test_integration_da.cc(78): Leaving test case "integration_data_assimilation"; testing time: 39944468us
3: [0;39;49m[1;34;49m/var/jenkins/workspace/adamantine-nightly/tests/test_integration_da.cc(148): Entering test case "integration_3D_da_point_cloud_add_material"
3: [0;39;49mReading the experimental log file...
3: Done. Log entries found for 1 camera(s), with 1 frame(s).
3: Starting the main time stepping loop...
3: 10% completed
3: 20% completed
3: 30% completed
3: 40% completed
3: 50% completed
3: Performing data assimilation at time 0.12...
3: Rank: 0 | Old parameters for member 0:
3: Rank: 0 | Number expt sites mapped to DOFs: 1
3: [0;39;49mRank: 2 | Old parameters for member 2:
3: [0;39;49mRank: 1 | Old parameters for member 1:
3: Rank: 2 | Number expt sites mapped to DOFs: 1
3: Rank: 1 | Number expt sites mapped to DOFs: 1
3: Getting the perturbed innovation...
3: Applying the Kalman gain...
3: Updating the ensemble members...
3: Done.
3: 60% completed
3: 70% completed
3: 80% completed
3: 90% completed
3: 100% completed
3: Reading the experimental log file...
3: Done. Log entries found for 1 camera(s), with 1 frame(s).
3: Reading the experimental log file...
3: Done. Log entries found for 1 camera(s), with 1 frame(s).
3: Reading the experimental log file...
3: Done. Log entries found for 1 camera(s), with 1 frame(s).
3: Starting the main time stepping loop...
3: Starting the main time stepping loop...
3: Starting the main time stepping loop...
3: 10% completed
3: 10% completed
3: 10% completed
3: 20% completed
3: 20% completed
3: 20% completed
3: 30% completed
3: 30% completed
3: 30% completed
3: 40% completed
3: 40% completed
3: 40% completed
3: 50% completed
3: 50% completed
3: 50% completed
3: Performing data assimilation at time 0.12...
3: Rank: 0 | Old parameters for member 0:
3: Rank: 0 | Old parameters for member 1:
3: Rank: 0 | Old parameters for member 2:
3: Rank: 0 | Number expt sites mapped to DOFs: 1
3: Performing data assimilation at time 0.12...
3: Rank: 0 | Old parameters for member 0:
3: Rank: 0 | Old parameters for member 1:
3: Rank: 0 | Old parameters for member 2:
3: Performing data assimilation at time 0.12...
3: Rank: 0 | Old parameters for member 0:
3: Rank: 0 | Old parameters for member 1:
3: Rank: 0 | Old parameters for member 2:
3: Rank: 0 | Number expt sites mapped to DOFs: 1
3: Rank: 0 | Number expt sites mapped to DOFs: 1
3: Getting the perturbed innovation...
3: Applying the Kalman gain...
3: Getting the perturbed innovation...
3: Applying the Kalman gain...
3: Getting the perturbed innovation...
3: Applying the Kalman gain...
3: Updating the ensemble members...
3: Done.
3: 60% completed
3: Updating the ensemble members...
3: Done.
3: 60% completed
3: Updating the ensemble members...
3: Done.
3: 60% completed
3: 70% completed
3: 70% completed
3: 70% completed
3: 80% completed
3: 80% completed
3: 80% completed
3: 90% completed
3: 90% completed
3: 90% completed
3: 100% completed
3: 100% completed
3: 100% completed
3: [1;34;49m/var/jenkins/workspace/adamantine-nightly/tests/test_integration_da.cc(148): Leaving test case "integration_3D_da_point_cloud_add_material"; testing time: 1701969us
3: [0;39;49m[1;34;49m/var/jenkins/workspace/adamantine-nightly/tests/test_integration_da.cc(231): Entering test case "integration_3D_da_ray_add_material"
3: [1;34;49m/var/jenkins/workspace/adamantine-nightly/tests/test_integration_da.cc(148): Leaving test case "integration_3D_da_point_cloud_add_material"; testing time: 1834431us
3: [0;39;49m[1;34;49m/var/jenkins/workspace/adamantine-nightly/tests/test_integration_da.cc(231): Entering test case "integration_3D_da_ray_add_material"
3: [1;34;49m/var/jenkins/workspace/adamantine-nightly/tests/test_integration_da.cc(148): Leaving test case "integration_3D_da_point_cloud_add_material"; testing time: 1742784us
3: [0;39;49m[1;34;49m/var/jenkins/workspace/adamantine-nightly/tests/test_integration_da.cc(231): Entering test case "integration_3D_da_ray_add_material"
3: [0;39;49mReading the experimental log file...
3: Done. Log entries found for 1 camera(s), with 1 frame(s).
3: Starting the main time stepping loop...
3: 10% completed
3: 20% completed
3: 30% completed
3: 40% completed
3: 50% completed
3: Performing data assimilation at time 0.12...
3: Rank: 0 | Old parameters for member 0:
3: [0;39;49mRank: 2 | Old parameters for member 2:
3: [0;39;49mRank: 1 | Old parameters for member 1:
3: Rank: 0 | Number expt sites mapped to DOFs: 1
3: Rank: 1 | Number expt sites mapped to DOFs: 1
3: Rank: 2 | Number expt sites mapped to DOFs: 1
3: Getting the perturbed innovation...
3: Applying the Kalman gain...
3: Updating the ensemble members...
3: Done.
3: 60% completed
3: 70% completed
3: 80% completed
3: 90% completed
3: 100% completed
3: Reading the experimental log file...
3: Done. Log entries found for 1 camera(s), with 1 frame(s).
3: Reading the experimental log file...
3: Done. Log entries found for 1 camera(s), with 1 frame(s).
3: Reading the experimental log file...
3: Done. Log entries found for 1 camera(s), with 1 frame(s).
3: Starting the main time stepping loop...
3: Starting the main time stepping loop...
3: Starting the main time stepping loop...
3: 10% completed
3: 10% completed
3: 10% completed
3: 20% completed
3: 20% completed
3: 20% completed
3: 30% completed
3: 30% completed
3: 30% completed
3: 40% completed
3: 40% completed
3: 40% completed
3: 50% completed
3: 50% completed
3: 50% completed
3: Performing data assimilation at time 0.12...
3: Rank: 0 | Old parameters for member 0:
3: Rank: 0 | Old parameters for member 1:
3: Rank: 0 | Old parameters for member 2:
3: Rank: 0 | Number expt sites mapped to DOFs: 1
3: Performing data assimilation at time 0.12...
3: Rank: 0 | Old parameters for member 0:
3: Rank: 0 | Old parameters for member 1:
3: Performing data assimilation at time 0.12...
3: Rank: 0 | Old parameters for member 0:
3: Rank: 0 | Old parameters for member 2:
3: Rank: 0 | Old parameters for member 1:
3: Rank: 0 | Old parameters for member 2:
3: Rank: 0 | Number expt sites mapped to DOFs: 1
3: Rank: 0 | Number expt sites mapped to DOFs: 1
3: Getting the perturbed innovation...
3: Applying the Kalman gain...
3: Getting the perturbed innovation...
3: Applying the Kalman gain...
3: Getting the perturbed innovation...
3: Applying the Kalman gain...
3: Updating the ensemble members...
3: Done.
3: 60% completed
3: Updating the ensemble members...
3: Done.
3: 60% completed
3: Updating the ensemble members...
3: Done.
3: 60% completed
3: 70% completed
3: 70% completed
3: 80% completed
3: 70% completed
3: 80% completed
3: 90% completed
3: 80% completed
3: 90% completed
3: 90% completed
3: 100% completed
3: 100% completed
3: [1;34;49m/var/jenkins/workspace/adamantine-nightly/tests/test_integration_da.cc(231): Leaving test case "integration_3D_da_ray_add_material"; testing time: 1711526us
3: [0;39;49m[1;34;49mLeaving test module "Integration_Data_Assimilation"; testing time: 43358114us
3: [0;39;49m
3: [1;32;49m*** No errors detected
3: [0;39;49m100% completed
3: [1;34;49m/var/jenkins/workspace/adamantine-nightly/tests/test_integration_da.cc(231): Leaving test case "integration_3D_da_ray_add_material"; testing time: 1706806us
3: [0;39;49m[1;34;49mLeaving test module "Integration_Data_Assimilation"; testing time: 43385855us
3: [0;39;49m
3: [1;32;49m*** No errors detected
3: [0;39;49m[1;34;49m/var/jenkins/workspace/adamantine-nightly/tests/test_integration_da.cc(231): Leaving test case "integration_3D_da_ray_add_material"; testing time: 1727231us
3: [0;39;49m[1;34;49mLeaving test module "Integration_Data_Assimilation"; testing time: 43398718us
3: [0;39;49m
3: [1;32;49m*** No errors detected
3: [0;39;49m
45/48 Test #3: test_integration_da_3 .................... Passed 44.03 sec
test 4
Start 4: test_integration_da_6
4: Test command: /usr/bin/mpiexec "-n" "6" "/var/jenkins/workspace/adamantine-nightly/build/bin/test_integration_da"
4: Working Directory: /var/jenkins/workspace/adamantine-nightly/build/tests
4: Test timeout computed to be: 7200
4: Running 3 test cases...
4: Running 3 test cases...
4: [1;34;49mEntering test module "Integration_Data_Assimilation"
4: Running 3 test cases...
4: Running 3 test cases...
4: [0;39;49m[1;34;49m/var/jenkins/workspace/adamantine-nightly/tests/test_integration_da.cc(78): Entering test case "integration_data_assimilation"
4: Running 3 test cases...
4: [1;34;49mEntering test module "Integration_Data_Assimilation"
4: [1;34;49mEntering test module "Integration_Data_Assimilation"
4: [0;39;49m[1;34;49m/var/jenkins/workspace/adamantine-nightly/tests/test_integration_da.cc(78): Entering test case "integration_data_assimilation"
4: [1;34;49mEntering test module "Integration_Data_Assimilation"
4: [0;39;49m[1;34;49m/var/jenkins/workspace/adamantine-nightly/tests/test_integration_da.cc(78): Entering test case "integration_data_assimilation"
4: [1;34;49mEntering test module "Integration_Data_Assimilation"
4: [0;39;49m[1;34;49m/var/jenkins/workspace/adamantine-nightly/tests/test_integration_da.cc(78): Entering test case "integration_data_assimilation"
4: Running 3 test cases...
4: [0;39;49m[1;34;49m/var/jenkins/workspace/adamantine-nightly/tests/test_integration_da.cc(78): Entering test case "integration_data_assimilation"
4: [1;34;49mEntering test module "Integration_Data_Assimilation"
4: [0;39;49m[1;34;49m/var/jenkins/workspace/adamantine-nightly/tests/test_integration_da.cc(78): Entering test case "integration_data_assimilation"
4: [0;39;49mReading the experimental log file...
4: Done. Log entries found for 1 camera(s), with 2 frame(s).
4: Starting the main time stepping loop...
4: 10% completed
4: 20% completed
4: 30% completed
4: 40% completed
4: [0;39;49mRank: 3 | Old parameters for member 1:
4: [0;39;49mRank: 2 | Old parameters for member 1:
4: Performing data assimilation at time 0.0211...
4: Rank: 0 | Old parameters for member 0:
4: [0;39;49mRank: 1 | Old parameters for member 0:
4: Rank: 2 | Number expt sites mapped to DOFs: 1
4: Rank: 3 | Number expt sites mapped to DOFs: 1
4: Rank: 1 | Number expt sites mapped to DOFs: 1
4: Rank: 0 | Number expt sites mapped to DOFs: 1
4: [0;39;49mRank: 5 | Old parameters for member 2:
4: [0;39;49mRank: 4 | Old parameters for member 2:
4: Rank: 5 | Number expt sites mapped to DOFs: 1
4: Rank: 4 | Number expt sites mapped to DOFs: 1
4: Getting the perturbed innovation...
4: Applying the Kalman gain...
4: Updating the ensemble members...
4: Done.
4: 50% completed
4: 60% completed
4: Performing data assimilation at time 0.0316...
4: Rank: 0 | Old parameters for member 0:
4: Rank: 1 | Old parameters for member 0:
4: Rank: 1 | Number expt sites mapped to DOFs: 1
4: Rank: 0 | Number expt sites mapped to DOFs: 1
4: Rank: 3 | Old parameters for member 1:
4: Rank: 2 | Old parameters for member 1:
4: Rank: 3 | Number expt sites mapped to DOFs: 1
4: Rank: 2 | Number expt sites mapped to DOFs: 1
4: Rank: 4 | Old parameters for member 2:
4: Rank: 5 | Old parameters for member 2:
4: Rank: 5 | Number expt sites mapped to DOFs: 1
4: Rank: 4 | Number expt sites mapped to DOFs: 1
4: Getting the perturbed innovation...
4: Applying the Kalman gain...
4: Updating the ensemble members...
4: Done.
4: 70% completed
4: 80% completed
4: 90% completed
4: 100% completed
4: Reading the experimental log file...
4: Done. Log entries found for 1 camera(s), with 2 frame(s).
4: Reading the experimental log file...
4: Done. Log entries found for 1 camera(s), with 2 frame(s).
4: Reading the experimental log file...
4: Done. Log entries found for 1 camera(s), with 2 frame(s).
4: Reading the experimental log file...
4: Done. Log entries found for 1 camera(s), with 2 frame(s).
4: Reading the experimental log file...
4: Done. Log entries found for 1 camera(s), with 2 frame(s).
4: Reading the experimental log file...
4: Done. Log entries found for 1 camera(s), with 2 frame(s).
4: Starting the main time stepping loop...
4: Starting the main time stepping loop...
4: Starting the main time stepping loop...
4: Starting the main time stepping loop...
4: Starting the main time stepping loop...
4: Starting the main time stepping loop...
4: 10% completed
4: 10% completed
4: 10% completed
4: 10% completed
4: 10% completed
4: 10% completed
4: 20% completed
4: 20% completed
4: 20% completed
4: 20% completed
4: 20% completed
4: 20% completed
4: 30% completed
4: 30% completed
4: 30% completed
4: 30% completed
4: 30% completed
4: 30% completed
4: 40% completed
4: 40% completed
4: 40% completed
4: 40% completed
4: 40% completed
4: 40% completed
4: Performing data assimilation at time 0.0211...
4: Rank: 0 | Old parameters for member 0:
4: Rank: 0 | Old parameters for member 1:
4: Rank: 0 | Old parameters for member 2:
4: Rank: 0 | Number expt sites mapped to DOFs: 1
4: Performing data assimilation at time 0.0211...
4: Rank: 0 | Old parameters for member 0:
4: Rank: 0 | Old parameters for member 1:
4: Rank: 0 | Old parameters for member 2:
4: Rank: 0 | Number expt sites mapped to DOFs: 1
4: Performing data assimilation at time 0.0211...
4: Rank: 0 | Old parameters for member 0:
4: Rank: 0 | Old parameters for member 1:
4: Rank: 0 | Old parameters for member 2:
4: Rank: 0 | Number expt sites mapped to DOFs: 1
4: Performing data assimilation at time 0.0211...
4: Performing data assimilation at time 0.0211...
4: Rank: 0 | Old parameters for member 0:
4: Rank: 0 | Old parameters for member 1:
4: Rank: 0 | Old parameters for member 2:
4: Performing data assimilation at time 0.0211...
4: Rank: 0 | Old parameters for member 0:
4: Rank: 0 | Old parameters for member 1:
4: Rank: 0 | Old parameters for member 2:
4: Rank: 0 | Old parameters for member 0:
4: Rank: 0 | Old parameters for member 1:
4: Rank: 0 | Old parameters for member 2:
4: Rank: 0 | Number expt sites mapped to DOFs: 1
4: Rank: 0 | Number expt sites mapped to DOFs: 1
4: Rank: 0 | Number expt sites mapped to DOFs: 1
4: Getting the perturbed innovation...
4: Applying the Kalman gain...
4: Getting the perturbed innovation...
4: Applying the Kalman gain...
4: Getting the perturbed innovation...
4: Applying the Kalman gain...
4: Getting the perturbed innovation...
4: Applying the Kalman gain...
4: Getting the perturbed innovation...
4: Applying the Kalman gain...
4: Getting the perturbed innovation...
4: Applying the Kalman gain...
4: Updating the ensemble members...
4: Done.
4: Updating the ensemble members...
4: Done.
4: Updating the ensemble members...
4: Updating the ensemble members...
4: Done.
4: Done.
4: Updating the ensemble members...
4: Updating the ensemble members...
4: Done.
4: Done.
4: 50% completed
4: 50% completed
4: 50% completed
4: 50% completed
4: 50% completed
4: 50% completed
4: 60% completed
4: 60% completed
4: 60% completed
4: 60% completed
4: 60% completed
4: 60% completed
4: Performing data assimilation at time 0.0316...
4: Rank: 0 | Old parameters for member 0:
4: Rank: 0 | Old parameters for member 1:
4: Rank: 0 | Old parameters for member 2:
4: Rank: 0 | Number expt sites mapped to DOFs: 1
4: Performing data assimilation at time 0.0316...
4: Rank: 0 | Old parameters for member 0:
4: Rank: 0 | Old parameters for member 1:
4: Rank: 0 | Old parameters for member 2:
4: Rank: 0 | Number expt sites mapped to DOFs: 1
4: Performing data assimilation at time 0.0316...
4: Rank: 0 | Old parameters for member 0:
4: Rank: 0 | Old parameters for member 1:
4: Rank: 0 | Old parameters for member 2:
4: Rank: 0 | Number expt sites mapped to DOFs: 1
4: Performing data assimilation at time 0.0316...
4: Rank: 0 | Old parameters for member 0:
4: Rank: 0 | Old parameters for member 1:
4: Rank: 0 | Old parameters for member 2:
4: Rank: 0 | Number expt sites mapped to DOFs: 1
4: Performing data assimilation at time 0.0316...
4: Rank: 0 | Old parameters for member 0:
4: Rank: 0 | Old parameters for member 1:
4: Rank: 0 | Old parameters for member 2:
4: Performing data assimilation at time 0.0316...
4: Rank: 0 | Old parameters for member 0:
4: Rank: 0 | Old parameters for member 1:
4: Rank: 0 | Old parameters for member 2:
4: Rank: 0 | Number expt sites mapped to DOFs: 1
4: Rank: 0 | Number expt sites mapped to DOFs: 1
4: Getting the perturbed innovation...
4: Applying the Kalman gain...
4: Getting the perturbed innovation...
4: Applying the Kalman gain...
4: Getting the perturbed innovation...
4: Applying the Kalman gain...
4: Getting the perturbed innovation...
4: Applying the Kalman gain...
4: Getting the perturbed innovation...
4: Applying the Kalman gain...
4: Getting the perturbed innovation...
4: Applying the Kalman gain...
4: Updating the ensemble members...
4: Done.
4: Updating the ensemble members...
4: Done.
4: Updating the ensemble members...
4: Done.
4: Updating the ensemble members...
4: Done.
4: Updating the ensemble members...
4: Updating the ensemble members...
4: Done.
4: Done.
4: 70% completed
4: 70% completed
4: 70% completed
4: 70% completed
4: 70% completed
4: 70% completed
4: 80% completed
4: 80% completed
4: 80% completed
4: 80% completed
4: 80% completed
4: 80% completed
4: 90% completed
4: 90% completed
4: 90% completed
4: 90% completed
4: 90% completed
4: 90% completed
4: 100% completed
4: [1;34;49m/var/jenkins/workspace/adamantine-nightly/tests/test_integration_da.cc(78): Leaving test case "integration_data_assimilation"; testing time: 36511555us
4: [0;39;49m[1;34;49m/var/jenkins/workspace/adamantine-nightly/tests/test_integration_da.cc(148): Entering test case "integration_3D_da_point_cloud_add_material"
4: 100% completed
4: 100% completed
4: [1;34;49m/var/jenkins/workspace/adamantine-nightly/tests/test_integration_da.cc(78): Leaving test case "integration_data_assimilation"; testing time: 36780471us
4: [0;39;49m[1;34;49m/var/jenkins/workspace/adamantine-nightly/tests/test_integration_da.cc(148): Entering test case "integration_3D_da_point_cloud_add_material"
4: [1;34;49m/var/jenkins/workspace/adamantine-nightly/tests/test_integration_da.cc(78): Leaving test case "integration_data_assimilation"; testing time: 36785450us
4: [0;39;49m[1;34;49m/var/jenkins/workspace/adamantine-nightly/tests/test_integration_da.cc(148): Entering test case "integration_3D_da_point_cloud_add_material"
4: 100% completed
4: 100% completed
4: 100% completed
4: [1;34;49m/var/jenkins/workspace/adamantine-nightly/tests/test_integration_da.cc(78): Leaving test case "integration_data_assimilation"; testing time: 37067832us
4: [0;39;49m[1;34;49m/var/jenkins/workspace/adamantine-nightly/tests/test_integration_da.cc(148): Entering test case "integration_3D_da_point_cloud_add_material"
4: [1;34;49m/var/jenkins/workspace/adamantine-nightly/tests/test_integration_da.cc(78): Leaving test case "integration_data_assimilation"; testing time: 37181871us
4: [0;39;49m[1;34;49m/var/jenkins/workspace/adamantine-nightly/tests/test_integration_da.cc(148): Entering test case "integration_3D_da_point_cloud_add_material"
4: [1;34;49m/var/jenkins/workspace/adamantine-nightly/tests/test_integration_da.cc(78): Leaving test case "integration_data_assimilation"; testing time: 37198479us
4: [0;39;49m[1;34;49m/var/jenkins/workspace/adamantine-nightly/tests/test_integration_da.cc(148): Entering test case "integration_3D_da_point_cloud_add_material"
4: [0;39;49mReading the experimental log file...
4: Done. Log entries found for 1 camera(s), with 1 frame(s).
4: Starting the main time stepping loop...
4: 10% completed
4: 20% completed
4: 30% completed
4: 40% completed
4: 50% completed
4: Performing data assimilation at time 0.12...
4: [0;39;49mRank: 1 | Old parameters for member 0:
4: Rank: 0 | Old parameters for member 0:
4: [0;39;49mRank: 2 | Old parameters for member 1:
4: [0;39;49mRank: 3 | Old parameters for member 1:
4: Rank: 0 | Number expt sites mapped to DOFs: 1
4: Rank: 1 | Number expt sites mapped to DOFs: 1
4: Rank: 2 | Number expt sites mapped to DOFs: 1
4: Rank: 3 | Number expt sites mapped to DOFs: 1
4: [0;39;49mRank: 4 | Old parameters for member 2:
4: [0;39;49mRank: 5 | Old parameters for member 2:
4: Rank: 5 | Number expt sites mapped to DOFs: 1
4: Rank: 4 | Number expt sites mapped to DOFs: 1
4: Getting the perturbed innovation...
4: Applying the Kalman gain...
4: Updating the ensemble members...
4: Done.
4: 60% completed
4: 70% completed
4: 80% completed
4: 90% completed
4: 100% completed
4: Reading the experimental log file...
4: Done. Log entries found for 1 camera(s), with 1 frame(s).
4: Reading the experimental log file...
4: Done. Log entries found for 1 camera(s), with 1 frame(s).
4: Reading the experimental log file...
4: Done. Log entries found for 1 camera(s), with 1 frame(s).
4: Reading the experimental log file...
4: Done. Log entries found for 1 camera(s), with 1 frame(s).
4: Reading the experimental log file...
4: Done. Log entries found for 1 camera(s), with 1 frame(s).
4: Starting the main time stepping loop...
4: Reading the experimental log file...
4: Done. Log entries found for 1 camera(s), with 1 frame(s).
4: Starting the main time stepping loop...
4: Starting the main time stepping loop...
4: Starting the main time stepping loop...
4: Starting the main time stepping loop...
4: Starting the main time stepping loop...
4: 10% completed
4: 10% completed
4: 10% completed
4: 20% completed
4: 20% completed
4: 10% completed
4: 10% completed
4: 10% completed
4: 20% completed
4: 30% completed
4: 30% completed
4: 20% completed
4: 20% completed
4: 20% completed
4: 30% completed
4: 40% completed
4: 40% completed
4: 40% completed
4: 30% completed
4: 30% completed
4: 30% completed
4: 50% completed
4: 50% completed
4: 50% completed
4: Performing data assimilation at time 0.12...
4: Rank: 0 | Old parameters for member 0:
4: Rank: 0 | Old parameters for member 1:
4: Rank: 0 | Old parameters for member 2:
4: Rank: 0 | Number expt sites mapped to DOFs: 1
4: 40% completed
4: 40% completed
4: 40% completed
4: Performing data assimilation at time 0.12...
4: Rank: 0 | Old parameters for member 0:
4: Rank: 0 | Old parameters for member 1:
4: Rank: 0 | Old parameters for member 2:
4: Rank: 0 | Number expt sites mapped to DOFs: 1
4: Performing data assimilation at time 0.12...
4: Rank: 0 | Old parameters for member 0:
4: Rank: 0 | Old parameters for member 1:
4: Rank: 0 | Old parameters for member 2:
4: Rank: 0 | Number expt sites mapped to DOFs: 1
4: 50% completed
4: 50% completed
4: 50% completed
4: Performing data assimilation at time 0.12...
4: Performing data assimilation at time 0.12...
4: Rank: 0 | Old parameters for member 0:
4: Rank: 0 | Old parameters for member 1:
4: Rank: 0 | Old parameters for member 2:
4: Performing data assimilation at time 0.12...
4: Rank: 0 | Old parameters for member 0:
4: Rank: 0 | Old parameters for member 1:
4: Rank: 0 | Old parameters for member 2:
4: Rank: 0 | Old parameters for member 0:
4: Rank: 0 | Old parameters for member 1:
4: Rank: 0 | Old parameters for member 2:
4: Rank: 0 | Number expt sites mapped to DOFs: 1
4: Rank: 0 | Number expt sites mapped to DOFs: 1
4: Rank: 0 | Number expt sites mapped to DOFs: 1
4: Getting the perturbed innovation...
4: Applying the Kalman gain...
4: Getting the perturbed innovation...
4: Applying the Kalman gain...
4: Getting the perturbed innovation...
4: Applying the Kalman gain...
4: Getting the perturbed innovation...
4: Applying the Kalman gain...
4: Getting the perturbed innovation...
4: Applying the Kalman gain...
4: Getting the perturbed innovation...
4: Applying the Kalman gain...
4: Updating the ensemble members...
4: Done.
4: 60% completed
4: Updating the ensemble members...
4: Done.
4: 60% completed
4: Updating the ensemble members...
4: Done.
4: 60% completed
4: 70% completed
4: 70% completed
4: 70% completed
4: 80% completed
4: 80% completed
4: 80% completed
4: 90% completed
4: 90% completed
4: Updating the ensemble members...
4: Done.
4: 60% completed
4: Updating the ensemble members...
4: 90% completed
4: Updating the ensemble members...
4: Done.
4: 60% completed
4: Done.
4: 60% completed
4: 70% completed
4: 70% completed
4: 70% completed
4: 80% completed
4: 80% completed
4: 80% completed
4: 90% completed
4: 90% completed
4: 90% completed
4: 100% completed
4: 100% completed
4: 100% completed
4: [1;34;49m/var/jenkins/workspace/adamantine-nightly/tests/test_integration_da.cc(148): Leaving test case "integration_3D_da_point_cloud_add_material"; testing time: 2336905us
4: [0;39;49m[1;34;49m/var/jenkins/workspace/adamantine-nightly/tests/test_integration_da.cc(231): Entering test case "integration_3D_da_ray_add_material"
4: [1;34;49m/var/jenkins/workspace/adamantine-nightly/tests/test_integration_da.cc(148): Leaving test case "integration_3D_da_point_cloud_add_material"; testing time: 2079834us
4: [0;39;49m[1;34;49m/var/jenkins/workspace/adamantine-nightly/tests/test_integration_da.cc(231): Entering test case "integration_3D_da_ray_add_material"
4: [1;34;49m/var/jenkins/workspace/adamantine-nightly/tests/test_integration_da.cc(148): Leaving test case "integration_3D_da_point_cloud_add_material"; testing time: 2087659us
4: [0;39;49m[1;34;49m/var/jenkins/workspace/adamantine-nightly/tests/test_integration_da.cc(231): Entering test case "integration_3D_da_ray_add_material"
4: 100% completed
4: 100% completed
4: 100% completed
4: [1;34;49m/var/jenkins/workspace/adamantine-nightly/tests/test_integration_da.cc(148): Leaving test case "integration_3D_da_point_cloud_add_material"; testing time: 1765023us
4: [0;39;49m[1;34;49m/var/jenkins/workspace/adamantine-nightly/tests/test_integration_da.cc(231): Entering test case "integration_3D_da_ray_add_material"
4: [1;34;49m/var/jenkins/workspace/adamantine-nightly/tests/test_integration_da.cc(148): Leaving test case "integration_3D_da_point_cloud_add_material"; testing time: 1779905us
4: [0;39;49m[1;34;49m/var/jenkins/workspace/adamantine-nightly/tests/test_integration_da.cc(231): Entering test case "integration_3D_da_ray_add_material"
4: [1;34;49m/var/jenkins/workspace/adamantine-nightly/tests/test_integration_da.cc(148): Leaving test case "integration_3D_da_point_cloud_add_material"; testing time: 1913358us
4: [0;39;49m[1;34;49m/var/jenkins/workspace/adamantine-nightly/tests/test_integration_da.cc(231): Entering test case "integration_3D_da_ray_add_material"
4: [0;39;49mReading the experimental log file...
4: Done. Log entries found for 1 camera(s), with 1 frame(s).
4: Starting the main time stepping loop...
4: 10% completed
4: 20% completed
4: 30% completed
4: 40% completed
4: [0;39;49mRank: 3 | Old parameters for member 1:
4: [0;39;49mRank: 2 | Old parameters for member 1:
4: [0;39;49mRank: 4 | Old parameters for member 2:
4: [0;39;49mRank: 5 | Old parameters for member 2:
4: Rank: 2 | Number expt sites mapped to DOFs: 1
4: Rank: 3 | Number expt sites mapped to DOFs: 1
4: Rank: 5 | Number expt sites mapped to DOFs: 1
4: Rank: 4 | Number expt sites mapped to DOFs: 1
4: 50% completed
4: Performing data assimilation at time 0.12...
4: [0;39;49mRank: 1 | Old parameters for member 0:
4: Rank: 0 | Old parameters for member 0:
4: Rank: 1 | Number expt sites mapped to DOFs: 1
4: Rank: 0 | Number expt sites mapped to DOFs: 1
4: Getting the perturbed innovation...
4: Applying the Kalman gain...
4: Updating the ensemble members...
4: Done.
4: 60% completed
4: 70% completed
4: 80% completed
4: 90% completed
4: 100% completed
4: Reading the experimental log file...
4: Done. Log entries found for 1 camera(s), with 1 frame(s).
4: Reading the experimental log file...
4: Done. Log entries found for 1 camera(s), with 1 frame(s).
4: Reading the experimental log file...
4: Done. Log entries found for 1 camera(s), with 1 frame(s).
4: Reading the experimental log file...
4: Done. Log entries found for 1 camera(s), with 1 frame(s).
4: Reading the experimental log file...
4: Done. Log entries found for 1 camera(s), with 1 frame(s).
4: Starting the main time stepping loop...
4: Reading the experimental log file...
4: Done. Log entries found for 1 camera(s), with 1 frame(s).
4: Starting the main time stepping loop...
4: Starting the main time stepping loop...
4: Starting the main time stepping loop...
4: Starting the main time stepping loop...
4: Starting the main time stepping loop...
4: 10% completed
4: 10% completed
4: 10% completed
4: 10% completed
4: 20% completed
4: 10% completed
4: 20% completed
4: 10% completed
4: 20% completed
4: 20% completed
4: 30% completed
4: 20% completed
4: 30% completed
4: 20% completed
4: 30% completed
4: 30% completed
4: 40% completed
4: 30% completed
4: 40% completed
4: 30% completed
4: 40% completed
4: 40% completed
4: 50% completed
4: 40% completed
4: 50% completed
4: 40% completed
4: 50% completed
4: 50% completed
4: Performing data assimilation at time 0.12...
4: Rank: 0 | Old parameters for member 0:
4: Rank: 0 | Old parameters for member 1:
4: Rank: 0 | Old parameters for member 2:
4: Rank: 0 | Number expt sites mapped to DOFs: 1
4: 50% completed
4: Performing data assimilation at time 0.12...
4: Rank: 0 | Old parameters for member 0:
4: Rank: 0 | Old parameters for member 1:
4: Rank: 0 | Old parameters for member 2:
4: 50% completed
4: Rank: 0 | Number expt sites mapped to DOFs: 1
4: Performing data assimilation at time 0.12...
4: Rank: 0 | Old parameters for member 0:
4: Rank: 0 | Old parameters for member 1:
4: Rank: 0 | Old parameters for member 2:
4: Rank: 0 | Number expt sites mapped to DOFs: 1
4: Performing data assimilation at time 0.12...
4: Rank: 0 | Old parameters for member 0:
4: Rank: 0 | Old parameters for member 1:
4: Rank: 0 | Old parameters for member 2:
4: Rank: 0 | Number expt sites mapped to DOFs: 1
4: Performing data assimilation at time 0.12...
4: Rank: 0 | Old parameters for member 0:
4: Rank: 0 | Old parameters for member 1:
4: Rank: 0 | Old parameters for member 2:
4: Rank: 0 | Number expt sites mapped to DOFs: 1
4: Performing data assimilation at time 0.12...
4: Rank: 0 | Old parameters for member 0:
4: Rank: 0 | Old parameters for member 1:
4: Rank: 0 | Old parameters for member 2:
4: Rank: 0 | Number expt sites mapped to DOFs: 1
4: Getting the perturbed innovation...
4: Applying the Kalman gain...
4: Getting the perturbed innovation...
4: Applying the Kalman gain...
4: Getting the perturbed innovation...
4: Applying the Kalman gain...
4: Getting the perturbed innovation...
4: Applying the Kalman gain...
4: Getting the perturbed innovation...
4: Applying the Kalman gain...
4: Getting the perturbed innovation...
4: Applying the Kalman gain...
4: Updating the ensemble members...
4: Done.
4: 60% completed
4: Updating the ensemble members...
4: Done.
4: 60% completed
4: Updating the ensemble members...
4: Done.
4: 60% completed
4: 70% completed
4: Updating the ensemble members...
4: Done.
4: 60% completed
4: 70% completed
4: Updating the ensemble members...
4: Done.
4: 60% completed
4: Updating the ensemble members...
4: Done.
4: 60% completed
4: 80% completed
4: 70% completed
4: 70% completed
4: 80% completed
4: 70% completed
4: 70% completed
4: 90% completed
4: 80% completed
4: 80% completed
4: 90% completed
4: 80% completed
4: 80% completed
4: 90% completed
4: 90% completed
4: 90% completed
4: 90% completed
4: 100% completed
4: 100% completed
4: [1;34;49m/var/jenkins/workspace/adamantine-nightly/tests/test_integration_da.cc(231): Leaving test case "integration_3D_da_ray_add_material"; testing time: 1824526us
4: [0;39;49m[1;34;49mLeaving test module "Integration_Data_Assimilation"; testing time: 40685120us
4: [0;39;49m
4: [1;32;49m*** No errors detected
4: [0;39;49m[1;34;49m/var/jenkins/workspace/adamantine-nightly/tests/test_integration_da.cc(231): Leaving test case "integration_3D_da_ray_add_material"; testing time: 1849728us
4: [0;39;49m[1;34;49mLeaving test module "Integration_Data_Assimilation"; testing time: 40698401us
4: [0;39;49m
4: [1;32;49m*** No errors detected
4: [0;39;49m100% completed
4: 100% completed
4: 100% completed
4: 100% completed
4: [1;34;49m/var/jenkins/workspace/adamantine-nightly/tests/test_integration_da.cc(231): Leaving test case "integration_3D_da_ray_add_material"; testing time: 1863576us
4: [0;39;49m[1;34;49mLeaving test module "Integration_Data_Assimilation"; testing time: 40736940us
4: [0;39;49m
4: [1;32;49m*** No errors detected
4: [0;39;49m[1;34;49m/var/jenkins/workspace/adamantine-nightly/tests/test_integration_da.cc(231): Leaving test case "integration_3D_da_ray_add_material"; testing time: 1797067us
4: [0;39;49m[1;34;49mLeaving test module "Integration_Data_Assimilation"; testing time: 40744235us
4: [0;39;49m
4: [1;32;49m*** No errors detected
4: [0;39;49m[1;34;49m/var/jenkins/workspace/adamantine-nightly/tests/test_integration_da.cc(231): Leaving test case "integration_3D_da_ray_add_material"; testing time: 1771667us
4: [0;39;49m[1;34;49mLeaving test module "Integration_Data_Assimilation"; testing time: 40750366us
4: [0;39;49m
4: [1;32;49m*** No errors detected
4: [0;39;49m[1;34;49m/var/jenkins/workspace/adamantine-nightly/tests/test_integration_da.cc(231): Leaving test case "integration_3D_da_ray_add_material"; testing time: 1774830us
4: [0;39;49m[1;34;49mLeaving test module "Integration_Data_Assimilation"; testing time: 40756408us
4: [0;39;49m
4: [1;32;49m*** No errors detected
4: [0;39;49m
46/48 Test #4: test_integration_da_6 .................... Passed 41.49 sec
test 7
Start 7: test_closest_source_point_adaptation_3
7: Test command: /usr/bin/mpiexec "-n" "3" "/var/jenkins/workspace/adamantine-nightly/build/bin/test_closest_source_point_adaptation"
7: Working Directory: /var/jenkins/workspace/adamantine-nightly/build/tests
7: Test timeout computed to be: 7200
7: Running 1 test case...
7: [1;34;49mEntering test module "ClosestSourcePointAdaptation"
7: [0;39;49m[1;34;49m/var/jenkins/workspace/adamantine-nightly/tests/test_closest_source_point_adaptation.cc(123): Entering test case "closest_source_point_adaptation"
7: Running 1 test case...
7: [1;34;49mEntering test module "ClosestSourcePointAdaptation"
7: [0;39;49m[1;34;49m/var/jenkins/workspace/adamantine-nightly/tests/test_closest_source_point_adaptation.cc(123): Entering test case "closest_source_point_adaptation"
7: Running 1 test case...
7: [1;34;49mEntering test module "ClosestSourcePointAdaptation"
7: [0;39;49m[1;34;49m/var/jenkins/workspace/adamantine-nightly/tests/test_closest_source_point_adaptation.cc(123): Entering test case "closest_source_point_adaptation"
7: [0;39;49m[1;34;49m/var/jenkins/workspace/adamantine-nightly/tests/test_closest_source_point_adaptation.cc(123): Leaving test case "closest_source_point_adaptation"; testing time: 5856484us
7: [0;39;49m[1;34;49mLeaving test module "ClosestSourcePointAdaptation"; testing time: 5856594us
7: [0;39;49m[0;39;49m[1;34;49m/var/jenkins/workspace/adamantine-nightly/tests/test_closest_source_point_adaptation.cc(123): Leaving test case "closest_source_point_adaptation"; testing time: 5855988us
7:
7: [1;32;49m*** No errors detected
7: [0;39;49m[0;39;49m[1;34;49mLeaving test module "ClosestSourcePointAdaptation"; testing time: 5856196us
7: [0;39;49m
7: [1;32;49m*** No errors detected
7: [0;39;49m[0;39;49m[1;34;49m/var/jenkins/workspace/adamantine-nightly/tests/test_closest_source_point_adaptation.cc(123): Leaving test case "closest_source_point_adaptation"; testing time: 5858021us
7: [0;39;49m[1;34;49mLeaving test module "ClosestSourcePointAdaptation"; testing time: 5858199us
7: [0;39;49m
7: [1;32;49m*** No errors detected
7: [0;39;49m
47/48 Test #7: test_closest_source_point_adaptation_3 ... Passed 6.49 sec
test 8
Start 8: test_closest_source_point_adaptation_6
8: Test command: /usr/bin/mpiexec "-n" "6" "/var/jenkins/workspace/adamantine-nightly/build/bin/test_closest_source_point_adaptation"
8: Working Directory: /var/jenkins/workspace/adamantine-nightly/build/tests
8: Test timeout computed to be: 7200
8: Running 1 test case...
8: Running 1 test case...
8: [1;34;49mEntering test module "ClosestSourcePointAdaptation"
8: [0;39;49m[1;34;49m/var/jenkins/workspace/adamantine-nightly/tests/test_closest_source_point_adaptation.cc(123): Entering test case "closest_source_point_adaptation"
8: Running 1 test case...
8: [1;34;49mEntering test module "ClosestSourcePointAdaptation"
8: [0;39;49m[1;34;49m/var/jenkins/workspace/adamantine-nightly/tests/test_closest_source_point_adaptation.cc(123): Entering test case "closest_source_point_adaptation"
8: Running 1 test case...
8: [1;34;49mEntering test module "ClosestSourcePointAdaptation"
8: [0;39;49m[1;34;49m/var/jenkins/workspace/adamantine-nightly/tests/test_closest_source_point_adaptation.cc(123): Entering test case "closest_source_point_adaptation"
8: Running 1 test case...
8: [1;34;49mEntering test module "ClosestSourcePointAdaptation"
8: [0;39;49m[1;34;49m/var/jenkins/workspace/adamantine-nightly/tests/test_closest_source_point_adaptation.cc(123): Entering test case "closest_source_point_adaptation"
8: Running 1 test case...
8: [1;34;49mEntering test module "ClosestSourcePointAdaptation"
8: [0;39;49m[1;34;49m/var/jenkins/workspace/adamantine-nightly/tests/test_closest_source_point_adaptation.cc(123): Entering test case "closest_source_point_adaptation"
8: [1;34;49mEntering test module "ClosestSourcePointAdaptation"
8: [0;39;49m[1;34;49m/var/jenkins/workspace/adamantine-nightly/tests/test_closest_source_point_adaptation.cc(123): Entering test case "closest_source_point_adaptation"
8: [0;39;49m[1;34;49m/var/jenkins/workspace/adamantine-nightly/tests/test_closest_source_point_adaptation.cc(123): Leaving test case "closest_source_point_adaptation"; testing time: 3689139us
8: [0;39;49m[1;34;49mLeaving test module "ClosestSourcePointAdaptation"; testing time: 3689208us
8: [0;39;49m[0;39;49m[1;34;49m/var/jenkins/workspace/adamantine-nightly/tests/test_closest_source_point_adaptation.cc(123): Leaving test case "closest_source_point_adaptation"; testing time: 3689211us
8: [0;39;49m[1;34;49mLeaving test module "ClosestSourcePointAdaptation"; testing time: 3689276us
8: [0;39;49m[0;39;49m[1;34;49m/var/jenkins/workspace/adamantine-nightly/tests/test_closest_source_point_adaptation.cc(123): Leaving test case "closest_source_point_adaptation"; testing time: 3689277us
8: [0;39;49m[1;34;49mLeaving test module "ClosestSourcePointAdaptation"; testing time: 3689329us
8: [0;39;49m
8: [1;32;49m*** No errors detected
8: [0;39;49m
8: [1;32;49m*** No errors detected
8: [0;39;49m
8: [1;32;49m*** No errors detected
8: [0;39;49m
8: [1;32;49m*** No errors detected
8: [0;39;49m
8: [1;32;49m*** No errors detected
8: [0;39;49m
8: [1;32;49m*** No errors detected
8: [0;39;49m[0;39;49m[1;34;49m/var/jenkins/workspace/adamantine-nightly/tests/test_closest_source_point_adaptation.cc(123): Leaving test case "closest_source_point_adaptation"; testing time: 3689408us
8: [0;39;49m[1;34;49mLeaving test module "ClosestSourcePointAdaptation"; testing time: 3689457us
8: [0;39;49m[0;39;49m[1;34;49m/var/jenkins/workspace/adamantine-nightly/tests/test_closest_source_point_adaptation.cc(123): Leaving test case "closest_source_point_adaptation"; testing time: 3689414us
8: [0;39;49m[1;34;49mLeaving test module "ClosestSourcePointAdaptation"; testing time: 3689467us
8: [0;39;49m[0;39;49m[1;34;49m/var/jenkins/workspace/adamantine-nightly/tests/test_closest_source_point_adaptation.cc(123): Leaving test case "closest_source_point_adaptation"; testing time: 3689668us
8: [0;39;49m[1;34;49mLeaving test module "ClosestSourcePointAdaptation"; testing time: 3689748us
8: [0;39;49m
48/48 Test #8: test_closest_source_point_adaptation_6 ... Passed 4.37 sec
The following tests passed:
test_closest_source_point_adaptation_1
test_data_assimilator_1
test_experimental_data_1
test_geometry_1
test_heat_source_1
test_integration_da_2
test_closest_source_point_adaptation_2
test_material_property_device_1
test_material_property_1
test_integration_da_1
test_post_processor_1
test_quaternion_1
test_scan_path_1
test_thermal_operator_1
test_thermal_operator_device_1
test_mechanical_operator_1
test_timer_1
test_utils_1
test_validate_input_database_1
test_integration_2d_1
test_integration_2d_device_1
test_thermal_physics_device_1
test_mechanical_physics_1
test_integration_3d_amr_1
test_integration_3d_amr_device_1
test_integration_da_augmented_1
test_material_deposition_1
test_microstructure_1
test_thermal_physics_1
test_ensemble_management_1
test_integration_3d_device_1
test_integration_2d_2
test_integration_2d_device_2
test_integration_3d_amr_2
test_integration_3d_amr_device_2
test_integration_da_augmented_2
test_material_deposition_2
test_microstructure_2
test_thermal_physics_2
test_ensemble_management_2
test_integration_thermoelastic_2
test_integration_da_3
test_integration_da_6
test_closest_source_point_adaptation_3
test_closest_source_point_adaptation_6
94% tests passed, 3 tests failed out of 48
Total Test time (real) = 10855.53 sec
The following tests FAILED:
31 - test_integration_3d_1 (Timeout)
32 - test_integration_3d_2 (Timeout)
39 - test_integration_thermoelastic_1 (Timeout)
Errors while running CTest
Output from these tests are in: /var/jenkins/workspace/adamantine-nightly/build/Testing/Temporary/LastTest.log
Use "--rerun-failed --output-on-failure" to re-run the failed cases verbosely.
[Pipeline] }
[Pipeline] // dir
Post stage
[Pipeline] xunit
INFO: Processing CTest-Version 3.x (default)
[Pipeline] }
[Pipeline] // withEnv
[Pipeline] }
$ docker stop --time=1 48b731290d5b670339db84d3fb0bcaabdc3e27cdbc746646db6983da18e5dfc0
INFO: [CTest-Version 3.x (default)] - 1 test report file(s) were found with the pattern 'build/Testing/**/Test.xml' relative to '/var/jenkins/workspace/adamantine-nightly' for the testing framework 'CTest-Version 3.x (default)'.
$ docker rm -f --volumes 48b731290d5b670339db84d3fb0bcaabdc3e27cdbc746646db6983da18e5dfc0
[Pipeline] // withDockerContainer
[Pipeline] }
[Pipeline] // withEnv
[Pipeline] }
[Pipeline] // node
[Pipeline] }
[Pipeline] // stage
[Pipeline] }
Failed in branch CPU
40: 50% completed
40: 60% completed
40: 70% completed
40: 80% completed
40: 90% completed
40: 100% completed
40: [1;34;49m/var/jenkins/workspace/adamantine-nightly/tests/test_integration_thermoelastic.cc(19): Leaving test case "integration_thermoelastic"; testing time: 2683793218us
40: [0;39;49m[1;34;49m/var/jenkins/workspace/adamantine-nightly/tests/test_integration_thermoelastic.cc(47): Entering test case "integration_thermoelastic_add_material"
40: [1;34;49m/var/jenkins/workspace/adamantine-nightly/tests/test_integration_thermoelastic.cc(19): Leaving test case "integration_thermoelastic"; testing time: 2683884449us
40: [0;39;49m[1;34;49m/var/jenkins/workspace/adamantine-nightly/tests/test_integration_thermoelastic.cc(47): Entering test case "integration_thermoelastic_add_material"
40: [0;39;49m[0;39;49m10% completed
40: 20% completed
40: 30% completed
40: 40% completed
40: 50% completed
40: 60% completed
40: 70% completed
40: 80% completed
40: 90% completed
40: 100% completed
40: [1;34;49m/var/jenkins/workspace/adamantine-nightly/tests/test_integration_thermoelastic.cc(47): Leaving test case "integration_thermoelastic_add_material"; testing time: 1375079333us
40: [0;39;49m[1;34;49mLeaving test module "Integration_Thermoelastic"; testing time: 4058875526us
40: [0;39;49m
40: [1;32;49m*** No errors detected
40: [0;39;49m[1;34;49m/var/jenkins/workspace/adamantine-nightly/tests/test_integration_thermoelastic.cc(47): Leaving test case "integration_thermoelastic_add_material"; testing time: 1375078991us
40: [0;39;49m[1;34;49mLeaving test module "Integration_Thermoelastic"; testing time: 4058966934us
40:
40: [1;32;49m*** No errors detected
40: [0;39;49m[0;39;49m
44/48 Test #40: test_integration_thermoelastic_2 ......... Passed 4067.38 sec
test 3
Start 3: test_integration_da_3
3: Test command: /usr/bin/mpiexec "-n" "3" "/var/jenkins/workspace/adamantine-nightly/build/bin/test_integration_da"
3: Working Directory: /var/jenkins/workspace/adamantine-nightly/build/tests
3: Test timeout computed to be: 7200
3: Running 3 test cases...
3: [1;34;49mEntering test module "Integration_Data_Assimilation"
3: [0;39;49m[1;34;49m/var/jenkins/workspace/adamantine-nightly/tests/test_integration_da.cc(78): Entering test case "integration_data_assimilation"
3: Running 3 test cases...
3: [1;34;49mEntering test module "Integration_Data_Assimilation"
3: [0;39;49m[1;34;49m/var/jenkins/workspace/adamantine-nightly/tests/test_integration_da.cc(78): Entering test case "integration_data_assimilation"
3: Running 3 test cases...
3: [1;34;49mEntering test module "Integration_Data_Assimilation"
3: [0;39;49m[1;34;49m/var/jenkins/workspace/adamantine-nightly/tests/test_integration_da.cc(78): Entering test case "integration_data_assimilation"
3: [0;39;49mReading the experimental log file...
3: Done. Log entries found for 1 camera(s), with 2 frame(s).
3: Starting the main time stepping loop...
3: 10% completed
3: 20% completed
3: 30% completed
3: 40% completed
3: [0;39;49mRank: 2 | Old parameters for member 2:
3: [0;39;49mRank: 1 | Old parameters for member 1:
3: Performing data assimilation at time 0.0211...
3: Rank: 0 | Old parameters for member 0:
3: Rank: 1 | Number expt sites mapped to DOFs: 1
3: Rank: 2 | Number expt sites mapped to DOFs: 1
3: Rank: 0 | Number expt sites mapped to DOFs: 1
3: Getting the perturbed innovation...
3: Applying the Kalman gain...
3: Updating the ensemble members...
3: Done.
3: 50% completed
3: 60% completed
3: Rank: 2 | Old parameters for member 2:
3: Rank: 1 | Old parameters for member 1:
3: Rank: 2 | Number expt sites mapped to DOFs: 1
3: Performing data assimilation at time 0.0316...
3: Rank: 0 | Old parameters for member 0:
3: Rank: 1 | Number expt sites mapped to DOFs: 1
3: Rank: 0 | Number expt sites mapped to DOFs: 1
3: Getting the perturbed innovation...
3: Applying the Kalman gain...
3: Updating the ensemble members...
3: Done.
3: 70% completed
3: 80% completed
3: 90% completed
3: 100% completed
3: Reading the experimental log file...
3: Done. Log entries found for 1 camera(s), with 2 frame(s).
3: Reading the experimental log file...
3: Done. Log entries found for 1 camera(s), with 2 frame(s).
3: Reading the experimental log file...
3: Done. Log entries found for 1 camera(s), with 2 frame(s).
3: Starting the main time stepping loop...
3: Starting the main time stepping loop...
3: Starting the main time stepping loop...
3: 10% completed
3: 10% completed
3: 10% completed
3: 20% completed
3: 20% completed
3: 20% completed
3: 30% completed
3: 30% completed
3: 30% completed
3: 40% completed
3: 40% completed
3: 40% completed
3: Performing data assimilation at time 0.0211...
3: Rank: 0 | Old parameters for member 0:
3: Rank: 0 | Old parameters for member 1:
3: Rank: 0 | Old parameters for member 2:
3: Performing data assimilation at time 0.0211...
3: Rank: 0 | Old parameters for member 0:
3: Rank: 0 | Old parameters for member 1:
3: Rank: 0 | Old parameters for member 2:
3: Performing data assimilation at time 0.0211...
3: Rank: 0 | Old parameters for member 0:
3: Rank: 0 | Old parameters for member 1:
3: Rank: 0 | Old parameters for member 2:
3: Rank: 0 | Number expt sites mapped to DOFs: 1
3: Rank: 0 | Number expt sites mapped to DOFs: 1
3: Rank: 0 | Number expt sites mapped to DOFs: 1
3: Getting the perturbed innovation...
3: Applying the Kalman gain...
3: Getting the perturbed innovation...
3: Applying the Kalman gain...
3: Getting the perturbed innovation...
3: Applying the Kalman gain...
3: Updating the ensemble members...
3: Done.
3: Updating the ensemble members...
3: Done.
3: Updating the ensemble members...
3: Done.
3: 50% completed
3: 50% completed
3: 50% completed
3: 60% completed
3: 60% completed
3: 60% completed
3: Performing data assimilation at time 0.0316...
3: Rank: 0 | Old parameters for member 0:
3: Rank: 0 | Old parameters for member 1:
3: Rank: 0 | Old parameters for member 2:
3: Performing data assimilation at time 0.0316...
3: Rank: 0 | Old parameters for member 0:
3: Rank: 0 | Old parameters for member 1:
3: Rank: 0 | Old parameters for member 2:
3: Rank: 0 | Number expt sites mapped to DOFs: 1
3: Rank: 0 | Number expt sites mapped to DOFs: 1
3: Performing data assimilation at time 0.0316...
3: Rank: 0 | Old parameters for member 0:
3: Rank: 0 | Old parameters for member 1:
3: Rank: 0 | Old parameters for member 2:
3: Rank: 0 | Number expt sites mapped to DOFs: 1
3: Getting the perturbed innovation...
3: Applying the Kalman gain...
3: Getting the perturbed innovation...
3: Applying the Kalman gain...
3: Getting the perturbed innovation...
3: Applying the Kalman gain...
3: Updating the ensemble members...
3: Done.
3: Updating the ensemble members...
3: Done.
3: Updating the ensemble members...
3: Done.
3: 70% completed
3: 70% completed
3: 70% completed
3: 80% completed
3: 80% completed
3: 80% completed
3: 90% completed
3: 90% completed
3: 90% completed
3: 100% completed
3: 100% completed
3: 100% completed
3: [1;34;49m/var/jenkins/workspace/adamantine-nightly/tests/test_integration_da.cc(78): Leaving test case "integration_data_assimilation"; testing time: 63126074us
3: [0;39;49m[1;34;49m/var/jenkins/workspace/adamantine-nightly/tests/test_integration_da.cc(148): Entering test case "integration_3D_da_point_cloud_add_material"
3: [1;34;49m/var/jenkins/workspace/adamantine-nightly/tests/test_integration_da.cc(78): Leaving test case "integration_data_assimilation"; testing time: 63189131us
3: [0;39;49m[1;34;49m/var/jenkins/workspace/adamantine-nightly/tests/test_integration_da.cc(148): Entering test case "integration_3D_da_point_cloud_add_material"
3: [1;34;49m/var/jenkins/workspace/adamantine-nightly/tests/test_integration_da.cc(78): Leaving test case "integration_data_assimilation"; testing time: 63336805us
3: [0;39;49m[1;34;49m/var/jenkins/workspace/adamantine-nightly/tests/test_integration_da.cc(148): Entering test case "integration_3D_da_point_cloud_add_material"
3: [0;39;49mReading the experimental log file...
3: Done. Log entries found for 1 camera(s), with 1 frame(s).
3: Starting the main time stepping loop...
3: 10% completed
3: 20% completed
3: 30% completed
3: 40% completed
3: 50% completed
3: [0;39;49mRank: 1 | Old parameters for member 1:
3: Performing data assimilation at time 0.12...
3: Rank: 0 | Old parameters for member 0:
3: [0;39;49mRank: 2 | Old parameters for member 2:
3: Rank: 1 | Number expt sites mapped to DOFs: 1
3: Rank: 2 | Number expt sites mapped to DOFs: 1
3: Rank: 0 | Number expt sites mapped to DOFs: 1
3: Getting the perturbed innovation...
3: Applying the Kalman gain...
3: Updating the ensemble members...
3: Done.
3: 60% completed
3: 70% completed
3: 80% completed
3: 90% completed
3: 100% completed
3: Reading the experimental log file...
3: Done. Log entries found for 1 camera(s), with 1 frame(s).
3: Reading the experimental log file...
3: Done. Log entries found for 1 camera(s), with 1 frame(s).
3: Reading the experimental log file...
3: Done. Log entries found for 1 camera(s), with 1 frame(s).
3: Starting the main time stepping loop...
3: Starting the main time stepping loop...
3: Starting the main time stepping loop...
3: 10% completed
3: 10% completed
3: 10% completed
3: 20% completed
3: 20% completed
3: 20% completed
3: 30% completed
3: 30% completed
3: 30% completed
3: 40% completed
3: 40% completed
3: 40% completed
3: 50% completed
3: 50% completed
3: 50% completed
3: Performing data assimilation at time 0.12...
3: Rank: 0 | Old parameters for member 0:
3: Rank: 0 | Old parameters for member 1:
3: Rank: 0 | Old parameters for member 2:
3: Performing data assimilation at time 0.12...
3: Rank: 0 | Old parameters for member 0:
3: Rank: 0 | Old parameters for member 1:
3: Rank: 0 | Old parameters for member 2:
3: Performing data assimilation at time 0.12...
3: Rank: 0 | Old parameters for member 0:
3: Rank: 0 | Old parameters for member 1:
3: Rank: 0 | Old parameters for member 2:
3: Rank: 0 | Number expt sites mapped to DOFs: 1
3: Rank: 0 | Number expt sites mapped to DOFs: 1
3: Rank: 0 | Number expt sites mapped to DOFs: 1
3: Getting the perturbed innovation...
3: Applying the Kalman gain...
3: Getting the perturbed innovation...
3: Applying the Kalman gain...
3: Getting the perturbed innovation...
3: Applying the Kalman gain...
3: Updating the ensemble members...
3: Done.
3: 60% completed
3: Updating the ensemble members...
3: Updating the ensemble members...
3: Done.
3: 60% completed
3: Done.
3: 60% completed
3: 70% completed
3: 70% completed
3: 70% completed
3: 80% completed
3: 80% completed
3: 80% completed
3: 90% completed
3: 90% completed
3: 90% completed
3: 100% completed
3: 100% completed
3: 100% completed
3: [1;34;49m/var/jenkins/workspace/adamantine-nightly/tests/test_integration_da.cc(148): Leaving test case "integration_3D_da_point_cloud_add_material"; testing time: 2854412us
3: [0;39;49m[1;34;49m/var/jenkins/workspace/adamantine-nightly/tests/test_integration_da.cc(231): Entering test case "integration_3D_da_ray_add_material"
3: [1;34;49m/var/jenkins/workspace/adamantine-nightly/tests/test_integration_da.cc(148): Leaving test case "integration_3D_da_point_cloud_add_material"; testing time: 2784376us
3: [0;39;49m[1;34;49m/var/jenkins/workspace/adamantine-nightly/tests/test_integration_da.cc(231): Entering test case "integration_3D_da_ray_add_material"
3: [1;34;49m/var/jenkins/workspace/adamantine-nightly/tests/test_integration_da.cc(148): Leaving test case "integration_3D_da_point_cloud_add_material"; testing time: 2645012us
3: [0;39;49m[1;34;49m/var/jenkins/workspace/adamantine-nightly/tests/test_integration_da.cc(231): Entering test case "integration_3D_da_ray_add_material"
3: [0;39;49mReading the experimental log file...
3: Done. Log entries found for 1 camera(s), with 1 frame(s).
3: Starting the main time stepping loop...
3: 10% completed
3: 20% completed
3: 30% completed
3: 40% completed
3: 50% completed
3: [0;39;49mRank: 2 | Old parameters for member 2:
3: Rank: 2 | Number expt sites mapped to DOFs: 1
3: [0;39;49mRank: 1 | Old parameters for member 1:
3: Performing data assimilation at time 0.12...
3: Rank: 0 | Old parameters for member 0:
3: Rank: 1 | Number expt sites mapped to DOFs: 1
3: Rank: 0 | Number expt sites mapped to DOFs: 1
3: Getting the perturbed innovation...
3: Applying the Kalman gain...
3: Updating the ensemble members...
3: Done.
3: 60% completed
3: 70% completed
3: 80% completed
3: 90% completed
3: 100% completed
3: Reading the experimental log file...
3: Done. Log entries found for 1 camera(s), with 1 frame(s).
3: Reading the experimental log file...
3: Done. Log entries found for 1 camera(s), with 1 frame(s).
3: Reading the experimental log file...
3: Done. Log entries found for 1 camera(s), with 1 frame(s).
3: Starting the main time stepping loop...
3: Starting the main time stepping loop...
3: Starting the main time stepping loop...
3: 10% completed
3: 10% completed
3: 10% completed
3: 20% completed
3: 20% completed
3: 20% completed
3: 30% completed
3: 30% completed
3: 30% completed
3: 40% completed
3: 40% completed
3: 40% completed
3: 50% completed
3: 50% completed
3: 50% completed
3: Performing data assimilation at time 0.12...
3: Rank: 0 | Old parameters for member 0:
3: Rank: 0 | Old parameters for member 1:
3: Rank: 0 | Old parameters for member 2:
3: Rank: 0 | Number expt sites mapped to DOFs: 1
3: Performing data assimilation at time 0.12...
3: Rank: 0 | Old parameters for member 0:
3: Rank: 0 | Old parameters for member 1:
3: Rank: 0 | Old parameters for member 2:
3: Performing data assimilation at time 0.12...
3: Rank: 0 | Old parameters for member 0:
3: Rank: 0 | Old parameters for member 1:
3: Rank: 0 | Old parameters for member 2:
3: Rank: 0 | Number expt sites mapped to DOFs: 1
3: Rank: 0 | Number expt sites mapped to DOFs: 1
3: Getting the perturbed innovation...
3: Applying the Kalman gain...
3: Getting the perturbed innovation...
3: Applying the Kalman gain...
3: Getting the perturbed innovation...
3: Applying the Kalman gain...
3: Updating the ensemble members...
3: Done.
3: 60% completed
3: Updating the ensemble members...
3: Done.
3: 60% completed
3: Updating the ensemble members...
3: Done.
3: 60% completed
3: 70% completed
3: 70% completed
3: 70% completed
3: 80% completed
3: 80% completed
3: 80% completed
3: 90% completed
3: 90% completed
3: 90% completed
3: 100% completed
3: 100% completed
3: 100% completed
3: [1;34;49m/var/jenkins/workspace/adamantine-nightly/tests/test_integration_da.cc(231): Leaving test case "integration_3D_da_ray_add_material"; testing time: 2530168us
3: [0;39;49m[1;34;49mLeaving test module "Integration_Data_Assimilation"; testing time: 68510784us
3: [0;39;49m
3: [1;32;49m*** No errors detected
3: [0;39;49m[1;34;49m/var/jenkins/workspace/adamantine-nightly/tests/test_integration_da.cc(231): Leaving test case "integration_3D_da_ray_add_material"; testing time: 2539305us
3: [0;39;49m[1;34;49mLeaving test module "Integration_Data_Assimilation"; testing time: 68512957us
3: [0;39;49m
3: [1;32;49m*** No errors detected
3: [0;39;49m[1;34;49m/var/jenkins/workspace/adamantine-nightly/tests/test_integration_da.cc(231): Leaving test case "integration_3D_da_ray_add_material"; testing time: 2546251us
3: [0;39;49m[1;34;49mLeaving test module "Integration_Data_Assimilation"; testing time: 68528206us
3: [0;39;49m
3: [1;32;49m*** No errors detected
3: [0;39;49m
45/48 Test #3: test_integration_da_3 .................... Passed 69.91 sec
test 4
Start 4: test_integration_da_6
4: Test command: /usr/bin/mpiexec "-n" "6" "/var/jenkins/workspace/adamantine-nightly/build/bin/test_integration_da"
4: Working Directory: /var/jenkins/workspace/adamantine-nightly/build/tests
4: Test timeout computed to be: 7200
4: Running 3 test cases...
4: [1;34;49mEntering test module "Integration_Data_Assimilation"
4: [0;39;49m[1;34;49m/var/jenkins/workspace/adamantine-nightly/tests/test_integration_da.cc(78): Entering test case "integration_data_assimilation"
4: Running 3 test cases...
4: [1;34;49mEntering test module "Integration_Data_Assimilation"
4: [0;39;49m[1;34;49m/var/jenkins/workspace/adamantine-nightly/tests/test_integration_da.cc(78): Entering test case "integration_data_assimilation"
4: Running 3 test cases...
4: [1;34;49mEntering test module "Integration_Data_Assimilation"
4: [0;39;49m[1;34;49m/var/jenkins/workspace/adamantine-nightly/tests/test_integration_da.cc(78): Entering test case "integration_data_assimilation"
4: Running 3 test cases...
4: [1;34;49mEntering test module "Integration_Data_Assimilation"
4: [0;39;49m[1;34;49m/var/jenkins/workspace/adamantine-nightly/tests/test_integration_da.cc(78): Entering test case "integration_data_assimilation"
4: Running 3 test cases...
4: Running 3 test cases...
4: [1;34;49mEntering test module "Integration_Data_Assimilation"
4: [1;34;49mEntering test module "Integration_Data_Assimilation"
4: [0;39;49m[1;34;49m/var/jenkins/workspace/adamantine-nightly/tests/test_integration_da.cc(78): Entering test case "integration_data_assimilation"
4: [0;39;49m[1;34;49m/var/jenkins/workspace/adamantine-nightly/tests/test_integration_da.cc(78): Entering test case "integration_data_assimilation"
4: [0;39;49mReading the experimental log file...
4: Done. Log entries found for 1 camera(s), with 2 frame(s).
4: Starting the main time stepping loop...
4: 10% completed
4: 20% completed
4: 30% completed
4: 40% completed
4: [0;39;49mRank: 5 | Old parameters for member 2:
4: [0;39;49mRank: 4 | Old parameters for member 2:
4: [0;39;49mRank: 2 | Old parameters for member 1:
4: [0;39;49mRank: 3 | Old parameters for member 1:
4: Performing data assimilation at time 0.0211...
4: Rank: 0 | Old parameters for member 0:
4: [0;39;49mRank: 1 | Old parameters for member 0:
4: Rank: 4 | Number expt sites mapped to DOFs: 1
4: Rank: 5 | Number expt sites mapped to DOFs: 1
4: Rank: 3 | Number expt sites mapped to DOFs: 1
4: Rank: 2 | Number expt sites mapped to DOFs: 1
4: Rank: 0 | Number expt sites mapped to DOFs: 1
4: Rank: 1 | Number expt sites mapped to DOFs: 1
4: Getting the perturbed innovation...
4: Applying the Kalman gain...
4: Updating the ensemble members...
4: Done.
4: 50% completed
4: 60% completed
4: Rank: 1 | Old parameters for member 0:
4: Performing data assimilation at time 0.0316...
4: Rank: 0 | Old parameters for member 0:
4: Rank: 2 | Old parameters for member 1:
4: Rank: 3 | Old parameters for member 1:
4: Rank: 0 | Number expt sites mapped to DOFs: 1
4: Rank: 1 | Number expt sites mapped to DOFs: 1
4: Rank: 5 | Old parameters for member 2:
4: Rank: 4 | Old parameters for member 2:
4: Rank: 3 | Number expt sites mapped to DOFs: 1
4: Rank: 2 | Number expt sites mapped to DOFs: 1
4: Rank: 4 | Number expt sites mapped to DOFs: 1
4: Rank: 5 | Number expt sites mapped to DOFs: 1
4: Getting the perturbed innovation...
4: Applying the Kalman gain...
4: Updating the ensemble members...
4: Done.
4: 70% completed
4: 80% completed
4: 90% completed
4: 100% completed
4: Reading the experimental log file...
4: Done. Log entries found for 1 camera(s), with 2 frame(s).
4: Reading the experimental log file...
4: Done. Log entries found for 1 camera(s), with 2 frame(s).
4: Reading the experimental log file...
4: Done. Log entries found for 1 camera(s), with 2 frame(s).
4: Reading the experimental log file...
4: Done. Log entries found for 1 camera(s), with 2 frame(s).
4: Reading the experimental log file...
4: Done. Log entries found for 1 camera(s), with 2 frame(s).
4: Reading the experimental log file...
4: Done. Log entries found for 1 camera(s), with 2 frame(s).
4: Starting the main time stepping loop...
4: Starting the main time stepping loop...
4: Starting the main time stepping loop...
4: Starting the main time stepping loop...
4: Starting the main time stepping loop...
4: Starting the main time stepping loop...
4: 10% completed
4: 10% completed
4: 10% completed
4: 10% completed
4: 10% completed
4: 10% completed
4: 20% completed
4: 20% completed
4: 20% completed
4: 20% completed
4: 20% completed
4: 20% completed
4: 30% completed
4: 30% completed
4: 30% completed
4: 30% completed
4: 30% completed
4: 30% completed
4: 40% completed
4: 40% completed
4: 40% completed
4: 40% completed
4: 40% completed
4: 40% completed
4: Performing data assimilation at time 0.0211...
4: Rank: 0 | Old parameters for member 0:
4: Rank: 0 | Old parameters for member 1:
4: Rank: 0 | Old parameters for member 2:
4: Performing data assimilation at time 0.0211...
4: Rank: 0 | Old parameters for member 0:
4: Rank: 0 | Old parameters for member 1:
4: Rank: 0 | Old parameters for member 2:
4: Performing data assimilation at time 0.0211...
4: Rank: 0 | Old parameters for member 0:
4: Rank: 0 | Old parameters for member 1:
4: Rank: 0 | Old parameters for member 2:
4: Rank: 0 | Number expt sites mapped to DOFs: 1
4: Rank: 0 | Number expt sites mapped to DOFs: 1
4: Rank: 0 | Number expt sites mapped to DOFs: 1
4: Performing data assimilation at time 0.0211...
4: Rank: 0 | Old parameters for member 0:
4: Rank: 0 | Old parameters for member 1:
4: Rank: 0 | Old parameters for member 2:
4: Performing data assimilation at time 0.0211...
4: Rank: 0 | Old parameters for member 0:
4: Rank: 0 | Old parameters for member 1:
4: Rank: 0 | Old parameters for member 2:
4: Rank: 0 | Number expt sites mapped to DOFs: 1
4: Rank: 0 | Number expt sites mapped to DOFs: 1
4: Performing data assimilation at time 0.0211...
4: Rank: 0 | Old parameters for member 0:
4: Rank: 0 | Old parameters for member 1:
4: Rank: 0 | Old parameters for member 2:
4: Rank: 0 | Number expt sites mapped to DOFs: 1
4: Getting the perturbed innovation...
4: Applying the Kalman gain...
4: Getting the perturbed innovation...
4: Applying the Kalman gain...
4: Getting the perturbed innovation...
4: Applying the Kalman gain...
4: Getting the perturbed innovation...
4: Applying the Kalman gain...
4: Getting the perturbed innovation...
4: Applying the Kalman gain...
4: Getting the perturbed innovation...
4: Applying the Kalman gain...
4: Updating the ensemble members...
4: Done.
4: Updating the ensemble members...
4: Done.
4: Updating the ensemble members...
4: Done.
4: Updating the ensemble members...
4: Done.
4: Updating the ensemble members...
4: Done.
4: Updating the ensemble members...
4: Done.
4: 50% completed
4: 50% completed
4: 50% completed
4: 50% completed
4: 50% completed
4: 50% completed
4: 60% completed
4: 60% completed
4: 60% completed
4: 60% completed
4: 60% completed
4: 60% completed
4: Performing data assimilation at time 0.0316...
4: Rank: 0 | Old parameters for member 0:
4: Rank: 0 | Old parameters for member 1:
4: Rank: 0 | Old parameters for member 2:
4: Rank: 0 | Number expt sites mapped to DOFs: 1
4: Performing data assimilation at time 0.0316...
4: Rank: 0 | Old parameters for member 0:
4: Rank: 0 | Old parameters for member 1:
4: Rank: 0 | Old parameters for member 2:
4: Performing data assimilation at time 0.0316...
4: Rank: 0 | Old parameters for member 0:
4: Rank: 0 | Old parameters for member 1:
4: Rank: 0 | Old parameters for member 2:
4: Rank: 0 | Number expt sites mapped to DOFs: 1
4: Rank: 0 | Number expt sites mapped to DOFs: 1
4: Performing data assimilation at time 0.0316...
4: Rank: 0 | Old parameters for member 0:
4: Rank: 0 | Old parameters for member 1:
4: Rank: 0 | Old parameters for member 2:
4: Rank: 0 | Number expt sites mapped to DOFs: 1
4: Performing data assimilation at time 0.0316...
4: Rank: 0 | Old parameters for member 0:
4: Rank: 0 | Old parameters for member 1:
4: Rank: 0 | Old parameters for member 2:
4: Rank: 0 | Number expt sites mapped to DOFs: 1
4: Performing data assimilation at time 0.0316...
4: Rank: 0 | Old parameters for member 0:
4: Rank: 0 | Old parameters for member 1:
4: Rank: 0 | Old parameters for member 2:
4: Rank: 0 | Number expt sites mapped to DOFs: 1
4: Getting the perturbed innovation...
4: Applying the Kalman gain...
4: Getting the perturbed innovation...
4: Applying the Kalman gain...
4: Getting the perturbed innovation...
4: Applying the Kalman gain...
4: Getting the perturbed innovation...
4: Applying the Kalman gain...
4: Getting the perturbed innovation...
4: Applying the Kalman gain...
4: Getting the perturbed innovation...
4: Applying the Kalman gain...
4: Updating the ensemble members...
4: Done.
4: Updating the ensemble members...
4: Done.
4: Updating the ensemble members...
4: Done.
4: Updating the ensemble members...
4: Updating the ensemble members...
4: Done.
4: Done.
4: Updating the ensemble members...
4: Done.
4: 70% completed
4: 70% completed
4: 70% completed
4: 70% completed
4: 70% completed
4: 70% completed
4: 80% completed
4: 80% completed
4: 80% completed
4: 80% completed
4: 80% completed
4: 80% completed
4: 90% completed
4: 90% completed
4: 90% completed
4: 90% completed
4: 90% completed
4: 90% completed
4: 100% completed
4: 100% completed
4: 100% completed
4: 100% completed
4: 100% completed
4: 100% completed
4: [1;34;49m/var/jenkins/workspace/adamantine-nightly/tests/test_integration_da.cc(78): Leaving test case "integration_data_assimilation"; testing time: 57711496us
4: [0;39;49m[1;34;49m/var/jenkins/workspace/adamantine-nightly/tests/test_integration_da.cc(148): Entering test case "integration_3D_da_point_cloud_add_material"
4: [1;34;49m/var/jenkins/workspace/adamantine-nightly/tests/test_integration_da.cc(78): Leaving test case "integration_data_assimilation"; testing time: 57790182us
4: [0;39;49m[1;34;49m/var/jenkins/workspace/adamantine-nightly/tests/test_integration_da.cc(148): Entering test case "integration_3D_da_point_cloud_add_material"
4: [1;34;49m/var/jenkins/workspace/adamantine-nightly/tests/test_integration_da.cc(78): Leaving test case "integration_data_assimilation"; testing time: 57857152us
4: [0;39;49m[1;34;49m/var/jenkins/workspace/adamantine-nightly/tests/test_integration_da.cc(148): Entering test case "integration_3D_da_point_cloud_add_material"
4: [1;34;49m/var/jenkins/workspace/adamantine-nightly/tests/test_integration_da.cc(78): Leaving test case "integration_data_assimilation"; testing time: 57866185us
4: [0;39;49m[1;34;49m/var/jenkins/workspace/adamantine-nightly/tests/test_integration_da.cc(148): Entering test case "integration_3D_da_point_cloud_add_material"
4: [1;34;49m/var/jenkins/workspace/adamantine-nightly/tests/test_integration_da.cc(78): Leaving test case "integration_data_assimilation"; testing time: 57872680us
4: [0;39;49m[1;34;49m/var/jenkins/workspace/adamantine-nightly/tests/test_integration_da.cc(148): Entering test case "integration_3D_da_point_cloud_add_material"
4: [1;34;49m/var/jenkins/workspace/adamantine-nightly/tests/test_integration_da.cc(78): Leaving test case "integration_data_assimilation"; testing time: 57996953us
4: [0;39;49m[1;34;49m/var/jenkins/workspace/adamantine-nightly/tests/test_integration_da.cc(148): Entering test case "integration_3D_da_point_cloud_add_material"
4: [0;39;49mReading the experimental log file...
4: Done. Log entries found for 1 camera(s), with 1 frame(s).
4: Starting the main time stepping loop...
4: 10% completed
4: 20% completed
4: 30% completed
4: 40% completed
4: 50% completed
4: [0;39;49mRank: 1 | Old parameters for member 0:
4: Performing data assimilation at time 0.12...
4: Rank: 0 | Old parameters for member 0:
4: [0;39;49mRank: 5 | Old parameters for member 2:
4: [0;39;49mRank: 4 | Old parameters for member 2:
4: [0;39;49mRank: 2 | Old parameters for member 1:
4: [0;39;49mRank: 3 | Old parameters for member 1:
4: Rank: 4 | Number expt sites mapped to DOFs: 1
4: Rank: 1 | Number expt sites mapped to DOFs: 1
4: Rank: 0 | Number expt sites mapped to DOFs: 1
4: Rank: 5 | Number expt sites mapped to DOFs: 1
4: Rank: 3 | Number expt sites mapped to DOFs: 1
4: Rank: 2 | Number expt sites mapped to DOFs: 1
4: Getting the perturbed innovation...
4: Applying the Kalman gain...
4: Updating the ensemble members...
4: Done.
4: 60% completed
4: 70% completed
4: 80% completed
4: 90% completed
4: 100% completed
4: Reading the experimental log file...
4: Done. Log entries found for 1 camera(s), with 1 frame(s).
4: Reading the experimental log file...
4: Done. Log entries found for 1 camera(s), with 1 frame(s).
4: Reading the experimental log file...
4: Done. Log entries found for 1 camera(s), with 1 frame(s).
4: Reading the experimental log file...
4: Done. Log entries found for 1 camera(s), with 1 frame(s).
4: Reading the experimental log file...
4: Done. Log entries found for 1 camera(s), with 1 frame(s).
4: Reading the experimental log file...
4: Done. Log entries found for 1 camera(s), with 1 frame(s).
4: Starting the main time stepping loop...
4: Starting the main time stepping loop...
4: Starting the main time stepping loop...
4: Starting the main time stepping loop...
4: Starting the main time stepping loop...
4: Starting the main time stepping loop...
4: 10% completed
4: 10% completed
4: 10% completed
4: 10% completed
4: 10% completed
4: 10% completed
4: 20% completed
4: 20% completed
4: 20% completed
4: 20% completed
4: 20% completed
4: 20% completed
4: 30% completed
4: 30% completed
4: 30% completed
4: 30% completed
4: 30% completed
4: 30% completed
4: 40% completed
4: 40% completed
4: 40% completed
4: 40% completed
4: 40% completed
4: 40% completed
4: 50% completed
4: 50% completed
4: 50% completed
4: 50% completed
4: Performing data assimilation at time 0.12...
4: Rank: 0 | Old parameters for member 0:
4: Rank: 0 | Old parameters for member 1:
4: Rank: 0 | Old parameters for member 2:
4: 50% completed
4: 50% completed
4: Rank: 0 | Number expt sites mapped to DOFs: 1
4: Performing data assimilation at time 0.12...
4: Rank: 0 | Old parameters for member 0:
4: Rank: 0 | Old parameters for member 1:
4: Rank: 0 | Old parameters for member 2:
4: Rank: 0 | Number expt sites mapped to DOFs: 1
4: Performing data assimilation at time 0.12...
4: Rank: 0 | Old parameters for member 0:
4: Rank: 0 | Old parameters for member 1:
4: Rank: 0 | Old parameters for member 2:
4: Performing data assimilation at time 0.12...
4: Rank: 0 | Old parameters for member 0:
4: Rank: 0 | Old parameters for member 1:
4: Rank: 0 | Old parameters for member 2:
4: Rank: 0 | Number expt sites mapped to DOFs: 1
4: Rank: 0 | Number expt sites mapped to DOFs: 1
4: Performing data assimilation at time 0.12...
4: Rank: 0 | Old parameters for member 0:
4: Rank: 0 | Old parameters for member 1:
4: Rank: 0 | Old parameters for member 2:
4: Performing data assimilation at time 0.12...
4: Rank: 0 | Old parameters for member 0:
4: Rank: 0 | Old parameters for member 1:
4: Rank: 0 | Old parameters for member 2:
4: Rank: 0 | Number expt sites mapped to DOFs: 1
4: Rank: 0 | Number expt sites mapped to DOFs: 1
4: Getting the perturbed innovation...
4: Applying the Kalman gain...
4: Getting the perturbed innovation...
4: Applying the Kalman gain...
4: Getting the perturbed innovation...
4: Applying the Kalman gain...
4: Getting the perturbed innovation...
4: Applying the Kalman gain...
4: Getting the perturbed innovation...
4: Applying the Kalman gain...
4: Getting the perturbed innovation...
4: Applying the Kalman gain...
4: Updating the ensemble members...
4: Done.
4: 60% completed
4: Updating the ensemble members...
4: Updating the ensemble members...
4: Done.
4: 60% completed
4: Done.
4: 60% completed
4: Updating the ensemble members...
4: Done.
4: 60% completed
4: 70% completed
4: Updating the ensemble members...
4: Updating the ensemble members...
4: Done.
4: 60% completed
4: Done.
4: 60% completed
4: 70% completed
4: 70% completed
4: 70% completed
4: 80% completed
4: 70% completed
4: 70% completed
4: 80% completed
4: 80% completed
4: 80% completed
4: 90% completed
4: 80% completed
4: 80% completed
4: 90% completed
4: 90% completed
4: 90% completed
4: 90% completed
4: 90% completed
4: 100% completed
4: 100% completed
4: 100% completed
4: [1;34;49m/var/jenkins/workspace/adamantine-nightly/tests/test_integration_da.cc(148): Leaving test case "integration_3D_da_point_cloud_add_material"; testing time: 2466203us
4: [0;39;49m[1;34;49m/var/jenkins/workspace/adamantine-nightly/tests/test_integration_da.cc(231): Entering test case "integration_3D_da_ray_add_material"
4: 100% completed
4: 100% completed
4: 100% completed
4: [1;34;49m/var/jenkins/workspace/adamantine-nightly/tests/test_integration_da.cc(148): Leaving test case "integration_3D_da_point_cloud_add_material"; testing time: 2566050us
4: [0;39;49m[1;34;49m/var/jenkins/workspace/adamantine-nightly/tests/test_integration_da.cc(231): Entering test case "integration_3D_da_ray_add_material"
4: [1;34;49m/var/jenkins/workspace/adamantine-nightly/tests/test_integration_da.cc(148): Leaving test case "integration_3D_da_point_cloud_add_material"; testing time: 2436071us
4: [0;39;49m[1;34;49m/var/jenkins/workspace/adamantine-nightly/tests/test_integration_da.cc(231): Entering test case "integration_3D_da_ray_add_material"
4: [1;34;49m/var/jenkins/workspace/adamantine-nightly/tests/test_integration_da.cc(148): Leaving test case "integration_3D_da_point_cloud_add_material"; testing time: 2741905us
4: [0;39;49m[1;34;49m/var/jenkins/workspace/adamantine-nightly/tests/test_integration_da.cc(231): Entering test case "integration_3D_da_ray_add_material"
4: [1;34;49m/var/jenkins/workspace/adamantine-nightly/tests/test_integration_da.cc(148): Leaving test case "integration_3D_da_point_cloud_add_material"; testing time: 2653201us
4: [0;39;49m[1;34;49m/var/jenkins/workspace/adamantine-nightly/tests/test_integration_da.cc(231): Entering test case "integration_3D_da_ray_add_material"
4: [1;34;49m/var/jenkins/workspace/adamantine-nightly/tests/test_integration_da.cc(148): Leaving test case "integration_3D_da_point_cloud_add_material"; testing time: 2570683us
4: [0;39;49m[1;34;49m/var/jenkins/workspace/adamantine-nightly/tests/test_integration_da.cc(231): Entering test case "integration_3D_da_ray_add_material"
4: [0;39;49mReading the experimental log file...
4: Done. Log entries found for 1 camera(s), with 1 frame(s).
4: Starting the main time stepping loop...
4: 10% completed
4: 20% completed
4: 30% completed
4: 40% completed
4: 50% completed
4: [0;39;49mRank: 5 | Old parameters for member 2:
4: [0;39;49mRank: 4 | Old parameters for member 2:
4: Rank: 4 | Number expt sites mapped to DOFs: 1
4: Rank: 5 | Number expt sites mapped to DOFs: 1
4: Performing data assimilation at time 0.12...
4: Rank: 0 | Old parameters for member 0:
4: [0;39;49mRank: 1 | Old parameters for member 0:
4: [0;39;49mRank: 2 | Old parameters for member 1:
4: [0;39;49mRank: 3 | Old parameters for member 1:
4: Rank: 1 | Number expt sites mapped to DOFs: 1
4: Rank: 0 | Number expt sites mapped to DOFs: 1
4: Rank: 3 | Number expt sites mapped to DOFs: 1
4: Rank: 2 | Number expt sites mapped to DOFs: 1
4: Getting the perturbed innovation...
4: Applying the Kalman gain...
4: Updating the ensemble members...
4: Done.
4: 60% completed
4: 70% completed
4: 80% completed
4: 90% completed
4: 100% completed
4: Reading the experimental log file...
4: Done. Log entries found for 1 camera(s), with 1 frame(s).
4: Reading the experimental log file...
4: Done. Log entries found for 1 camera(s), with 1 frame(s).
4: Reading the experimental log file...
4: Done. Log entries found for 1 camera(s), with 1 frame(s).
4: Reading the experimental log file...
4: Done. Log entries found for 1 camera(s), with 1 frame(s).
4: Reading the experimental log file...
4: Done. Log entries found for 1 camera(s), with 1 frame(s).
4: Reading the experimental log file...
4: Done. Log entries found for 1 camera(s), with 1 frame(s).
4: Starting the main time stepping loop...
4: Starting the main time stepping loop...
4: Starting the main time stepping loop...
4: Starting the main time stepping loop...
4: Starting the main time stepping loop...
4: Starting the main time stepping loop...
4: 10% completed
4: 10% completed
4: 10% completed
4: 10% completed
4: 10% completed
4: 10% completed
4: 20% completed
4: 20% completed
4: 20% completed
4: 20% completed
4: 30% completed
4: 20% completed
4: 20% completed
4: 30% completed
4: 30% completed
4: 30% completed
4: 40% completed
4: 30% completed
4: 30% completed
4: 40% completed
4: 40% completed
4: 40% completed
4: 50% completed
4: 40% completed
4: 40% completed
4: 50% completed
4: 50% completed
4: 50% completed
4: Performing data assimilation at time 0.12...
4: Rank: 0 | Old parameters for member 0:
4: Rank: 0 | Old parameters for member 1:
4: Rank: 0 | Old parameters for member 2:
4: Rank: 0 | Number expt sites mapped to DOFs: 1
4: 50% completed
4: 50% completed
4: Performing data assimilation at time 0.12...
4: Rank: 0 | Old parameters for member 0:
4: Rank: 0 | Old parameters for member 1:
4: Rank: 0 | Old parameters for member 2:
4: Rank: 0 | Number expt sites mapped to DOFs: 1
4: Performing data assimilation at time 0.12...
4: Rank: 0 | Old parameters for member 0:
4: Rank: 0 | Old parameters for member 1:
4: Rank: 0 | Old parameters for member 2:
4: Rank: 0 | Number expt sites mapped to DOFs: 1
4: Performing data assimilation at time 0.12...
4: Rank: 0 | Old parameters for member 0:
4: Rank: 0 | Old parameters for member 1:
4: Rank: 0 | Old parameters for member 2:
4: Rank: 0 | Number expt sites mapped to DOFs: 1
4: Performing data assimilation at time 0.12...
4: Rank: 0 | Old parameters for member 0:
4: Rank: 0 | Old parameters for member 1:
4: Rank: 0 | Old parameters for member 2:
4: Performing data assimilation at time 0.12...
4: Rank: 0 | Old parameters for member 0:
4: Rank: 0 | Old parameters for member 1:
4: Rank: 0 | Old parameters for member 2:
4: Rank: 0 | Number expt sites mapped to DOFs: 1
4: Rank: 0 | Number expt sites mapped to DOFs: 1
4: Getting the perturbed innovation...
4: Applying the Kalman gain...
4: Getting the perturbed innovation...
4: Applying the Kalman gain...
4: Getting the perturbed innovation...
4: Applying the Kalman gain...
4: Getting the perturbed innovation...
4: Applying the Kalman gain...
4: Getting the perturbed innovation...
4: Applying the Kalman gain...
4: Getting the perturbed innovation...
4: Applying the Kalman gain...
4: Updating the ensemble members...
4: Done.
4: 60% completed
4: Updating the ensemble members...
4: Done.
4: 60% completed
4: Updating the ensemble members...
4: Done.
4: 60% completed
4: Updating the ensemble members...
4: Done.
4: 60% completed
4: 70% completed
4: Updating the ensemble members...
4: Done.
4: 60% completed
4: Updating the ensemble members...
4: Done.
4: 70% completed
4: 60% completed
4: 70% completed
4: 70% completed
4: 80% completed
4: 80% completed
4: 70% completed
4: 70% completed
4: 80% completed
4: 80% completed
4: 90% completed
4: 90% completed
4: 80% completed
4: 80% completed
4: 90% completed
4: 90% completed
4: 90% completed
4: 90% completed
4: 100% completed
4: 100% completed
4: 100% completed
4: 100% completed
4: [1;34;49m/var/jenkins/workspace/adamantine-nightly/tests/test_integration_da.cc(231): Leaving test case "integration_3D_da_ray_add_material"; testing time: 2356469us
4: [0;39;49m[1;34;49mLeaving test module "Integration_Data_Assimilation"; testing time: 62779797us
4: [0;39;49m
4: [1;32;49m*** No errors detected
4: [0;39;49m
4: [1;32;49m*** No errors detected
4: [0;39;49m[1;34;49m/var/jenkins/workspace/adamantine-nightly/tests/test_integration_da.cc(231): Leaving test case "integration_3D_da_ray_add_material"; testing time: 2454520us
4: [0;39;49m[1;34;49mLeaving test module "Integration_Data_Assimilation"; testing time: 62787045us
4: [0;39;49m100% completed
4: 100% completed
4: [1;34;49m/var/jenkins/workspace/adamantine-nightly/tests/test_integration_da.cc(231): Leaving test case "integration_3D_da_ray_add_material"; testing time: 2362644us
4: [0;39;49m[1;34;49mLeaving test module "Integration_Data_Assimilation"; testing time: 62806176us
4: [0;39;49m
4: [1;32;49m*** No errors detected
4: [0;39;49m[1;34;49m/var/jenkins/workspace/adamantine-nightly/tests/test_integration_da.cc(231): Leaving test case "integration_3D_da_ray_add_material"; testing time: 2402216us
4: [0;39;49m[1;34;49mLeaving test module "Integration_Data_Assimilation"; testing time: 62835423us
4: [0;39;49m
4: [1;32;49m*** No errors detected
4: [0;39;49m
4: [1;32;49m*** No errors detected
4: [0;39;49m[1;34;49m/var/jenkins/workspace/adamantine-nightly/tests/test_integration_da.cc(231): Leaving test case "integration_3D_da_ray_add_material"; testing time: 2419207us
4: [0;39;49m[1;34;49mLeaving test module "Integration_Data_Assimilation"; testing time: 62872725us
4: [0;39;49m[1;34;49m/var/jenkins/workspace/adamantine-nightly/tests/test_integration_da.cc(231): Leaving test case "integration_3D_da_ray_add_material"; testing time: 2400866us
4: [0;39;49m[1;34;49mLeaving test module "Integration_Data_Assimilation"; testing time: 62844400us
4: [0;39;49m
4: [1;32;49m*** No errors detected
4: [0;39;49m
46/48 Test #4: test_integration_da_6 .................... Passed 64.82 sec
test 7
Start 7: test_closest_source_point_adaptation_3
7: Test command: /usr/bin/mpiexec "-n" "3" "/var/jenkins/workspace/adamantine-nightly/build/bin/test_closest_source_point_adaptation"
7: Working Directory: /var/jenkins/workspace/adamantine-nightly/build/tests
7: Test timeout computed to be: 7200
7: Running 1 test case...
7: [1;34;49mEntering test module "ClosestSourcePointAdaptation"
7: [0;39;49m[1;34;49m/var/jenkins/workspace/adamantine-nightly/tests/test_closest_source_point_adaptation.cc(123): Entering test case "closest_source_point_adaptation"
7: Running 1 test case...
7: [1;34;49mEntering test module "ClosestSourcePointAdaptation"
7: [0;39;49m[1;34;49m/var/jenkins/workspace/adamantine-nightly/tests/test_closest_source_point_adaptation.cc(123): Entering test case "closest_source_point_adaptation"
7: Running 1 test case...
7: [1;34;49mEntering test module "ClosestSourcePointAdaptation"
7: [0;39;49m[1;34;49m/var/jenkins/workspace/adamantine-nightly/tests/test_closest_source_point_adaptation.cc(123): Entering test case "closest_source_point_adaptation"
7: [0;39;49m[1;34;49m/var/jenkins/workspace/adamantine-nightly/tests/test_closest_source_point_adaptation.cc(123): Leaving test case "closest_source_point_adaptation"; testing time: 7164594us
7: [0;39;49m[1;34;49mLeaving test module "ClosestSourcePointAdaptation"; testing time: 7164645us
7: [0;39;49m[0;39;49m[1;34;49m/var/jenkins/workspace/adamantine-nightly/tests/test_closest_source_point_adaptation.cc(123): Leaving test case "closest_source_point_adaptation"; testing time: 7167486us
7: [0;39;49m[1;34;49mLeaving test module "ClosestSourcePointAdaptation"; testing time: 7167536us
7: [0;39;49m
7: [1;32;49m*** No errors detected
7: [0;39;49m
7: [1;32;49m*** No errors detected
7: [0;39;49m[0;39;49m[1;34;49m/var/jenkins/workspace/adamantine-nightly/tests/test_closest_source_point_adaptation.cc(123): Leaving test case "closest_source_point_adaptation"; testing time: 7155831us
7: [0;39;49m[1;34;49mLeaving test module "ClosestSourcePointAdaptation"; testing time: 7155887us
7: [0;39;49m
7: [1;32;49m*** No errors detected
7: [0;39;49m
47/48 Test #7: test_closest_source_point_adaptation_3 ... Passed 8.52 sec
test 8
Start 8: test_closest_source_point_adaptation_6
8: Test command: /usr/bin/mpiexec "-n" "6" "/var/jenkins/workspace/adamantine-nightly/build/bin/test_closest_source_point_adaptation"
8: Working Directory: /var/jenkins/workspace/adamantine-nightly/build/tests
8: Test timeout computed to be: 7200
8: Running 1 test case...
8: [1;34;49mEntering test module "ClosestSourcePointAdaptation"
8: [0;39;49m[1;34;49m/var/jenkins/workspace/adamantine-nightly/tests/test_closest_source_point_adaptation.cc(123): Entering test case "closest_source_point_adaptation"
8: Running 1 test case...
8: [1;34;49mEntering test module "ClosestSourcePointAdaptation"
8: [0;39;49m[1;34;49m/var/jenkins/workspace/adamantine-nightly/tests/test_closest_source_point_adaptation.cc(123): Entering test case "closest_source_point_adaptation"
8: Running 1 test case...
8: [1;34;49mEntering test module "ClosestSourcePointAdaptation"
8: [0;39;49m[1;34;49m/var/jenkins/workspace/adamantine-nightly/tests/test_closest_source_point_adaptation.cc(123): Entering test case "closest_source_point_adaptation"
8: Running 1 test case...
8: [1;34;49mEntering test module "ClosestSourcePointAdaptation"
8: [0;39;49m[1;34;49m/var/jenkins/workspace/adamantine-nightly/tests/test_closest_source_point_adaptation.cc(123): Entering test case "closest_source_point_adaptation"
8: Running 1 test case...
8: [1;34;49mEntering test module "ClosestSourcePointAdaptation"
8: [0;39;49m[1;34;49m/var/jenkins/workspace/adamantine-nightly/tests/test_closest_source_point_adaptation.cc(123): Entering test case "closest_source_point_adaptation"
8: Running 1 test case...
8: [1;34;49mEntering test module "ClosestSourcePointAdaptation"
8: [0;39;49m[1;34;49m/var/jenkins/workspace/adamantine-nightly/tests/test_closest_source_point_adaptation.cc(123): Entering test case "closest_source_point_adaptation"
8: [0;39;49m[1;34;49m/var/jenkins/workspace/adamantine-nightly/tests/test_closest_source_point_adaptation.cc(123): Leaving test case "closest_source_point_adaptation"; testing time: 4433249us
8: [0;39;49m[1;34;49mLeaving test module "ClosestSourcePointAdaptation"; testing time: 4433302us
8: [0;39;49m[0;39;49m[1;34;49m/var/jenkins/workspace/adamantine-nightly/tests/test_closest_source_point_adaptation.cc(123): Leaving test case "closest_source_point_adaptation"; testing time: 4437208us
8: [0;39;49m[1;34;49mLeaving test module "ClosestSourcePointAdaptation"; testing time: 4437263us
8: [0;39;49m
8: [1;32;49m*** No errors detected
8: [0;39;49m
8: [1;32;49m*** No errors detected
8: [0;39;49m[0;39;49m[1;34;49m/var/jenkins/workspace/adamantine-nightly/tests/test_closest_source_point_adaptation.cc(123): Leaving test case "closest_source_point_adaptation"; testing time: 4436574us
8: [0;39;49m[1;34;49mLeaving test module "ClosestSourcePointAdaptation"; testing time: 4436624us
8: [0;39;49m[0;39;49m[1;34;49m/var/jenkins/workspace/adamantine-nightly/tests/test_closest_source_point_adaptation.cc(123): Leaving test case "closest_source_point_adaptation"; testing time: 4433666us
8: [0;39;49m[1;34;49mLeaving test module "ClosestSourcePointAdaptation"; testing time: 4433709us
8: [0;39;49m[0;39;49m[1;34;49m/var/jenkins/workspace/adamantine-nightly/tests/test_closest_source_point_adaptation.cc(123): Leaving test case "closest_source_point_adaptation"; testing time: 4432874us
8: [0;39;49m[1;34;49mLeaving test module "ClosestSourcePointAdaptation"; testing time: 4432931us
8: [0;39;49m[0;39;49m[1;34;49m/var/jenkins/workspace/adamantine-nightly/tests/test_closest_source_point_adaptation.cc(123): Leaving test case "closest_source_point_adaptation"; testing time: 4438756us
8: [0;39;49m[1;34;49mLeaving test module "ClosestSourcePointAdaptation"; testing time: 4438807us
8: [0;39;49m
8: [1;32;49m*** No errors detected
8: [0;39;49m
8: [1;32;49m*** No errors detected
8: [0;39;49m
8: [1;32;49m*** No errors detected
8: [0;39;49m
8: [1;32;49m*** No errors detected
8: [0;39;49m
48/48 Test #8: test_closest_source_point_adaptation_6 ... Passed 6.41 sec
The following tests passed:
test_closest_source_point_adaptation_1
test_data_assimilator_1
test_experimental_data_1
test_geometry_1
test_heat_source_1
test_integration_da_2
test_closest_source_point_adaptation_2
test_material_property_1
test_material_property_device_1
test_integration_da_1
test_post_processor_1
test_quaternion_1
test_scan_path_1
test_mechanical_operator_1
test_thermal_operator_1
test_thermal_operator_device_1
test_timer_1
test_utils_1
test_validate_input_database_1
test_integration_2d_1
test_integration_2d_device_1
test_mechanical_physics_1
test_thermal_physics_device_1
test_integration_3d_amr_device_1
test_integration_3d_amr_1
test_integration_da_augmented_1
test_material_deposition_1
test_microstructure_1
test_thermal_physics_1
test_ensemble_management_1
test_integration_3d_device_1
test_integration_2d_2
test_integration_2d_device_2
test_integration_3d_amr_2
test_integration_3d_amr_device_2
test_integration_da_augmented_2
test_material_deposition_2
test_microstructure_2
test_thermal_physics_2
test_ensemble_management_2
test_integration_thermoelastic_2
test_integration_da_3
test_integration_da_6
test_closest_source_point_adaptation_3
test_closest_source_point_adaptation_6
94% tests passed, 3 tests failed out of 48
Total Test time (real) = 12806.21 sec
The following tests FAILED:
31 - test_integration_3d_1 (Timeout)
32 - test_integration_3d_2 (Timeout)
39 - test_integration_thermoelastic_1 (Timeout)
Errors while running CTest
Output from these tests are in: /var/jenkins/workspace/adamantine-nightly/build/Testing/Temporary/LastTest.log
Use "--rerun-failed --output-on-failure" to re-run the failed cases verbosely.
[Pipeline] }
[Pipeline] // dir
Post stage
[Pipeline] xunit
INFO: Processing CTest-Version 3.x (default)
[Pipeline] }
[Pipeline] // withEnv
[Pipeline] }
$ docker stop --time=1 995043bc5a1948c0810c01fc6c653370b57faf89628af2cf5f98e146f9cbd984
INFO: [CTest-Version 3.x (default)] - 1 test report file(s) were found with the pattern 'build/Testing/**/Test.xml' relative to '/var/jenkins/workspace/adamantine-nightly' for the testing framework 'CTest-Version 3.x (default)'.
$ docker rm -f --volumes 995043bc5a1948c0810c01fc6c653370b57faf89628af2cf5f98e146f9cbd984
[Pipeline] // withDockerContainer
[Pipeline] }
[Pipeline] // withEnv
[Pipeline] }
[Pipeline] // node
[Pipeline] }
[Pipeline] // stage
[Pipeline] }
Failed in branch CUDA
[Pipeline] // parallel
[Pipeline] }
[Pipeline] // stage
[Pipeline] }
[Pipeline] // timeout
[Pipeline] }
[Pipeline] // withEnv
[Pipeline] End of Pipeline
ERROR: script returned exit code 8
Finished: FAILURE