Skip to content
Skipping 230 KB.. Full Log
38: Rank: 0 | New parameters for member 1: 0.142225 
38: 80% completed
38: 90% completed
38: 100% completed
32: n_time_step: 601 time: 6 n_dofs (thermal) after cell activation: 1220
32: 60% completed
38: 
38: *** No errors detected
38: 
38: *** No errors detected
38: /var/jenkins/workspace/adamantine-nightly/tests/test_integration_da_augmented.cc(19): Leaving test case "integration_3D_data_assimilation_augmented"; testing time: 39112656us
38: Leaving test module "Integration_Data_Assimilation_Augmented"; testing time: 39112971us
38: /var/jenkins/workspace/adamantine-nightly/tests/test_integration_da_augmented.cc(19): Leaving test case "integration_3D_data_assimilation_augmented"; testing time: 39112430us
38: Leaving test module "Integration_Data_Assimilation_Augmented"; testing time: 39112799us
38: 
38/48 Test #38: test_integration_da_augmented_2 ..........   Passed   39.86 sec
test 40
      Start 40: test_integration_thermoelastic_2

40: Test command: /usr/bin/mpiexec "-n" "2" "/var/jenkins/workspace/adamantine-nightly/build/bin/test_integration_thermoelastic"
40: Working Directory: /var/jenkins/workspace/adamantine-nightly/build/tests
40: Test timeout computed to be: 7200
40: Running 2 test cases...
40: Entering test module "Integration_Thermoelastic"
40: /var/jenkins/workspace/adamantine-nightly/tests/test_integration_thermoelastic.cc(19): Entering test case "integration_thermoelastic"
40: Running 2 test cases...
40: Entering test module "Integration_Thermoelastic"
40: /var/jenkins/workspace/adamantine-nightly/tests/test_integration_thermoelastic.cc(19): Entering test case "integration_thermoelastic"
32: n_time_step: 624 time: 6.23 n_dofs (thermal) after cell activation: 1221
32: n_time_step: 647 time: 6.46 n_dofs (thermal) after cell activation: 1222
32: n_time_step: 671 time: 6.7 n_dofs (thermal) after cell activation: 1223
34/48 Test #31: test_integration_3d_1 ....................***Timeout 7200.05 sec
32: n_time_step: 694 time: 6.93 n_dofs (thermal) after cell activation: 1224
32: 70% completed
32: n_time_step: 717 time: 7.16 n_dofs (thermal) after cell activation: 1226
32: n_time_step: 740 time: 7.39 n_dofs (thermal) after cell activation: 1227
32: n_time_step: 763 time: 7.62 n_dofs (thermal) after cell activation: 1228
32: n_time_step: 787 time: 7.86 n_dofs (thermal) after cell activation: 1229
32: 80% completed
40: 10% completed
32: n_time_step: 810 time: 8.09 n_dofs (thermal) after cell activation: 1230
32: 50% completed
39: 50% completed
32: n_time_step: 833 time: 8.32 n_dofs (thermal) after cell activation: 1231
32: n_time_step: 857 time: 8.56 n_dofs (thermal) after cell activation: 1232
32: n_time_step: 880 time: 8.79 n_dofs (thermal) after cell activation: 1233
32: 90% completed
32: n_time_step: 903 time: 9.02 n_dofs (thermal) after cell activation: 1234
35/48 Test #39: test_integration_thermoelastic_1 .........***Timeout 7200.09 sec
test 34
      Start 34: test_integration_3d_amr_2

34: Test command: /usr/bin/mpiexec "-n" "2" "/var/jenkins/workspace/adamantine-nightly/build/bin/test_integration_3d_amr"
34: Working Directory: /var/jenkins/workspace/adamantine-nightly/build/tests
34: Test timeout computed to be: 7200
34: Running 2 test cases...
34: Entering test module "Integration_3D_AMR"
34: /var/jenkins/workspace/adamantine-nightly/tests/test_integration_3d_amr.cc(19): Entering test case "integration_3D_amr"
34: Running 2 test cases...
34: Entering test module "Integration_3D_AMR"
34: /var/jenkins/workspace/adamantine-nightly/tests/test_integration_3d_amr.cc(19): Entering test case "integration_3D_amr"
34: 10% completed
39/48 Test #32: test_integration_3d_2 ....................***Timeout 7200.02 sec
test 42
      Start 42: test_material_deposition_2

42: Test command: /usr/bin/mpiexec "-n" "2" "/var/jenkins/workspace/adamantine-nightly/build/bin/test_material_deposition"
42: Working Directory: /var/jenkins/workspace/adamantine-nightly/build/tests
42: Test timeout computed to be: 7200
42: Running 11 test cases...
42: Entering test module "MaterialDeposition"
42: /var/jenkins/workspace/adamantine-nightly/tests/test_material_deposition.cc(50): Entering test case "read_material_deposition_file_2d"
42: Running 11 test cases...
42: Entering test module "MaterialDeposition"
42: /var/jenkins/workspace/adamantine-nightly/tests/test_material_deposition.cc(50): Entering test case "read_material_deposition_file_2d"
42: /var/jenkins/workspace/adamantine-nightly/tests/test_material_deposition.cc(50): Leaving test case "read_material_deposition_file_2d"; testing time: 297us
42: /var/jenkins/workspace/adamantine-nightly/tests/test_material_deposition.cc(92): Entering test case "read_material_deposition_file_3d"
42: /var/jenkins/workspace/adamantine-nightly/tests/test_material_deposition.cc(50): Leaving test case "read_material_deposition_file_2d"; testing time: 389us
42: /var/jenkins/workspace/adamantine-nightly/tests/test_material_deposition.cc(92): Entering test case "read_material_deposition_file_3d"
42: /var/jenkins/workspace/adamantine-nightly/tests/test_material_deposition.cc(92): Leaving test case "read_material_deposition_file_3d"; testing time: 195us
42: /var/jenkins/workspace/adamantine-nightly/tests/test_material_deposition.cc(134): Test case "get_elements_to_activate_2d" is skipped because precondition failed: the test only works in serial
42: /var/jenkins/workspace/adamantine-nightly/tests/test_material_deposition.cc(195): Test case "get_elements_to_activate_3d" is skipped because precondition failed: the test only works in serial
42: /var/jenkins/workspace/adamantine-nightly/tests/test_material_deposition.cc(262): Entering test case "material_deposition"
42: /var/jenkins/workspace/adamantine-nightly/tests/test_material_deposition.cc(92): Leaving test case "read_material_deposition_file_3d"; testing time: 186us
42: /var/jenkins/workspace/adamantine-nightly/tests/test_material_deposition.cc(134): Test case "get_elements_to_activate_2d" is skipped because precondition failed: the test only works in serial
42: /var/jenkins/workspace/adamantine-nightly/tests/test_material_deposition.cc(195): Test case "get_elements_to_activate_3d" is skipped because precondition failed: the test only works in serial
42: /var/jenkins/workspace/adamantine-nightly/tests/test_material_deposition.cc(262): Entering test case "material_deposition"
34: 20% completed
34: 30% completed
34: 40% completed
34: 50% completed
34: 60% completed
34: 70% completed
34: 80% completed
34: 90% completed
34: 100% completed
34: /var/jenkins/workspace/adamantine-nightly/tests/test_integration_3d_amr.cc(19): Leaving test case "integration_3D_amr"; testing time: 14803462us
34: /var/jenkins/workspace/adamantine-nightly/tests/test_integration_3d_amr.cc(60): Entering test case "integration_3D_amr_refine_coarsen"
34: /var/jenkins/workspace/adamantine-nightly/tests/test_integration_3d_amr.cc(19): Leaving test case "integration_3D_amr"; testing time: 14831144us
34: /var/jenkins/workspace/adamantine-nightly/tests/test_integration_3d_amr.cc(60): Entering test case "integration_3D_amr_refine_coarsen"
42: /var/jenkins/workspace/adamantine-nightly/tests/test_material_deposition.cc(262): Leaving test case "material_deposition"; testing time: 10716051us
42: /var/jenkins/workspace/adamantine-nightly/tests/test_material_deposition.cc(395): Entering test case "deposition_from_scan_path_2d"
42: /var/jenkins/workspace/adamantine-nightly/tests/test_material_deposition.cc(395): Leaving test case "deposition_from_scan_path_2d"; testing time: 247us
42: /var/jenkins/workspace/adamantine-nightly/tests/test_material_deposition.cc(445): Entering test case "deposition_from_scan_path_3d"
42: /var/jenkins/workspace/adamantine-nightly/tests/test_material_deposition.cc(262): Leaving test case "material_deposition"; testing time: 10716230us
42: /var/jenkins/workspace/adamantine-nightly/tests/test_material_deposition.cc(445): Leaving test case "deposition_from_scan_path_3d"; testing time: 192us
42: /var/jenkins/workspace/adamantine-nightly/tests/test_material_deposition.cc(499): Entering test case "deposition_from_L_scan_path_3d"
42: /var/jenkins/workspace/adamantine-nightly/tests/test_material_deposition.cc(499): Leaving test case "deposition_from_L_scan_path_3d"; testing time: 191us
42: /var/jenkins/workspace/adamantine-nightly/tests/test_material_deposition.cc(586): Entering test case "deposition_from_diagonal_scan_path_3d"
42: /var/jenkins/workspace/adamantine-nightly/tests/test_material_deposition.cc(586): Leaving test case "deposition_from_diagonal_scan_path_3d"; testing time: 166us
42: /var/jenkins/workspace/adamantine-nightly/tests/test_material_deposition.cc(640): Entering test case "merge_multiple_deposition_paths"
42: /var/jenkins/workspace/adamantine-nightly/tests/test_material_deposition.cc(640): Leaving test case "merge_multiple_deposition_paths"; testing time: 126us
42: /var/jenkins/workspace/adamantine-nightly/tests/test_material_deposition.cc(697): Entering test case "deposition_quaternion_straight_line"
42: /var/jenkins/workspace/adamantine-nightly/tests/test_material_deposition.cc(697): Leaving test case "deposition_quaternion_straight_line"; testing time: 501us
42: Leaving test module "MaterialDeposition"; testing time: 10719529us
42: 
42: *** No errors detected
42: /var/jenkins/workspace/adamantine-nightly/tests/test_material_deposition.cc(395): Entering test case "deposition_from_scan_path_2d"
42: /var/jenkins/workspace/adamantine-nightly/tests/test_material_deposition.cc(395): Leaving test case "deposition_from_scan_path_2d"; testing time: 343us
42: /var/jenkins/workspace/adamantine-nightly/tests/test_material_deposition.cc(445): Entering test case "deposition_from_scan_path_3d"
42: /var/jenkins/workspace/adamantine-nightly/tests/test_material_deposition.cc(445): Leaving test case "deposition_from_scan_path_3d"; testing time: 174us
42: /var/jenkins/workspace/adamantine-nightly/tests/test_material_deposition.cc(499): Entering test case "deposition_from_L_scan_path_3d"
42: /var/jenkins/workspace/adamantine-nightly/tests/test_material_deposition.cc(499): Leaving test case "deposition_from_L_scan_path_3d"; testing time: 194us
42: /var/jenkins/workspace/adamantine-nightly/tests/test_material_deposition.cc(586): Entering test case "deposition_from_diagonal_scan_path_3d"
42: /var/jenkins/workspace/adamantine-nightly/tests/test_material_deposition.cc(586): Leaving test case "deposition_from_diagonal_scan_path_3d"; testing time: 179us
42: /var/jenkins/workspace/adamantine-nightly/tests/test_material_deposition.cc(640): Entering test case "merge_multiple_deposition_paths"
42: /var/jenkins/workspace/adamantine-nightly/tests/test_material_deposition.cc(640): Leaving test case "merge_multiple_deposition_paths"; testing time: 112us
42: /var/jenkins/workspace/adamantine-nightly/tests/test_material_deposition.cc(697): Entering test case "deposition_quaternion_straight_line"
42: /var/jenkins/workspace/adamantine-nightly/tests/test_material_deposition.cc(697): Leaving test case "deposition_quaternion_straight_line"; testing time: 536us
42: Leaving test module "MaterialDeposition"; testing time: 10725800us
42: 
42: *** No errors detected
42: 
40/48 Test #42: test_material_deposition_2 ...............   Passed   11.51 sec
test 44
      Start 44: test_microstructure_2

44: Test command: /usr/bin/mpiexec "-n" "2" "/var/jenkins/workspace/adamantine-nightly/build/bin/test_microstructure"
44: Working Directory: /var/jenkins/workspace/adamantine-nightly/build/tests
44: Test timeout computed to be: 7200
44: Running 1 test case...
44: Entering test module "MicroStructure"
44: /var/jenkins/workspace/adamantine-nightly/tests/test_microstructure.cc(53): Entering test case "G_and_R"
44: Running 1 test case...
44: Entering test module "MicroStructure"
44: /var/jenkins/workspace/adamantine-nightly/tests/test_microstructure.cc(53): Entering test case "G_and_R"
44: Test case G_and_R did not check any assertions
44: /var/jenkins/workspace/adamantine-nightly/tests/test_microstructure.cc(53): Leaving test case "G_and_R"; testing time: 231863us
44: Leaving test module "MicroStructure"; testing time: 231928us
44: 
44: *** No errors detected
44: /var/jenkins/workspace/adamantine-nightly/tests/test_microstructure.cc(53): Leaving test case "G_and_R"; testing time: 233174us
44: Leaving test module "MicroStructure"; testing time: 233251us
44: 
44: *** No errors detected
44: 
41/48 Test #44: test_microstructure_2 ....................   Passed    0.97 sec
test 46
      Start 46: test_thermal_physics_2

46: Test command: /usr/bin/mpiexec "-n" "2" "/var/jenkins/workspace/adamantine-nightly/build/bin/test_thermal_physics"
46: Working Directory: /var/jenkins/workspace/adamantine-nightly/build/tests
46: Test timeout computed to be: 7200
46: Running 7 test cases...
46: Entering test module "ThermalPhysics"
46: /var/jenkins/workspace/adamantine-nightly/tests/test_thermal_physics.cc(15): Entering test case "thermal_2d_explicit_host"
46: Running 7 test cases...
46: Entering test module "ThermalPhysics"
46: /var/jenkins/workspace/adamantine-nightly/tests/test_thermal_physics.cc(15): Entering test case "thermal_2d_explicit_host"
46: /var/jenkins/workspace/adamantine-nightly/tests/test_thermal_physics.cc(15): Leaving test case "thermal_2d_explicit_host"; testing time: 215106us
46: /var/jenkins/workspace/adamantine-nightly/tests/test_thermal_physics.cc(28): Entering test case "thermal_2d_manufactured_solution_host"
46: /var/jenkins/workspace/adamantine-nightly/tests/test_thermal_physics.cc(15): Leaving test case "thermal_2d_explicit_host"; testing time: 215231us
46: /var/jenkins/workspace/adamantine-nightly/tests/test_thermal_physics.cc(28): Entering test case "thermal_2d_manufactured_solution_host"
46: /var/jenkins/workspace/adamantine-nightly/tests/test_thermal_physics.cc(28): Leaving test case "thermal_2d_manufactured_solution_host"; testing time: 136322us
46: /var/jenkins/workspace/adamantine-nightly/tests/test_thermal_physics.cc(33): Entering test case "initial_temperature_host"
46: /var/jenkins/workspace/adamantine-nightly/tests/test_thermal_physics.cc(28): Leaving test case "thermal_2d_manufactured_solution_host"; testing time: 136049us
46: /var/jenkins/workspace/adamantine-nightly/tests/test_thermal_physics.cc(33): Entering test case "initial_temperature_host"
46: /var/jenkins/workspace/adamantine-nightly/tests/test_thermal_physics.cc(33): Leaving test case "initial_temperature_host"; testing time: 160850us
46: /var/jenkins/workspace/adamantine-nightly/tests/test_thermal_physics.cc(38): Entering test case "energy_conservation_host"
46: /var/jenkins/workspace/adamantine-nightly/tests/test_thermal_physics.cc(33): Leaving test case "initial_temperature_host"; testing time: 161031us
46: /var/jenkins/workspace/adamantine-nightly/tests/test_thermal_physics.cc(38): Entering test case "energy_conservation_host"
46: /var/jenkins/workspace/adamantine-nightly/tests/test_thermal_physics.cc(38): Leaving test case "energy_conservation_host"; testing time: 4517922us
46: /var/jenkins/workspace/adamantine-nightly/tests/test_thermal_physics.cc(43): Entering test case "radiation_bcs_host"
46: /var/jenkins/workspace/adamantine-nightly/tests/test_thermal_physics.cc(38): Leaving test case "energy_conservation_host"; testing time: 4517815us
46: /var/jenkins/workspace/adamantine-nightly/tests/test_thermal_physics.cc(43): Entering test case "radiation_bcs_host"
46: /var/jenkins/workspace/adamantine-nightly/tests/test_thermal_physics.cc(43): Leaving test case "radiation_bcs_host"; testing time: 2632870us
46: /var/jenkins/workspace/adamantine-nightly/tests/test_thermal_physics.cc(48): Entering test case "convection_bcs_host"
46: /var/jenkins/workspace/adamantine-nightly/tests/test_thermal_physics.cc(43): Leaving test case "radiation_bcs_host"; testing time: 2620501us
46: /var/jenkins/workspace/adamantine-nightly/tests/test_thermal_physics.cc(48): Entering test case "convection_bcs_host"
34: 10% completed
40: 20% completed
34: 20% completed
46: /var/jenkins/workspace/adamantine-nightly/tests/test_thermal_physics.cc(48): Leaving test case "convection_bcs_host"; testing time: 47002353us
46: /var/jenkins/workspace/adamantine-nightly/tests/test_thermal_physics.cc(53): Entering test case "reference_temperature_host"
46: /var/jenkins/workspace/adamantine-nightly/tests/test_thermal_physics.cc(48): Leaving test case "convection_bcs_host"; testing time: 47002652us
46: /var/jenkins/workspace/adamantine-nightly/tests/test_thermal_physics.cc(53): Entering test case "reference_temperature_host"
46: /var/jenkins/workspace/adamantine-nightly/tests/test_thermal_physics.cc(53): Leaving test case "reference_temperature_host"; testing time: 138928us
46: Leaving test module "ThermalPhysics"; testing time: 54817735us
46: 
46: *** No errors detected
46: /var/jenkins/workspace/adamantine-nightly/tests/test_thermal_physics.cc(53): Leaving test case "reference_temperature_host"; testing time: 174497us
46: Leaving test module "ThermalPhysics"; testing time: 54840622us
46: 
46: *** No errors detected
46: 
42/48 Test #46: test_thermal_physics_2 ...................   Passed   55.58 sec
test 48
      Start 48: test_ensemble_management_2

48: Test command: /usr/bin/mpiexec "-n" "2" "/var/jenkins/workspace/adamantine-nightly/build/bin/test_ensemble_management"
48: Working Directory: /var/jenkins/workspace/adamantine-nightly/build/tests
48: Test timeout computed to be: 7200
48: Running 1 test case...
48: Entering test module "EnsembleManagement"
48: /var/jenkins/workspace/adamantine-nightly/tests/test_ensemble_management.cc(17): Entering test case "database_ensemble"
48: Running 1 test case...
48: Entering test module "EnsembleManagement"
48: /var/jenkins/workspace/adamantine-nightly/tests/test_ensemble_management.cc(17): Entering test case "database_ensemble"
48: /var/jenkins/workspace/adamantine-nightly/tests/test_ensemble_management.cc(17): Leaving test case "database_ensemble"; testing time: 336us
48: Leaving test module "EnsembleManagement"; testing time: 364us
48: 
48: *** No errors detected
48: /var/jenkins/workspace/adamantine-nightly/tests/test_ensemble_management.cc(17): Leaving test case "database_ensemble"; testing time: 2364us
48: Leaving test module "EnsembleManagement"; testing time: 2407us
48: 
48: *** No errors detected
48: 
43/48 Test #48: test_ensemble_management_2 ...............   Passed    0.72 sec
34: 30% completed
34: 40% completed
34: 50% completed
34: 60% completed
34: 70% completed
34: 80% completed
34: 90% completed
34: 100% completed
34: 
34: *** No errors detected
34: /var/jenkins/workspace/adamantine-nightly/tests/test_integration_3d_amr.cc(60): Leaving test case "integration_3D_amr_refine_coarsen"; testing time: 140485786us
34: Leaving test module "Integration_3D_AMR"; testing time: 155290229us
34: /var/jenkins/workspace/adamantine-nightly/tests/test_integration_3d_amr.cc(60): Leaving test case "integration_3D_amr_refine_coarsen"; testing time: 140474822us
34: Leaving test module "Integration_3D_AMR"; testing time: 155307173us
34: 
34: *** No errors detected
34: 
36/48 Test #34: test_integration_3d_amr_2 ................   Passed  163.66 sec
test 36
      Start 36: test_integration_3d_amr_device_2

36: Test command: /usr/bin/mpiexec "-n" "2" "/var/jenkins/workspace/adamantine-nightly/build/bin/test_integration_3d_amr_device"
36: Working Directory: /var/jenkins/workspace/adamantine-nightly/build/tests
36: Test timeout computed to be: 7200
36: Running 1 test case...
36: Entering test module "Integration_3D_AMR"
36: /var/jenkins/workspace/adamantine-nightly/tests/test_integration_3d_amr_device.cc(19): Entering test case "integration_3D_amr_device"
36: Running 1 test case...
36: Entering test module "Integration_3D_AMR"
36: /var/jenkins/workspace/adamantine-nightly/tests/test_integration_3d_amr_device.cc(19): Entering test case "integration_3D_amr_device"
36: 10% completed
40: 30% completed
32: 60% completed
36: 20% completed
36: 30% completed
36: 40% completed
36: 50% completed
36: 60% completed
36: 70% completed
36: 80% completed
36: 90% completed
36: 100% completed
36: /var/jenkins/workspace/adamantine-nightly/tests/test_integration_3d_amr_device.cc(19): Leaving test case "integration_3D_amr_device"; testing time: 125200608us
36: Leaving test module "Integration_3D_AMR"; testing time: 125200928us
36: 
36: *** No errors detected
36: /var/jenkins/workspace/adamantine-nightly/tests/test_integration_3d_amr_device.cc(19): Leaving test case "integration_3D_amr_device"; testing time: 125139791us
36: Leaving test module "Integration_3D_AMR"; testing time: 125140155us
36: 
36: *** No errors detected
36: 
37/48 Test #36: test_integration_3d_amr_device_2 .........   Passed  133.10 sec
test 38
      Start 38: test_integration_da_augmented_2

38: Test command: /usr/bin/mpiexec "-n" "2" "/var/jenkins/workspace/adamantine-nightly/build/bin/test_integration_da_augmented"
38: Working Directory: /var/jenkins/workspace/adamantine-nightly/build/tests
38: Test timeout computed to be: 7200
38: Running 1 test case...
38: Entering test module "Integration_Data_Assimilation_Augmented"
38: /var/jenkins/workspace/adamantine-nightly/tests/test_integration_da_augmented.cc(19): Entering test case "integration_3D_data_assimilation_augmented"
38: Running 1 test case...
38: Entering test module "Integration_Data_Assimilation_Augmented"
38: /var/jenkins/workspace/adamantine-nightly/tests/test_integration_da_augmented.cc(19): Entering test case "integration_3D_data_assimilation_augmented"
38: Reading the experimental log file...
38: Done. Log entries found for 1 camera(s), with 2 frame(s).
38: Starting the main time stepping loop...
38: 10% completed
40: 40% completed
38: 20% completed
38: 30% completed
38: Rank: 1 | Old parameters for member 2: 0.446065 
38: Rank: 1 | Number expt sites mapped to DOFs: 2
38: 40% completed
38: 50% completed
38: 60% completed
38: 70% completed
38: Performing data assimilation at time 0.04...
38: Rank: 0 | Old parameters for member 0: 0.413453 
38: Rank: 0 | Old parameters for member 1: 0.385362 
38: Rank: 0 | Number expt sites mapped to DOFs: 2
38: Getting the perturbed innovation...
38: Applying the Kalman gain...
38: Updating the ensemble members...
38: Rank: 1 | New parameters for member 2: 0.107206 
38: Done.
38: Rank: 0 | New parameters for member 0: 0.121104 
38: Rank: 0 | New parameters for member 1: 0.142225 
38: 80% completed
38: 90% completed
38: 100% completed
38: 
38: *** No errors detected
38: /var/jenkins/workspace/adamantine-nightly/tests/test_integration_da_augmented.cc(19): Leaving test case "integration_3D_data_assimilation_augmented"; testing time: 70788598us
38: Leaving test module "Integration_Data_Assimilation_Augmented"; testing time: 70788952us
38: /var/jenkins/workspace/adamantine-nightly/tests/test_integration_da_augmented.cc(19): Leaving test case "integration_3D_data_assimilation_augmented"; testing time: 70741348us
38: Leaving test module "Integration_Data_Assimilation_Augmented"; testing time: 70741805us
38: 
38: *** No errors detected
38: 
38/48 Test #38: test_integration_da_augmented_2 ..........   Passed   79.61 sec
test 40
      Start 40: test_integration_thermoelastic_2

40: Test command: /usr/bin/mpiexec "-n" "2" "/var/jenkins/workspace/adamantine-nightly/build/bin/test_integration_thermoelastic"
40: Working Directory: /var/jenkins/workspace/adamantine-nightly/build/tests
40: Test timeout computed to be: 7200
40: Running 2 test cases...
40: Entering test module "Integration_Thermoelastic"
40: /var/jenkins/workspace/adamantine-nightly/tests/test_integration_thermoelastic.cc(19): Entering test case "integration_thermoelastic"
40: Running 2 test cases...
40: Entering test module "Integration_Thermoelastic"
40: /var/jenkins/workspace/adamantine-nightly/tests/test_integration_thermoelastic.cc(19): Entering test case "integration_thermoelastic"
40: 50% completed
40: 60% completed
40: 70% completed
32: 70% completed
40: 80% completed
40: 90% completed
40: 10% completed
40: 100% completed
40: /var/jenkins/workspace/adamantine-nightly/tests/test_integration_thermoelastic.cc(19): Leaving test case "integration_thermoelastic"; testing time: 1804965532us
40: /var/jenkins/workspace/adamantine-nightly/tests/test_integration_thermoelastic.cc(47): Entering test case "integration_thermoelastic_add_material"
40: /var/jenkins/workspace/adamantine-nightly/tests/test_integration_thermoelastic.cc(19): Leaving test case "integration_thermoelastic"; testing time: 1804965262us
40: /var/jenkins/workspace/adamantine-nightly/tests/test_integration_thermoelastic.cc(47): Entering test case "integration_thermoelastic_add_material"
32: 80% completed
40: 10% completed
40: 20% completed
39/48 Test #32: test_integration_3d_2 ....................***Timeout 7200.09 sec
test 42
      Start 42: test_material_deposition_2

42: Test command: /usr/bin/mpiexec "-n" "2" "/var/jenkins/workspace/adamantine-nightly/build/bin/test_material_deposition"
42: Working Directory: /var/jenkins/workspace/adamantine-nightly/build/tests
42: Test timeout computed to be: 7200
42: Running 11 test cases...
42: Entering test module "MaterialDeposition"
42: /var/jenkins/workspace/adamantine-nightly/tests/test_material_deposition.cc(50): Entering test case "read_material_deposition_file_2d"
42: /var/jenkins/workspace/adamantine-nightly/tests/test_material_deposition.cc(50): Leaving test case "read_material_deposition_file_2d"; testing time: 23933us
42: /var/jenkins/workspace/adamantine-nightly/tests/test_material_deposition.cc(92): Entering test case "read_material_deposition_file_3d"
42: /var/jenkins/workspace/adamantine-nightly/tests/test_material_deposition.cc(92): Leaving test case "read_material_deposition_file_3d"; testing time: 16743us
42: /var/jenkins/workspace/adamantine-nightly/tests/test_material_deposition.cc(134): Test case "get_elements_to_activate_2d" is skipped because precondition failed: the test only works in serial
42: /var/jenkins/workspace/adamantine-nightly/tests/test_material_deposition.cc(195): Test case "get_elements_to_activate_3d" is skipped because precondition failed: the test only works in serial
42: /var/jenkins/workspace/adamantine-nightly/tests/test_material_deposition.cc(262): Entering test case "material_deposition"
42: Running 11 test cases...
42: Entering test module "MaterialDeposition"
42: /var/jenkins/workspace/adamantine-nightly/tests/test_material_deposition.cc(50): Entering test case "read_material_deposition_file_2d"
42: /var/jenkins/workspace/adamantine-nightly/tests/test_material_deposition.cc(50): Leaving test case "read_material_deposition_file_2d"; testing time: 479us
42: /var/jenkins/workspace/adamantine-nightly/tests/test_material_deposition.cc(92): Entering test case "read_material_deposition_file_3d"
42: /var/jenkins/workspace/adamantine-nightly/tests/test_material_deposition.cc(92): Leaving test case "read_material_deposition_file_3d"; testing time: 238us
42: /var/jenkins/workspace/adamantine-nightly/tests/test_material_deposition.cc(134): Test case "get_elements_to_activate_2d" is skipped because precondition failed: the test only works in serial
42: /var/jenkins/workspace/adamantine-nightly/tests/test_material_deposition.cc(195): Test case "get_elements_to_activate_3d" is skipped because precondition failed: the test only works in serial
42: /var/jenkins/workspace/adamantine-nightly/tests/test_material_deposition.cc(262): Entering test case "material_deposition"
40: 30% completed
42: /var/jenkins/workspace/adamantine-nightly/tests/test_material_deposition.cc(262): Leaving test case "material_deposition"; testing time: 16488867us
42: /var/jenkins/workspace/adamantine-nightly/tests/test_material_deposition.cc(395): Entering test case "deposition_from_scan_path_2d"
42: /var/jenkins/workspace/adamantine-nightly/tests/test_material_deposition.cc(262): Leaving test case "material_deposition"; testing time: 16474726us
42: /var/jenkins/workspace/adamantine-nightly/tests/test_material_deposition.cc(395): Entering test case "deposition_from_scan_path_2d"
42: /var/jenkins/workspace/adamantine-nightly/tests/test_material_deposition.cc(395): Leaving test case "deposition_from_scan_path_2d"; testing time: 13858us
42: /var/jenkins/workspace/adamantine-nightly/tests/test_material_deposition.cc(445): Entering test case "deposition_from_scan_path_3d"
42: /var/jenkins/workspace/adamantine-nightly/tests/test_material_deposition.cc(445): Leaving test case "deposition_from_scan_path_3d"; testing time: 218us
42: /var/jenkins/workspace/adamantine-nightly/tests/test_material_deposition.cc(499): Entering test case "deposition_from_L_scan_path_3d"
42: /var/jenkins/workspace/adamantine-nightly/tests/test_material_deposition.cc(395): Leaving test case "deposition_from_scan_path_2d"; testing time: 13763us
42: /var/jenkins/workspace/adamantine-nightly/tests/test_material_deposition.cc(445): Entering test case "deposition_from_scan_path_3d"
42: /var/jenkins/workspace/adamantine-nightly/tests/test_material_deposition.cc(445): Leaving test case "deposition_from_scan_path_3d"; testing time: 232us
42: /var/jenkins/workspace/adamantine-nightly/tests/test_material_deposition.cc(499): Entering test case "deposition_from_L_scan_path_3d"
42: /var/jenkins/workspace/adamantine-nightly/tests/test_material_deposition.cc(499): Leaving test case "deposition_from_L_scan_path_3d"; testing time: 11327us
42: /var/jenkins/workspace/adamantine-nightly/tests/test_material_deposition.cc(586): Entering test case "deposition_from_diagonal_scan_path_3d"
42: /var/jenkins/workspace/adamantine-nightly/tests/test_material_deposition.cc(499): Leaving test case "deposition_from_L_scan_path_3d"; testing time: 12257us
42: /var/jenkins/workspace/adamantine-nightly/tests/test_material_deposition.cc(586): Entering test case "deposition_from_diagonal_scan_path_3d"
42: /var/jenkins/workspace/adamantine-nightly/tests/test_material_deposition.cc(586): Leaving test case "deposition_from_diagonal_scan_path_3d"; testing time: 22722us
42: /var/jenkins/workspace/adamantine-nightly/tests/test_material_deposition.cc(640): Entering test case "merge_multiple_deposition_paths"
42: /var/jenkins/workspace/adamantine-nightly/tests/test_material_deposition.cc(640): Leaving test case "merge_multiple_deposition_paths"; testing time: 141us
42: /var/jenkins/workspace/adamantine-nightly/tests/test_material_deposition.cc(697): Entering test case "deposition_quaternion_straight_line"
42: /var/jenkins/workspace/adamantine-nightly/tests/test_material_deposition.cc(586): Leaving test case "deposition_from_diagonal_scan_path_3d"; testing time: 21711us
42: /var/jenkins/workspace/adamantine-nightly/tests/test_material_deposition.cc(640): Entering test case "merge_multiple_deposition_paths"
42: /var/jenkins/workspace/adamantine-nightly/tests/test_material_deposition.cc(640): Leaving test case "merge_multiple_deposition_paths"; testing time: 153us
42: /var/jenkins/workspace/adamantine-nightly/tests/test_material_deposition.cc(697): Entering test case "deposition_quaternion_straight_line"
42: /var/jenkins/workspace/adamantine-nightly/tests/test_material_deposition.cc(697): Leaving test case "deposition_quaternion_straight_line"; testing time: 7059us
42: Leaving test module "MaterialDeposition"; testing time: 16586737us
42: 
42: *** No errors detected
42: /var/jenkins/workspace/adamantine-nightly/tests/test_material_deposition.cc(697): Leaving test case "deposition_quaternion_straight_line"; testing time: 11804us
42: Leaving test module "MaterialDeposition"; testing time: 16537497us
42: 
42: *** No errors detected
42: 
40/48 Test #42: test_material_deposition_2 ...............   Passed   23.85 sec
test 44
      Start 44: test_microstructure_2

44: Test command: /usr/bin/mpiexec "-n" "2" "/var/jenkins/workspace/adamantine-nightly/build/bin/test_microstructure"
44: Working Directory: /var/jenkins/workspace/adamantine-nightly/build/tests
44: Test timeout computed to be: 7200
44: Running 1 test case...
44: Entering test module "MicroStructure"
44: /var/jenkins/workspace/adamantine-nightly/tests/test_microstructure.cc(53): Entering test case "G_and_R"
44: Running 1 test case...
44: Entering test module "MicroStructure"
44: /var/jenkins/workspace/adamantine-nightly/tests/test_microstructure.cc(53): Entering test case "G_and_R"
44: 
44: *** No errors detected
44: Test case G_and_R did not check any assertions
44: /var/jenkins/workspace/adamantine-nightly/tests/test_microstructure.cc(53): Leaving test case "G_and_R"; testing time: 457706us
44: Leaving test module "MicroStructure"; testing time: 457759us
44: 
44: *** No errors detected
44: /var/jenkins/workspace/adamantine-nightly/tests/test_microstructure.cc(53): Leaving test case "G_and_R"; testing time: 634385us
44: Leaving test module "MicroStructure"; testing time: 634436us
44: 
41/48 Test #44: test_microstructure_2 ....................   Passed    7.60 sec
test 46
      Start 46: test_thermal_physics_2

46: Test command: /usr/bin/mpiexec "-n" "2" "/var/jenkins/workspace/adamantine-nightly/build/bin/test_thermal_physics"
46: Working Directory: /var/jenkins/workspace/adamantine-nightly/build/tests
46: Test timeout computed to be: 7200
46: Running 7 test cases...
46: Entering test module "ThermalPhysics"
46: /var/jenkins/workspace/adamantine-nightly/tests/test_thermal_physics.cc(15): Entering test case "thermal_2d_explicit_host"
46: Running 7 test cases...
46: Entering test module "ThermalPhysics"
46: /var/jenkins/workspace/adamantine-nightly/tests/test_thermal_physics.cc(15): Entering test case "thermal_2d_explicit_host"
46: /var/jenkins/workspace/adamantine-nightly/tests/test_thermal_physics.cc(15): Leaving test case "thermal_2d_explicit_host"; testing time: 313530us
46: /var/jenkins/workspace/adamantine-nightly/tests/test_thermal_physics.cc(28): Entering test case "thermal_2d_manufactured_solution_host"
46: /var/jenkins/workspace/adamantine-nightly/tests/test_thermal_physics.cc(15): Leaving test case "thermal_2d_explicit_host"; testing time: 354600us
46: /var/jenkins/workspace/adamantine-nightly/tests/test_thermal_physics.cc(28): Entering test case "thermal_2d_manufactured_solution_host"
46: /var/jenkins/workspace/adamantine-nightly/tests/test_thermal_physics.cc(28): Leaving test case "thermal_2d_manufactured_solution_host"; testing time: 265276us
46: /var/jenkins/workspace/adamantine-nightly/tests/test_thermal_physics.cc(33): Entering test case "initial_temperature_host"
46: /var/jenkins/workspace/adamantine-nightly/tests/test_thermal_physics.cc(28): Leaving test case "thermal_2d_manufactured_solution_host"; testing time: 264851us
46: /var/jenkins/workspace/adamantine-nightly/tests/test_thermal_physics.cc(33): Entering test case "initial_temperature_host"
46: /var/jenkins/workspace/adamantine-nightly/tests/test_thermal_physics.cc(33): Leaving test case "initial_temperature_host"; testing time: 211423us
46: /var/jenkins/workspace/adamantine-nightly/tests/test_thermal_physics.cc(38): Entering test case "energy_conservation_host"
46: /var/jenkins/workspace/adamantine-nightly/tests/test_thermal_physics.cc(33): Leaving test case "initial_temperature_host"; testing time: 211290us
46: /var/jenkins/workspace/adamantine-nightly/tests/test_thermal_physics.cc(38): Entering test case "energy_conservation_host"
46: /var/jenkins/workspace/adamantine-nightly/tests/test_thermal_physics.cc(38): Leaving test case "energy_conservation_host"; testing time: 8499287us
46: /var/jenkins/workspace/adamantine-nightly/tests/test_thermal_physics.cc(43): Entering test case "radiation_bcs_host"
46: /var/jenkins/workspace/adamantine-nightly/tests/test_thermal_physics.cc(38): Leaving test case "energy_conservation_host"; testing time: 8499625us
46: /var/jenkins/workspace/adamantine-nightly/tests/test_thermal_physics.cc(43): Entering test case "radiation_bcs_host"
46: /var/jenkins/workspace/adamantine-nightly/tests/test_thermal_physics.cc(43): Leaving test case "radiation_bcs_host"; testing time: 4610087us
46: /var/jenkins/workspace/adamantine-nightly/tests/test_thermal_physics.cc(48): Entering test case "convection_bcs_host"
46: /var/jenkins/workspace/adamantine-nightly/tests/test_thermal_physics.cc(43): Leaving test case "radiation_bcs_host"; testing time: 4609932us
46: /var/jenkins/workspace/adamantine-nightly/tests/test_thermal_physics.cc(48): Entering test case "convection_bcs_host"
40: 40% completed
46: /var/jenkins/workspace/adamantine-nightly/tests/test_thermal_physics.cc(48): Leaving test case "convection_bcs_host"; testing time: 80433745us
46: /var/jenkins/workspace/adamantine-nightly/tests/test_thermal_physics.cc(53): Entering test case "reference_temperature_host"
46: /var/jenkins/workspace/adamantine-nightly/tests/test_thermal_physics.cc(48): Leaving test case "convection_bcs_host"; testing time: 80434414us
46: /var/jenkins/workspace/adamantine-nightly/tests/test_thermal_physics.cc(53): Entering test case "reference_temperature_host"
46: 
46: *** No errors detected
46: /var/jenkins/workspace/adamantine-nightly/tests/test_thermal_physics.cc(53): Leaving test case "reference_temperature_host"; testing time: 166557us
46: Leaving test module "ThermalPhysics"; testing time: 94542556us
46: /var/jenkins/workspace/adamantine-nightly/tests/test_thermal_physics.cc(53): Leaving test case "reference_temperature_host"; testing time: 214802us
46: Leaving test module "ThermalPhysics"; testing time: 94550481us
46: 
46: *** No errors detected
46: 
42/48 Test #46: test_thermal_physics_2 ...................   Passed  101.77 sec
test 48
      Start 48: test_ensemble_management_2

48: Test command: /usr/bin/mpiexec "-n" "2" "/var/jenkins/workspace/adamantine-nightly/build/bin/test_ensemble_management"
48: Working Directory: /var/jenkins/workspace/adamantine-nightly/build/tests
48: Test timeout computed to be: 7200
48: Running 1 test case...
48: Entering test module "EnsembleManagement"
48: /var/jenkins/workspace/adamantine-nightly/tests/test_ensemble_management.cc(17): Entering test case "database_ensemble"
48: 
48: *** No errors detected
48: /var/jenkins/workspace/adamantine-nightly/tests/test_ensemble_management.cc(17): Leaving test case "database_ensemble"; testing time: 35236us
48: Leaving test module "EnsembleManagement"; testing time: 35266us
48: Running 1 test case...
48: Entering test module "EnsembleManagement"
48: /var/jenkins/workspace/adamantine-nightly/tests/test_ensemble_management.cc(17): Entering test case "database_ensemble"
48: 
48: *** No errors detected
48: /var/jenkins/workspace/adamantine-nightly/tests/test_ensemble_management.cc(17): Leaving test case "database_ensemble"; testing time: 71291us
48: Leaving test module "EnsembleManagement"; testing time: 71326us
48: 
43/48 Test #48: test_ensemble_management_2 ...............   Passed    7.27 sec
40: 20% completed
40: 50% completed
40: 60% completed
40: 70% completed
40: 30% completed
40: 80% completed
40: 90% completed
40: 40% completed
40: 100% completed
40: /var/jenkins/workspace/adamantine-nightly/tests/test_integration_thermoelastic.cc(47): Leaving test case "integration_thermoelastic_add_material"; testing time: 829712807us
40: Leaving test module "Integration_Thermoelastic"; testing time: 2634679828us
40: 
40: *** No errors detected
40: /var/jenkins/workspace/adamantine-nightly/tests/test_integration_thermoelastic.cc(47): Leaving test case "integration_thermoelastic_add_material"; testing time: 829712704us
40: Leaving test module "Integration_Thermoelastic"; testing time: 2634679682us
40: 
40: *** No errors detected
40: 
44/48 Test #40: test_integration_thermoelastic_2 .........   Passed  2635.44 sec
test 3
      Start  3: test_integration_da_3

3: Test command: /usr/bin/mpiexec "-n" "3" "/var/jenkins/workspace/adamantine-nightly/build/bin/test_integration_da"
3: Working Directory: /var/jenkins/workspace/adamantine-nightly/build/tests
3: Test timeout computed to be: 7200
3: Running 3 test cases...
3: Entering test module "Integration_Data_Assimilation"
3: /var/jenkins/workspace/adamantine-nightly/tests/test_integration_da.cc(78): Entering test case "integration_data_assimilation"
3: Running 3 test cases...
3: Entering test module "Integration_Data_Assimilation"
3: /var/jenkins/workspace/adamantine-nightly/tests/test_integration_da.cc(78): Entering test case "integration_data_assimilation"
3: Running 3 test cases...
3: Entering test module "Integration_Data_Assimilation"
3: /var/jenkins/workspace/adamantine-nightly/tests/test_integration_da.cc(78): Entering test case "integration_data_assimilation"
3: Reading the experimental log file...
3: Done. Log entries found for 1 camera(s), with 2 frame(s).
3: Starting the main time stepping loop...
3: 10% completed
3: 20% completed
3: 30% completed
3: 40% completed
3: Rank: 1 | Old parameters for member 1: 
3: Performing data assimilation at time 0.0211...
3: Rank: 0 | Old parameters for member 0: 
3: Rank: 1 | Number expt sites mapped to DOFs: 1
3: Rank: 0 | Number expt sites mapped to DOFs: 1
3: Rank: 2 | Old parameters for member 2: 
3: Rank: 2 | Number expt sites mapped to DOFs: 1
3: Getting the perturbed innovation...
3: Applying the Kalman gain...
3: Updating the ensemble members...
3: Done.
3: 50% completed
3: 60% completed
3: Performing data assimilation at time 0.0316...
3: Rank: 0 | Old parameters for member 0: 
3: Rank: 1 | Old parameters for member 1: 
3: Rank: 0 | Number expt sites mapped to DOFs: 1
3: Rank: 2 | Old parameters for member 2: 
3: Rank: 1 | Number expt sites mapped to DOFs: 1
3: Rank: 2 | Number expt sites mapped to DOFs: 1
3: Getting the perturbed innovation...
3: Applying the Kalman gain...
3: Updating the ensemble members...
3: Done.
3: 70% completed
3: 80% completed
3: 90% completed
3: 100% completed
3: Reading the experimental log file...
3: Done. Log entries found for 1 camera(s), with 2 frame(s).
3: Reading the experimental log file...
3: Done. Log entries found for 1 camera(s), with 2 frame(s).
3: Reading the experimental log file...
3: Done. Log entries found for 1 camera(s), with 2 frame(s).
3: Starting the main time stepping loop...
3: Starting the main time stepping loop...
3: Starting the main time stepping loop...
3: 10% completed
3: 10% completed
3: 10% completed
3: 20% completed
3: 20% completed
3: 20% completed
3: 30% completed
3: 30% completed
3: 30% completed
3: 40% completed
3: 40% completed
3: 40% completed
3: Performing data assimilation at time 0.0211...
3: Rank: 0 | Old parameters for member 0: 
3: Rank: 0 | Old parameters for member 1: 
3: Rank: 0 | Old parameters for member 2: 
3: Performing data assimilation at time 0.0211...
3: Rank: 0 | Old parameters for member 0: 
3: Rank: 0 | Old parameters for member 1: 
3: Rank: 0 | Old parameters for member 2: 
3: Rank: 0 | Number expt sites mapped to DOFs: 1
3: Rank: 0 | Number expt sites mapped to DOFs: 1
3: Performing data assimilation at time 0.0211...
3: Rank: 0 | Old parameters for member 0: 
3: Rank: 0 | Old parameters for member 1: 
3: Rank: 0 | Old parameters for member 2: 
3: Rank: 0 | Number expt sites mapped to DOFs: 1
3: Getting the perturbed innovation...
3: Applying the Kalman gain...
3: Getting the perturbed innovation...
3: Applying the Kalman gain...
3: Getting the perturbed innovation...
3: Applying the Kalman gain...
3: Updating the ensemble members...
3: Done.
3: Updating the ensemble members...
3: Done.
3: Updating the ensemble members...
3: Done.
3: 50% completed
3: 50% completed
3: 50% completed
3: 60% completed
3: 60% completed
3: 60% completed
3: Performing data assimilation at time 0.0316...
3: Rank: 0 | Old parameters for member 0: 
3: Rank: 0 | Old parameters for member 1: 
3: Rank: 0 | Old parameters for member 2: 
3: Rank: 0 | Number expt sites mapped to DOFs: 1
3: Performing data assimilation at time 0.0316...
3: Rank: 0 | Old parameters for member 0: 
3: Rank: 0 | Old parameters for member 1: 
3: Rank: 0 | Old parameters for member 2: 
3: Performing data assimilation at time 0.0316...
3: Rank: 0 | Old parameters for member 0: 
3: Rank: 0 | Old parameters for member 1: 
3: Rank: 0 | Old parameters for member 2: 
3: Rank: 0 | Number expt sites mapped to DOFs: 1
3: Rank: 0 | Number expt sites mapped to DOFs: 1
3: Getting the perturbed innovation...
3: Applying the Kalman gain...
3: Getting the perturbed innovation...
3: Applying the Kalman gain...
3: Getting the perturbed innovation...
3: Applying the Kalman gain...
3: Updating the ensemble members...
3: Done.
3: Updating the ensemble members...
3: Done.
3: Updating the ensemble members...
3: Done.
3: 70% completed
3: 70% completed
3: 70% completed
3: 80% completed
3: 80% completed
3: 80% completed
3: 90% completed
3: 90% completed
3: 90% completed
3: 100% completed
3: 100% completed
3: 100% completed
3: /var/jenkins/workspace/adamantine-nightly/tests/test_integration_da.cc(78): Leaving test case "integration_data_assimilation"; testing time: 39667086us
3: /var/jenkins/workspace/adamantine-nightly/tests/test_integration_da.cc(148): Entering test case "integration_3D_da_point_cloud_add_material"
3: /var/jenkins/workspace/adamantine-nightly/tests/test_integration_da.cc(78): Leaving test case "integration_data_assimilation"; testing time: 39669918us
3: /var/jenkins/workspace/adamantine-nightly/tests/test_integration_da.cc(148): Entering test case "integration_3D_da_point_cloud_add_material"
3: /var/jenkins/workspace/adamantine-nightly/tests/test_integration_da.cc(78): Leaving test case "integration_data_assimilation"; testing time: 39703266us
3: /var/jenkins/workspace/adamantine-nightly/tests/test_integration_da.cc(148): Entering test case "integration_3D_da_point_cloud_add_material"
3: Reading the experimental log file...
3: Done. Log entries found for 1 camera(s), with 1 frame(s).
3: Starting the main time stepping loop...
3: 10% completed
3: 20% completed
3: 30% completed
3: 40% completed
3: 50% completed
3: Rank: 2 | Old parameters for member 2: 
3: Rank: 1 | Old parameters for member 1: 
3: Rank: 2 | Number expt sites mapped to DOFs: 1
3: Rank: 1 | Number expt sites mapped to DOFs: 1
3: Performing data assimilation at time 0.12...
3: Rank: 0 | Old parameters for member 0: 
3: Rank: 0 | Number expt sites mapped to DOFs: 1
3: Getting the perturbed innovation...
3: Applying the Kalman gain...
3: Updating the ensemble members...
3: Done.
3: 60% completed
3: 70% completed
3: 80% completed
3: 90% completed
3: 100% completed
3: Reading the experimental log file...
3: Done. Log entries found for 1 camera(s), with 1 frame(s).
3: Reading the experimental log file...
3: Done. Log entries found for 1 camera(s), with 1 frame(s).
3: Reading the experimental log file...
3: Done. Log entries found for 1 camera(s), with 1 frame(s).
3: Starting the main time stepping loop...
3: Starting the main time stepping loop...
3: Starting the main time stepping loop...
3: 10% completed
3: 10% completed
3: 10% completed
3: 20% completed
3: 20% completed
3: 20% completed
3: 30% completed
3: 30% completed
3: 30% completed
3: 40% completed
3: 40% completed
3: 40% completed
3: 50% completed
3: 50% completed
3: 50% completed
3: Performing data assimilation at time 0.12...
3: Rank: 0 | Old parameters for member 0: 
3: Rank: 0 | Old parameters for member 1: 
3: Rank: 0 | Old parameters for member 2: 
3: Rank: 0 | Number expt sites mapped to DOFs: 1
3: Performing data assimilation at time 0.12...
3: Rank: 0 | Old parameters for member 0: 
3: Rank: 0 | Old parameters for member 1: 
3: Rank: 0 | Old parameters for member 2: 
3: Performing data assimilation at time 0.12...
3: Rank: 0 | Old parameters for member 0: 
3: Rank: 0 | Old parameters for member 1: 
3: Rank: 0 | Old parameters for member 2: 
3: Rank: 0 | Number expt sites mapped to DOFs: 1
3: Rank: 0 | Number expt sites mapped to DOFs: 1
3: Getting the perturbed innovation...
3: Applying the Kalman gain...
3: Getting the perturbed innovation...
3: Applying the Kalman gain...
3: Getting the perturbed innovation...
3: Applying the Kalman gain...
3: Updating the ensemble members...
3: Done.
3: 60% completed
3: Updating the ensemble members...
3: Done.
3: 60% completed
3: Updating the ensemble members...
3: Done.
3: 60% completed
3: 70% completed
3: 70% completed
3: 70% completed
3: 80% completed
3: 80% completed
3: 80% completed
3: 90% completed
3: 90% completed
3: 90% completed
3: 100% completed
3: 100% completed
3: 100% completed
3: /var/jenkins/workspace/adamantine-nightly/tests/test_integration_da.cc(148): Leaving test case "integration_3D_da_point_cloud_add_material"; testing time: 1727021us
3: /var/jenkins/workspace/adamantine-nightly/tests/test_integration_da.cc(231): Entering test case "integration_3D_da_ray_add_material"
3: /var/jenkins/workspace/adamantine-nightly/tests/test_integration_da.cc(148): Leaving test case "integration_3D_da_point_cloud_add_material"; testing time: 1701110us
3: /var/jenkins/workspace/adamantine-nightly/tests/test_integration_da.cc(231): Entering test case "integration_3D_da_ray_add_material"
3: /var/jenkins/workspace/adamantine-nightly/tests/test_integration_da.cc(148): Leaving test case "integration_3D_da_point_cloud_add_material"; testing time: 1745806us
3: /var/jenkins/workspace/adamantine-nightly/tests/test_integration_da.cc(231): Entering test case "integration_3D_da_ray_add_material"
3: Reading the experimental log file...
3: Done. Log entries found for 1 camera(s), with 1 frame(s).
3: Starting the main time stepping loop...
3: 10% completed
3: 20% completed
3: 30% completed
3: 40% completed
3: 50% completed
3: Rank: 1 | Old parameters for member 1: 
3: Rank: 2 | Old parameters for member 2: 
3: Performing data assimilation at time 0.12...
3: Rank: 0 | Old parameters for member 0: 
3: Rank: 1 | Number expt sites mapped to DOFs: 1
3: Rank: 2 | Number expt sites mapped to DOFs: 1
3: Rank: 0 | Number expt sites mapped to DOFs: 1
3: Getting the perturbed innovation...
3: Applying the Kalman gain...
3: Updating the ensemble members...
3: Done.
3: 60% completed
3: 70% completed
3: 80% completed
3: 90% completed
3: 100% completed
3: Reading the experimental log file...
3: Done. Log entries found for 1 camera(s), with 1 frame(s).
3: Reading the experimental log file...
3: Done. Log entries found for 1 camera(s), with 1 frame(s).
3: Reading the experimental log file...
3: Done. Log entries found for 1 camera(s), with 1 frame(s).
3: Starting the main time stepping loop...
3: Starting the main time stepping loop...
3: Starting the main time stepping loop...
3: 10% completed
3: 10% completed
3: 10% completed
3: 20% completed
3: 20% completed
3: 20% completed
3: 30% completed
3: 30% completed
3: 30% completed
3: 40% completed
3: 40% completed
3: 40% completed
3: 50% completed
3: 50% completed
3: 50% completed
3: Performing data assimilation at time 0.12...
3: Rank: 0 | Old parameters for member 0: 
3: Rank: 0 | Old parameters for member 1: 
3: Rank: 0 | Old parameters for member 2: 
3: Rank: 0 | Number expt sites mapped to DOFs: 1
3: Performing data assimilation at time 0.12...
3: Rank: 0 | Old parameters for member 0: 
3: Rank: 0 | Old parameters for member 1: 
3: Rank: 0 | Old parameters for member 2: 
3: Rank: 0 | Number expt sites mapped to DOFs: 1
3: Performing data assimilation at time 0.12...
3: Rank: 0 | Old parameters for member 0: 
3: Rank: 0 | Old parameters for member 1: 
3: Rank: 0 | Old parameters for member 2: 
3: Rank: 0 | Number expt sites mapped to DOFs: 1
3: Getting the perturbed innovation...
3: Applying the Kalman gain...
3: Getting the perturbed innovation...
3: Applying the Kalman gain...
3: Getting the perturbed innovation...
3: Applying the Kalman gain...
3: Updating the ensemble members...
3: Done.
3: 60% completed
3: Updating the ensemble members...
3: Done.
3: 60% completed
3: Updating the ensemble members...
3: Done.
3: 60% completed
3: 70% completed
3: 70% completed
3: 70% completed
3: 80% completed
3: 80% completed
3: 80% completed
3: 90% completed
3: 90% completed
3: 90% completed
3: 100% completed
3: 100% completed
3: 100% completed
3: 
3: *** No errors detected
3: /var/jenkins/workspace/adamantine-nightly/tests/test_integration_da.cc(231): Leaving test case "integration_3D_da_ray_add_material"; testing time: 1756361us
3: Leaving test module "Integration_Data_Assimilation"; testing time: 43150623us
3: /var/jenkins/workspace/adamantine-nightly/tests/test_integration_da.cc(231): Leaving test case "integration_3D_da_ray_add_material"; testing time: 1735899us
3: Leaving test module "Integration_Data_Assimilation"; testing time: 43151792us
3: 
3: *** No errors detected
3: /var/jenkins/workspace/adamantine-nightly/tests/test_integration_da.cc(231): Leaving test case "integration_3D_da_ray_add_material"; testing time: 1748420us
3: Leaving test module "Integration_Data_Assimilation"; testing time: 43152957us
3: 
3: *** No errors detected
3: 
45/48 Test  #3: test_integration_da_3 ....................   Passed   43.82 sec
test 4
      Start  4: test_integration_da_6

4: Test command: /usr/bin/mpiexec "-n" "6" "/var/jenkins/workspace/adamantine-nightly/build/bin/test_integration_da"
4: Working Directory: /var/jenkins/workspace/adamantine-nightly/build/tests
4: Test timeout computed to be: 7200
4: Running 3 test cases...
4: Running 3 test cases...
4: Running 3 test cases...
4: Entering test module "Integration_Data_Assimilation"
4: /var/jenkins/workspace/adamantine-nightly/tests/test_integration_da.cc(78): Entering test case "integration_data_assimilation"
4: Entering test module "Integration_Data_Assimilation"
4: /var/jenkins/workspace/adamantine-nightly/tests/test_integration_da.cc(78): Entering test case "integration_data_assimilation"
4: Running 3 test cases...
4: Running 3 test cases...
4: Entering test module "Integration_Data_Assimilation"
4: Entering test module "Integration_Data_Assimilation"
4: /var/jenkins/workspace/adamantine-nightly/tests/test_integration_da.cc(78): Entering test case "integration_data_assimilation"
4: /var/jenkins/workspace/adamantine-nightly/tests/test_integration_da.cc(78): Entering test case "integration_data_assimilation"
4: Entering test module "Integration_Data_Assimilation"
4: /var/jenkins/workspace/adamantine-nightly/tests/test_integration_da.cc(78): Entering test case "integration_data_assimilation"
4: Running 3 test cases...
4: Entering test module "Integration_Data_Assimilation"
4: /var/jenkins/workspace/adamantine-nightly/tests/test_integration_da.cc(78): Entering test case "integration_data_assimilation"
4: Reading the experimental log file...
4: Done. Log entries found for 1 camera(s), with 2 frame(s).
4: Starting the main time stepping loop...
4: 10% completed
4: 20% completed
4: 30% completed
4: 40% completed
4: Rank: 1 | Old parameters for member 0: 
4: Performing data assimilation at time 0.0211...
4: Rank: 0 | Old parameters for member 0: 
4: Rank: 4 | Old parameters for member 2: 
4: Rank: 5 | Old parameters for member 2: 
4: Rank: 2 | Old parameters for member 1: 
4: Rank: 3 | Old parameters for member 1: 
4: Rank: 1 | Number expt sites mapped to DOFs: 1
4: Rank: 0 | Number expt sites mapped to DOFs: 1
4: Rank: 4 | Number expt sites mapped to DOFs: 1
4: Rank: 5 | Number expt sites mapped to DOFs: 1
4: Rank: 2 | Number expt sites mapped to DOFs: 1
4: Rank: 3 | Number expt sites mapped to DOFs: 1
4: Getting the perturbed innovation...
4: Applying the Kalman gain...
4: Updating the ensemble members...
4: Done.
4: 50% completed
4: 60% completed
4: Rank: 1 | Old parameters for member 0: 
4: Performing data assimilation at time 0.0316...
4: Rank: 0 | Old parameters for member 0: 
4: Rank: 4 | Old parameters for member 2: 
4: Rank: 5 | Old parameters for member 2: 
4: Rank: 1 | Number expt sites mapped to DOFs: 1
4: Rank: 0 | Number expt sites mapped to DOFs: 1
4: Rank: 2 | Old parameters for member 1: 
4: Rank: 3 | Old parameters for member 1: 
4: Rank: 4 | Number expt sites mapped to DOFs: 1
4: Rank: 5 | Number expt sites mapped to DOFs: 1
4: Rank: 3 | Number expt sites mapped to DOFs: 1
4: Rank: 2 | Number expt sites mapped to DOFs: 1
4: Getting the perturbed innovation...
4: Applying the Kalman gain...
4: Updating the ensemble members...
4: Done.
4: 70% completed
4: 80% completed
4: 90% completed
4: 100% completed
4: Reading the experimental log file...
4: Done. Log entries found for 1 camera(s), with 2 frame(s).
4: Reading the experimental log file...
4: Done. Log entries found for 1 camera(s), with 2 frame(s).
4: Reading the experimental log file...
4: Done. Log entries found for 1 camera(s), with 2 frame(s).
4: Reading the experimental log file...
4: Done. Log entries found for 1 camera(s), with 2 frame(s).
4: Reading the experimental log file...
4: Done. Log entries found for 1 camera(s), with 2 frame(s).
4: Reading the experimental log file...
4: Done. Log entries found for 1 camera(s), with 2 frame(s).
4: Starting the main time stepping loop...
4: Starting the main time stepping loop...
4: Starting the main time stepping loop...
4: Starting the main time stepping loop...
4: Starting the main time stepping loop...
4: Starting the main time stepping loop...
4: 10% completed
4: 10% completed
4: 10% completed
4: 10% completed
4: 10% completed
4: 10% completed
4: 20% completed
4: 20% completed
4: 20% completed
4: 20% completed
4: 20% completed
4: 20% completed
4: 30% completed
4: 30% completed
4: 30% completed
4: 30% completed
4: 30% completed
4: 30% completed
4: 40% completed
4: 40% completed
4: 40% completed
4: 40% completed
4: 40% completed
4: 40% completed
4: Performing data assimilation at time 0.0211...
4: Rank: 0 | Old parameters for member 0: 
4: Rank: 0 | Old parameters for member 1: 
4: Rank: 0 | Old parameters for member 2: 
4: Rank: 0 | Number expt sites mapped to DOFs: 1
4: Performing data assimilation at time 0.0211...
4: Rank: 0 | Old parameters for member 0: 
4: Rank: 0 | Old parameters for member 1: 
4: Rank: 0 | Old parameters for member 2: 
4: Rank: 0 | Number expt sites mapped to DOFs: 1
4: Performing data assimilation at time 0.0211...
4: Rank: 0 | Old parameters for member 0: 
4: Rank: 0 | Old parameters for member 1: 
4: Rank: 0 | Old parameters for member 2: 
4: Rank: 0 | Number expt sites mapped to DOFs: 1
4: Performing data assimilation at time 0.0211...
4: Rank: 0 | Old parameters for member 0: 
4: Rank: 0 | Old parameters for member 1: 
4: Rank: 0 | Old parameters for member 2: 
4: Rank: 0 | Number expt sites mapped to DOFs: 1
4: Performing data assimilation at time 0.0211...
4: Rank: 0 | Old parameters for member 0: 
4: Rank: 0 | Old parameters for member 1: 
4: Rank: 0 | Old parameters for member 2: 
4: Performing data assimilation at time 0.0211...
4: Rank: 0 | Old parameters for member 0: 
4: Rank: 0 | Old parameters for member 1: 
4: Rank: 0 | Old parameters for member 2: 
4: Rank: 0 | Number expt sites mapped to DOFs: 1
4: Rank: 0 | Number expt sites mapped to DOFs: 1
4: Getting the perturbed innovation...
4: Applying the Kalman gain...
4: Getting the perturbed innovation...
4: Applying the Kalman gain...
4: Getting the perturbed innovation...
4: Applying the Kalman gain...
4: Getting the perturbed innovation...
4: Applying the Kalman gain...
4: Getting the perturbed innovation...
4: Applying the Kalman gain...
4: Getting the perturbed innovation...
4: Applying the Kalman gain...
4: Updating the ensemble members...
4: Done.
4: Updating the ensemble members...
4: Done.
4: Updating the ensemble members...
4: Updating the ensemble members...
4: Done.
4: Done.
4: Updating the ensemble members...
4: Done.
4: Updating the ensemble members...
4: Done.
4: 50% completed
4: 50% completed
4: 50% completed
4: 50% completed
4: 50% completed
4: 50% completed
4: 60% completed
4: 60% completed
4: 60% completed
4: 60% completed
4: 60% completed
4: 60% completed
4: Performing data assimilation at time 0.0316...
4: Rank: 0 | Old parameters for member 0: 
4: Rank: 0 | Old parameters for member 1: 
4: Rank: 0 | Old parameters for member 2: 
4: Rank: 0 | Number expt sites mapped to DOFs: 1
4: Performing data assimilation at time 0.0316...
4: Rank: 0 | Old parameters for member 0: 
4: Rank: 0 | Old parameters for member 1: 
4: Rank: 0 | Old parameters for member 2: 
4: Rank: 0 | Number expt sites mapped to DOFs: 1
4: Performing data assimilation at time 0.0316...
4: Rank: 0 | Old parameters for member 0: 
4: Rank: 0 | Old parameters for member 1: 
4: Rank: 0 | Old parameters for member 2: 
4: Rank: 0 | Number expt sites mapped to DOFs: 1
4: Performing data assimilation at time 0.0316...
4: Rank: 0 | Old parameters for member 0: 
4: Rank: 0 | Old parameters for member 1: 
4: Rank: 0 | Old parameters for member 2: 
4: Performing data assimilation at time 0.0316...
4: Rank: 0 | Old parameters for member 0: 
4: Rank: 0 | Old parameters for member 1: 
4: Rank: 0 | Old parameters for member 2: 
4: Rank: 0 | Number expt sites mapped to DOFs: 1
4: Rank: 0 | Number expt sites mapped to DOFs: 1
4: Performing data assimilation at time 0.0316...
4: Rank: 0 | Old parameters for member 0: 
4: Rank: 0 | Old parameters for member 1: 
4: Rank: 0 | Old parameters for member 2: 
4: Rank: 0 | Number expt sites mapped to DOFs: 1
4: Getting the perturbed innovation...
4: Applying the Kalman gain...
4: Getting the perturbed innovation...
4: Applying the Kalman gain...
4: Getting the perturbed innovation...
4: Applying the Kalman gain...
4: Getting the perturbed innovation...
4: Applying the Kalman gain...
4: Getting the perturbed innovation...
4: Applying the Kalman gain...
4: Getting the perturbed innovation...
4: Applying the Kalman gain...
4: Updating the ensemble members...
4: Done.
4: Updating the ensemble members...
4: Done.
4: Updating the ensemble members...
4: Done.
4: Updating the ensemble members...
4: Done.
4: Updating the ensemble members...
4: Done.
4: Updating the ensemble members...
4: Done.
4: 70% completed
4: 70% completed
4: 70% completed
4: 70% completed
4: 70% completed
4: 70% completed
4: 80% completed
4: 80% completed
4: 80% completed
4: 80% completed
4: 80% completed
4: 80% completed
4: 90% completed
4: 90% completed
4: 90% completed
4: 90% completed
4: 90% completed
4: 90% completed
4: 100% completed
4: /var/jenkins/workspace/adamantine-nightly/tests/test_integration_da.cc(78): Leaving test case "integration_data_assimilation"; testing time: 36717924us
4: /var/jenkins/workspace/adamantine-nightly/tests/test_integration_da.cc(148): Entering test case "integration_3D_da_point_cloud_add_material"
4: 100% completed
4: 100% completed
4: 100% completed
4: 100% completed
4: 100% completed
4: /var/jenkins/workspace/adamantine-nightly/tests/test_integration_da.cc(78): Leaving test case "integration_data_assimilation"; testing time: 37095874us
4: /var/jenkins/workspace/adamantine-nightly/tests/test_integration_da.cc(148): Entering test case "integration_3D_da_point_cloud_add_material"
4: /var/jenkins/workspace/adamantine-nightly/tests/test_integration_da.cc(78): Leaving test case "integration_data_assimilation"; testing time: 37144267us
4: /var/jenkins/workspace/adamantine-nightly/tests/test_integration_da.cc(148): Entering test case "integration_3D_da_point_cloud_add_material"
4: /var/jenkins/workspace/adamantine-nightly/tests/test_integration_da.cc(78): Leaving test case "integration_data_assimilation"; testing time: 37181543us
4: /var/jenkins/workspace/adamantine-nightly/tests/test_integration_da.cc(148): Entering test case "integration_3D_da_point_cloud_add_material"
4: /var/jenkins/workspace/adamantine-nightly/tests/test_integration_da.cc(78): Leaving test case "integration_data_assimilation"; testing time: 37298841us
4: /var/jenkins/workspace/adamantine-nightly/tests/test_integration_da.cc(148): Entering test case "integration_3D_da_point_cloud_add_material"
4: /var/jenkins/workspace/adamantine-nightly/tests/test_integration_da.cc(78): Leaving test case "integration_data_assimilation"; testing time: 37308375us
4: /var/jenkins/workspace/adamantine-nightly/tests/test_integration_da.cc(148): Entering test case "integration_3D_da_point_cloud_add_material"
4: Reading the experimental log file...
4: Done. Log entries found for 1 camera(s), with 1 frame(s).
4: Starting the main time stepping loop...
4: 10% completed
4: 20% completed
4: 30% completed
4: 40% completed
4: 50% completed
4: Rank: 2 | Old parameters for member 1: 
4: Rank: 3 | Old parameters for member 1: 
4: Performing data assimilation at time 0.12...
4: Rank: 0 | Old parameters for member 0: 
4: Rank: 1 | Old parameters for member 0: 
4: Rank: 4 | Old parameters for member 2: 
4: Rank: 5 | Old parameters for member 2: 
4: Rank: 3 | Number expt sites mapped to DOFs: 1
4: Rank: 2 | Number expt sites mapped to DOFs: 1
4: Rank: 0 | Number expt sites mapped to DOFs: 1
4: Rank: 1 | Number expt sites mapped to DOFs: 1
4: Rank: 4 | Number expt sites mapped to DOFs: 1
4: Rank: 5 | Number expt sites mapped to DOFs: 1
4: Getting the perturbed innovation...
4: Applying the Kalman gain...
4: Updating the ensemble members...
4: Done.
4: 60% completed
4: 70% completed
4: 80% completed
4: 90% completed
4: 100% completed
4: Reading the experimental log file...
4: Done. Log entries found for 1 camera(s), with 1 frame(s).
4: Reading the experimental log file...
4: Done. Log entries found for 1 camera(s), with 1 frame(s).
4: Reading the experimental log file...
4: Done. Log entries found for 1 camera(s), with 1 frame(s).
4: Reading the experimental log file...
4: Done. Log entries found for 1 camera(s), with 1 frame(s).
4: Reading the experimental log file...
4: Done. Log entries found for 1 camera(s), with 1 frame(s).
4: Reading the experimental log file...
4: Done. Log entries found for 1 camera(s), with 1 frame(s).
4: Starting the main time stepping loop...
4: Starting the main time stepping loop...
4: Starting the main time stepping loop...
4: Starting the main time stepping loop...
4: Starting the main time stepping loop...
4: Starting the main time stepping loop...
4: 10% completed
4: 10% completed
4: 10% completed
4: 10% completed
4: 10% completed
4: 10% completed
4: 20% completed
4: 20% completed
4: 20% completed
4: 20% completed
4: 20% completed
4: 20% completed
4: 30% completed
4: 30% completed
4: 30% completed
4: 30% completed
4: 30% completed
4: 30% completed
4: 40% completed
4: 40% completed
4: 40% completed
4: 40% completed
4: 40% completed
4: 40% completed
4: 50% completed
4: 50% completed
4: 50% completed
4: 50% completed
4: 50% completed
4: 50% completed
4: Performing data assimilation at time 0.12...
4: Performing data assimilation at time 0.12...
4: Rank: 0 | Old parameters for member 0: 
4: Rank: 0 | Old parameters for member 1: 
4: Rank: 0 | Old parameters for member 2: 
4: Rank: 0 | Old parameters for member 0: 
4: Rank: 0 | Old parameters for member 1: 
4: Rank: 0 | Old parameters for member 2: 
4: Rank: 0 | Number expt sites mapped to DOFs: 1
4: Rank: 0 | Number expt sites mapped to DOFs: 1
4: Performing data assimilation at time 0.12...
4: Performing data assimilation at time 0.12...
4: Rank: 0 | Old parameters for member 0: 
4: Rank: 0 | Old parameters for member 1: 
4: Rank: 0 | Old parameters for member 2: 
4: Performing data assimilation at time 0.12...
4: Rank: 0 | Old parameters for member 0: 
4: Rank: 0 | Old parameters for member 1: 
4: Rank: 0 | Old parameters for member 2: 
4: Performing data assimilation at time 0.12...
4: Rank: 0 | Old parameters for member 0: 
4: Rank: 0 | Old parameters for member 0: 
4: Rank: 0 | Old parameters for member 1: 
4: Rank: 0 | Old parameters for member 2: 
4: Rank: 0 | Old parameters for member 1: 
4: Rank: 0 | Old parameters for member 2: 
4: Rank: 0 | Number expt sites mapped to DOFs: 1
4: Rank: 0 | Number expt sites mapped to DOFs: 1
4: Rank: 0 | Number expt sites mapped to DOFs: 1
4: Rank: 0 | Number expt sites mapped to DOFs: 1
4: Getting the perturbed innovation...
4: Applying the Kalman gain...
4: Getting the perturbed innovation...
4: Applying the Kalman gain...
4: Getting the perturbed innovation...
4: Applying the Kalman gain...
4: Getting the perturbed innovation...
4: Applying the Kalman gain...
4: Getting the perturbed innovation...
4: Applying the Kalman gain...
4: Getting the perturbed innovation...
4: Applying the Kalman gain...
4: Updating the ensemble members...
4: Updating the ensemble members...
4: Done.
4: 60% completed
4: Done.
4: 60% completed
4: Updating the ensemble members...
4: Done.
4: 60% completed
4: Updating the ensemble members...
4: Updating the ensemble members...
4: Done.
4: 60% completed
4: Updating the ensemble members...
4: Done.
4: 60% completed
4: Done.
4: 60% completed
4: 70% completed
4: 70% completed
4: 70% completed
4: 70% completed
4: 70% completed
4: 70% completed
4: 80% completed
4: 80% completed
4: 80% completed
4: 80% completed
4: 80% completed
4: 80% completed
4: 90% completed
4: 90% completed
4: 90% completed
4: 90% completed
4: 90% completed
4: 90% completed
4: 100% completed
4: 100% completed
4: 100% completed
4: 100% completed
4: 100% completed
4: 100% completed
4: /var/jenkins/workspace/adamantine-nightly/tests/test_integration_da.cc(148): Leaving test case "integration_3D_da_point_cloud_add_material"; testing time: 1721147us
4: /var/jenkins/workspace/adamantine-nightly/tests/test_integration_da.cc(231): Entering test case "integration_3D_da_ray_add_material"
4: /var/jenkins/workspace/adamantine-nightly/tests/test_integration_da.cc(148): Leaving test case "integration_3D_da_point_cloud_add_material"; testing time: 1733185us
4: /var/jenkins/workspace/adamantine-nightly/tests/test_integration_da.cc(231): Entering test case "integration_3D_da_ray_add_material"
4: /var/jenkins/workspace/adamantine-nightly/tests/test_integration_da.cc(148): Leaving test case "integration_3D_da_point_cloud_add_material"; testing time: 1939227us
4: /var/jenkins/workspace/adamantine-nightly/tests/test_integration_da.cc(231): Entering test case "integration_3D_da_ray_add_material"
4: /var/jenkins/workspace/adamantine-nightly/tests/test_integration_da.cc(148): Leaving test case "integration_3D_da_point_cloud_add_material"; testing time: 2333292us
4: /var/jenkins/workspace/adamantine-nightly/tests/test_integration_da.cc(231): Entering test case "integration_3D_da_ray_add_material"
4: /var/jenkins/workspace/adamantine-nightly/tests/test_integration_da.cc(148): Leaving test case "integration_3D_da_point_cloud_add_material"; testing time: 1916713us
4: /var/jenkins/workspace/adamantine-nightly/tests/test_integration_da.cc(231): Entering test case "integration_3D_da_ray_add_material"
4: /var/jenkins/workspace/adamantine-nightly/tests/test_integration_da.cc(148): Leaving test case "integration_3D_da_point_cloud_add_material"; testing time: 1879654us
4: /var/jenkins/workspace/adamantine-nightly/tests/test_integration_da.cc(231): Entering test case "integration_3D_da_ray_add_material"
4: Reading the experimental log file...
4: Done. Log entries found for 1 camera(s), with 1 frame(s).
4: Starting the main time stepping loop...
4: 10% completed
4: 20% completed
4: 30% completed
4: 40% completed
4: 50% completed
4: Rank: 1 | Old parameters for member 0: 
4: Performing data assimilation at time 0.12...
4: Rank: 0 | Old parameters for member 0: 
4: Rank: 1 | Number expt sites mapped to DOFs: 1
4: Rank: 0 | Number expt sites mapped to DOFs: 1
4: Rank: 2 | Old parameters for member 1: 
4: Rank: 3 | Old parameters for member 1: 
4: Rank: 4 | Old parameters for member 2: 
4: Rank: 5 | Old parameters for member 2: 
4: Rank: 3 | Number expt sites mapped to DOFs: 1
4: Rank: 2 | Number expt sites mapped to DOFs: 1
4: Rank: 5 | Number expt sites mapped to DOFs: 1
4: Rank: 4 | Number expt sites mapped to DOFs: 1
4: Getting the perturbed innovation...
4: Applying the Kalman gain...
4: Updating the ensemble members...
4: Done.
4: 60% completed
4: 70% completed
4: 80% completed
4: 90% completed
4: 100% completed
4: Reading the experimental log file...
4: Done. Log entries found for 1 camera(s), with 1 frame(s).
4: Reading the experimental log file...
4: Done. Log entries found for 1 camera(s), with 1 frame(s).
4: Reading the experimental log file...
4: Done. Log entries found for 1 camera(s), with 1 frame(s).
4: Reading the experimental log file...
4: Done. Log entries found for 1 camera(s), with 1 frame(s).
4: Reading the experimental log file...
4: Done. Log entries found for 1 camera(s), with 1 frame(s).
4: Reading the experimental log file...
4: Done. Log entries found for 1 camera(s), with 1 frame(s).
4: Starting the main time stepping loop...
4: Starting the main time stepping loop...
4: Starting the main time stepping loop...
4: Starting the main time stepping loop...
4: Starting the main time stepping loop...
4: Starting the main time stepping loop...
4: 10% completed
4: 10% completed
4: 10% completed
4: 10% completed
4: 10% completed
4: 10% completed
4: 20% completed
4: 20% completed
4: 20% completed
4: 20% completed
4: 20% completed
4: 20% completed
4: 30% completed
4: 30% completed
4: 30% completed
4: 30% completed
4: 40% completed
4: 30% completed
4: 30% completed
4: 40% completed
4: 40% completed
4: 40% completed
4: 50% completed
4: 40% completed
4: 40% completed
4: 50% completed
4: Performing data assimilation at time 0.12...
4: Rank: 0 | Old parameters for member 0: 
4: Rank: 0 | Old parameters for member 1: 
4: Rank: 0 | Old parameters for member 2: 
4: Rank: 0 | Number expt sites mapped to DOFs: 1
4: 50% completed
4: 50% completed
4: 50% completed
4: 50% completed
4: Performing data assimilation at time 0.12...
4: Rank: 0 | Old parameters for member 0: 
4: Rank: 0 | Old parameters for member 1: 
4: Rank: 0 | Old parameters for member 2: 
4: Rank: 0 | Number expt sites mapped to DOFs: 1
4: Performing data assimilation at time 0.12...
4: Rank: 0 | Old parameters for member 0: 
4: Rank: 0 | Old parameters for member 1: 
4: Rank: 0 | Old parameters for member 2: 
4: Performing data assimilation at time 0.12...
4: Rank: 0 | Old parameters for member 0: 
4: Rank: 0 | Old parameters for member 1: 
4: Rank: 0 | Old parameters for member 2: 
4: Rank: 0 | Number expt sites mapped to DOFs: 1
4: Performing data assimilation at time 0.12...
4: Rank: 0 | Old parameters for member 0: 
4: Rank: 0 | Old parameters for member 1: 
4: Rank: 0 | Old parameters for member 2: 
4: Performing data assimilation at time 0.12...
4: Rank: 0 | Old parameters for member 0: 
4: Rank: 0 | Old parameters for member 1: 
4: Rank: 0 | Old parameters for member 2: 
4: Rank: 0 | Number expt sites mapped to DOFs: 1
4: Rank: 0 | Number expt sites mapped to DOFs: 1
4: Rank: 0 | Number expt sites mapped to DOFs: 1
4: Getting the perturbed innovation...
4: Applying the Kalman gain...
4: Getting the perturbed innovation...
4: Applying the Kalman gain...
4: Getting the perturbed innovation...
4: Applying the Kalman gain...
4: Getting the perturbed innovation...
4: Applying the Kalman gain...
4: Getting the perturbed innovation...
4: Applying the Kalman gain...
4: Getting the perturbed innovation...
4: Applying the Kalman gain...
4: Updating the ensemble members...
4: Done.
4: 60% completed
4: Updating the ensemble members...
4: Done.
4: 60% completed
4: Updating the ensemble members...
4: Done.
4: 60% completed
4: Updating the ensemble members...
4: Done.
4: 60% completed
4: 70% completed
4: Updating the ensemble members...
4: Updating the ensemble members...
4: Done.
4: 60% completed
4: 70% completed
4: Done.
4: 60% completed
4: 80% completed
4: 70% completed
4: 70% completed
4: 80% completed
4: 70% completed
4: 70% completed
4: 90% completed
4: 90% completed
4: 80% completed
4: 80% completed
4: 80% completed
4: 80% completed
4: 90% completed
4: 90% completed
4: 90% completed
4: 90% completed
4: 100% completed
4: 100% completed
4: 100% completed
4: /var/jenkins/workspace/adamantine-nightly/tests/test_integration_da.cc(231): Leaving test case "integration_3D_da_ray_add_material"; testing time: 1723151us
4: Leaving test module "Integration_Data_Assimilation"; testing time: 40774604us
4: 
4: *** No errors detected
4: 100% completed
4: 100% completed
4: /var/jenkins/workspace/adamantine-nightly/tests/test_integration_da.cc(231): Leaving test case "integration_3D_da_ray_add_material"; testing time: 1722080us
4: Leaving test module "Integration_Data_Assimilation"; testing time: 40783401us
4: 
4: *** No errors detected
4: 100% completed
4: /var/jenkins/workspace/adamantine-nightly/tests/test_integration_da.cc(231): Leaving test case "integration_3D_da_ray_add_material"; testing time: 1777746us
4: Leaving test module "Integration_Data_Assimilation"; testing time: 40810065us
4: 
4: *** No errors detected
4: /var/jenkins/workspace/adamantine-nightly/tests/test_integration_da.cc(231): Leaving test case "integration_3D_da_ray_add_material"; testing time: 1758044us
4: Leaving test module "Integration_Data_Assimilation"; testing time: 40819538us
4: 
4: *** No errors detected
4: /var/jenkins/workspace/adamantine-nightly/tests/test_integration_da.cc(231): Leaving test case "integration_3D_da_ray_add_material"; testing time: 1791381us
4: Leaving test module "Integration_Data_Assimilation"; testing time: 40821184us
4: 
4: *** No errors detected
4: /var/jenkins/workspace/adamantine-nightly/tests/test_integration_da.cc(231): Leaving test case "integration_3D_da_ray_add_material"; testing time: 1788294us
4: Leaving test module "Integration_Data_Assimilation"; testing time: 40823576us
4: 
4: *** No errors detected
4: 
46/48 Test  #4: test_integration_da_6 ....................   Passed   41.57 sec
test 7
      Start  7: test_closest_source_point_adaptation_3

7: Test command: /usr/bin/mpiexec "-n" "3" "/var/jenkins/workspace/adamantine-nightly/build/bin/test_closest_source_point_adaptation"
7: Working Directory: /var/jenkins/workspace/adamantine-nightly/build/tests
7: Test timeout computed to be: 7200
7: Running 1 test case...
7: Running 1 test case...
7: Running 1 test case...
7: Entering test module "ClosestSourcePointAdaptation"
7: Entering test module "ClosestSourcePointAdaptation"
7: /var/jenkins/workspace/adamantine-nightly/tests/test_closest_source_point_adaptation.cc(123): Entering test case "closest_source_point_adaptation"
7: /var/jenkins/workspace/adamantine-nightly/tests/test_closest_source_point_adaptation.cc(123): Entering test case "closest_source_point_adaptation"
7: Entering test module "ClosestSourcePointAdaptation"
7: /var/jenkins/workspace/adamantine-nightly/tests/test_closest_source_point_adaptation.cc(123): Entering test case "closest_source_point_adaptation"
7: 
7: *** No errors detected
7: /var/jenkins/workspace/adamantine-nightly/tests/test_closest_source_point_adaptation.cc(123): Leaving test case "closest_source_point_adaptation"; testing time: 5594602us
7: Leaving test module "ClosestSourcePointAdaptation"; testing time: 5594669us
7: /var/jenkins/workspace/adamantine-nightly/tests/test_closest_source_point_adaptation.cc(123): Leaving test case "closest_source_point_adaptation"; testing time: 5595187us
7: Leaving test module "ClosestSourcePointAdaptation"; testing time: 5595247us
7: 
7: *** No errors detected
7: /var/jenkins/workspace/adamantine-nightly/tests/test_closest_source_point_adaptation.cc(123): Leaving test case "closest_source_point_adaptation"; testing time: 5595379us
7: Leaving test module "ClosestSourcePointAdaptation"; testing time: 5595453us
7: 
7: *** No errors detected
7: 
47/48 Test  #7: test_closest_source_point_adaptation_3 ...   Passed    6.24 sec
test 8
      Start  8: test_closest_source_point_adaptation_6

8: Test command: /usr/bin/mpiexec "-n" "6" "/var/jenkins/workspace/adamantine-nightly/build/bin/test_closest_source_point_adaptation"
8: Working Directory: /var/jenkins/workspace/adamantine-nightly/build/tests
8: Test timeout computed to be: 7200
8: Running 1 test case...
8: Running 1 test case...
8: Entering test module "ClosestSourcePointAdaptation"
8: Running 1 test case...
8: /var/jenkins/workspace/adamantine-nightly/tests/test_closest_source_point_adaptation.cc(123): Entering test case "closest_source_point_adaptation"
8: Entering test module "ClosestSourcePointAdaptation"
8: /var/jenkins/workspace/adamantine-nightly/tests/test_closest_source_point_adaptation.cc(123): Entering test case "closest_source_point_adaptation"
8: Entering test module "ClosestSourcePointAdaptation"
8: Running 1 test case...
8: Running 1 test case...
8: /var/jenkins/workspace/adamantine-nightly/tests/test_closest_source_point_adaptation.cc(123): Entering test case "closest_source_point_adaptation"
8: Running 1 test case...
8: Entering test module "ClosestSourcePointAdaptation"
8: /var/jenkins/workspace/adamantine-nightly/tests/test_closest_source_point_adaptation.cc(123): Entering test case "closest_source_point_adaptation"
8: Entering test module "ClosestSourcePointAdaptation"
8: /var/jenkins/workspace/adamantine-nightly/tests/test_closest_source_point_adaptation.cc(123): Entering test case "closest_source_point_adaptation"
8: Entering test module "ClosestSourcePointAdaptation"
8: /var/jenkins/workspace/adamantine-nightly/tests/test_closest_source_point_adaptation.cc(123): Entering test case "closest_source_point_adaptation"
8: /var/jenkins/workspace/adamantine-nightly/tests/test_closest_source_point_adaptation.cc(123): Leaving test case "closest_source_point_adaptation"; testing time: 3574803us
8: Leaving test module "ClosestSourcePointAdaptation"; testing time: 3574868us
8: /var/jenkins/workspace/adamantine-nightly/tests/test_closest_source_point_adaptation.cc(123): Leaving test case "closest_source_point_adaptation"; testing time: 3574891us
8: Leaving test module "ClosestSourcePointAdaptation"; testing time: 3574947us
8: /var/jenkins/workspace/adamantine-nightly/tests/test_closest_source_point_adaptation.cc(123): Leaving test case "closest_source_point_adaptation"; testing time: 3574921us
8: Leaving test module "ClosestSourcePointAdaptation"; testing time: 3574969us
8: 
8: *** No errors detected
8: 
8: *** No errors detected
8: 
8: *** No errors detected
8: /var/jenkins/workspace/adamantine-nightly/tests/test_closest_source_point_adaptation.cc(123): Leaving test case "closest_source_point_adaptation"; testing time: 3575128us
8: 
8: Leaving test module "ClosestSourcePointAdaptation"; testing time: 3575221us
8: /var/jenkins/workspace/adamantine-nightly/tests/test_closest_source_point_adaptation.cc(123): Leaving test case "closest_source_point_adaptation"; testing time: 3575171us
8: *** No errors detected
8: 
8: Leaving test module "ClosestSourcePointAdaptation"; testing time: 3575239us
8: *** No errors detected
8: /var/jenkins/workspace/adamantine-nightly/tests/test_closest_source_point_adaptation.cc(123): Leaving test case "closest_source_point_adaptation"; testing time: 3575303us
8: Leaving test module "ClosestSourcePointAdaptation"; testing time: 3575386us
8: 
8: *** No errors detected
8: 
48/48 Test  #8: test_closest_source_point_adaptation_6 ...   Passed    4.27 sec

The following tests passed:
	test_closest_source_point_adaptation_1
	test_data_assimilator_1
	test_experimental_data_1
	test_geometry_1
	test_heat_source_1
	test_integration_da_2
	test_closest_source_point_adaptation_2
	test_material_property_1
	test_material_property_device_1
	test_integration_da_1
	test_post_processor_1
	test_quaternion_1
	test_scan_path_1
	test_thermal_operator_1
	test_thermal_operator_device_1
	test_mechanical_operator_1
	test_timer_1
	test_utils_1
	test_validate_input_database_1
	test_integration_2d_1
	test_integration_2d_device_1
	test_thermal_physics_device_1
	test_mechanical_physics_1
	test_integration_3d_amr_1
	test_integration_3d_amr_device_1
	test_integration_da_augmented_1
	test_material_deposition_1
	test_microstructure_1
	test_thermal_physics_1
	test_ensemble_management_1
	test_integration_3d_device_1
	test_integration_2d_2
	test_integration_2d_device_2
	test_integration_3d_amr_2
	test_integration_3d_amr_device_2
	test_integration_da_augmented_2
	test_material_deposition_2
	test_microstructure_2
	test_thermal_physics_2
	test_ensemble_management_2
	test_integration_thermoelastic_2
	test_integration_da_3
	test_integration_da_6
	test_closest_source_point_adaptation_3
	test_closest_source_point_adaptation_6

94% tests passed, 3 tests failed out of 48

Total Test time (real) = 10918.25 sec

The following tests FAILED:
	 31 - test_integration_3d_1 (Timeout)
	 32 - test_integration_3d_2 (Timeout)
	 39 - test_integration_thermoelastic_1 (Timeout)
Errors while running CTest
Output from these tests are in: /var/jenkins/workspace/adamantine-nightly/build/Testing/Temporary/LastTest.log
Use "--rerun-failed --output-on-failure" to re-run the failed cases verbosely.
[Pipeline] }
[Pipeline] // dir
Post stage
[Pipeline] xunit
INFO: Processing CTest-Version 3.x (default)
[Pipeline] }
[Pipeline] // withEnv
[Pipeline] }
$ docker stop --time=1 42e5e7330ff096fcc76c4477b92667187fb6105c5535863f31199b3427d1fe88
INFO: [CTest-Version 3.x (default)] - 1 test report file(s) were found with the pattern 'build/Testing/**/Test.xml' relative to '/var/jenkins/workspace/adamantine-nightly' for the testing framework 'CTest-Version 3.x (default)'.
$ docker rm -f --volumes 42e5e7330ff096fcc76c4477b92667187fb6105c5535863f31199b3427d1fe88
[Pipeline] // withDockerContainer
[Pipeline] }
[Pipeline] // withEnv
[Pipeline] }
[Pipeline] // node
[Pipeline] }
[Pipeline] // stage
[Pipeline] }
Failed in branch CPU
40: 50% completed
40: 60% completed
40: 70% completed
40: 80% completed
40: 90% completed
40: 100% completed
40: /var/jenkins/workspace/adamantine-nightly/tests/test_integration_thermoelastic.cc(19): Leaving test case "integration_thermoelastic"; testing time: 2748920722us
40: /var/jenkins/workspace/adamantine-nightly/tests/test_integration_thermoelastic.cc(47): Entering test case "integration_thermoelastic_add_material"
40: /var/jenkins/workspace/adamantine-nightly/tests/test_integration_thermoelastic.cc(19): Leaving test case "integration_thermoelastic"; testing time: 2748971073us
40: /var/jenkins/workspace/adamantine-nightly/tests/test_integration_thermoelastic.cc(47): Entering test case "integration_thermoelastic_add_material"
40: 10% completed
40: 20% completed
40: 30% completed
40: 40% completed
40: 50% completed
40: 60% completed
40: 70% completed
40: 80% completed
40: 90% completed
40: 100% completed
40: 
40: *** No errors detected
40: /var/jenkins/workspace/adamantine-nightly/tests/test_integration_thermoelastic.cc(47): Leaving test case "integration_thermoelastic_add_material"; testing time: 1384360732us
40: Leaving test module "Integration_Thermoelastic"; testing time: 4133284318us
40: /var/jenkins/workspace/adamantine-nightly/tests/test_integration_thermoelastic.cc(47): Leaving test case "integration_thermoelastic_add_material"; testing time: 1384360631us
40: Leaving test module "Integration_Thermoelastic"; testing time: 4133334925us
40: 
40: *** No errors detected
40: 
44/48 Test #40: test_integration_thermoelastic_2 .........   Passed  4140.59 sec
test 3
      Start  3: test_integration_da_3

3: Test command: /usr/bin/mpiexec "-n" "3" "/var/jenkins/workspace/adamantine-nightly/build/bin/test_integration_da"
3: Working Directory: /var/jenkins/workspace/adamantine-nightly/build/tests
3: Test timeout computed to be: 7200
3: Running 3 test cases...
3: Entering test module "Integration_Data_Assimilation"
3: /var/jenkins/workspace/adamantine-nightly/tests/test_integration_da.cc(78): Entering test case "integration_data_assimilation"
3: Running 3 test cases...
3: Entering test module "Integration_Data_Assimilation"
3: /var/jenkins/workspace/adamantine-nightly/tests/test_integration_da.cc(78): Entering test case "integration_data_assimilation"
3: Running 3 test cases...
3: Entering test module "Integration_Data_Assimilation"
3: /var/jenkins/workspace/adamantine-nightly/tests/test_integration_da.cc(78): Entering test case "integration_data_assimilation"
3: Reading the experimental log file...
3: Done. Log entries found for 1 camera(s), with 2 frame(s).
3: Starting the main time stepping loop...
3: 10% completed
3: 20% completed
3: 30% completed
3: 40% completed
3: Rank: 1 | Old parameters for member 1: 
3: Performing data assimilation at time 0.0211...
3: Rank: 0 | Old parameters for member 0: 
3: Rank: 2 | Old parameters for member 2: 
3: Rank: 0 | Number expt sites mapped to DOFs: 1
3: Rank: 1 | Number expt sites mapped to DOFs: 1
3: Rank: 2 | Number expt sites mapped to DOFs: 1
3: Getting the perturbed innovation...
3: Applying the Kalman gain...
3: Updating the ensemble members...
3: Done.
3: 50% completed
3: 60% completed
3: Rank: 1 | Old parameters for member 1: 
3: Performing data assimilation at time 0.0316...
3: Rank: 0 | Old parameters for member 0: 
3: Rank: 2 | Old parameters for member 2: 
3: Rank: 1 | Number expt sites mapped to DOFs: 1
3: Rank: 0 | Number expt sites mapped to DOFs: 1
3: Rank: 2 | Number expt sites mapped to DOFs: 1
3: Getting the perturbed innovation...
3: Applying the Kalman gain...
3: Updating the ensemble members...
3: Done.
3: 70% completed
3: 80% completed
3: 90% completed
3: 100% completed
3: Reading the experimental log file...
3: Done. Log entries found for 1 camera(s), with 2 frame(s).
3: Reading the experimental log file...
3: Done. Log entries found for 1 camera(s), with 2 frame(s).
3: Reading the experimental log file...
3: Done. Log entries found for 1 camera(s), with 2 frame(s).
3: Starting the main time stepping loop...
3: Starting the main time stepping loop...
3: Starting the main time stepping loop...
3: 10% completed
3: 10% completed
3: 10% completed
3: 20% completed
3: 20% completed
3: 20% completed
3: 30% completed
3: 30% completed
3: 30% completed
3: 40% completed
3: 40% completed
3: 40% completed
3: Performing data assimilation at time 0.0211...
3: Rank: 0 | Old parameters for member 0: 
3: Rank: 0 | Old parameters for member 1: 
3: Rank: 0 | Old parameters for member 2: 
3: Performing data assimilation at time 0.0211...
3: Rank: 0 | Old parameters for member 0: 
3: Rank: 0 | Old parameters for member 1: 
3: Rank: 0 | Old parameters for member 2: 
3: Rank: 0 | Number expt sites mapped to DOFs: 1
3: Rank: 0 | Number expt sites mapped to DOFs: 1
3: Performing data assimilation at time 0.0211...
3: Rank: 0 | Old parameters for member 0: 
3: Rank: 0 | Old parameters for member 1: 
3: Rank: 0 | Old parameters for member 2: 
3: Rank: 0 | Number expt sites mapped to DOFs: 1
3: Getting the perturbed innovation...
3: Applying the Kalman gain...
3: Getting the perturbed innovation...
3: Applying the Kalman gain...
3: Getting the perturbed innovation...
3: Applying the Kalman gain...
3: Updating the ensemble members...
3: Done.
3: Updating the ensemble members...
3: Done.
3: Updating the ensemble members...
3: Done.
3: 50% completed
3: 50% completed
3: 50% completed
3: 60% completed
3: 60% completed
3: 60% completed
3: Performing data assimilation at time 0.0316...
3: Rank: 0 | Old parameters for member 0: 
3: Rank: 0 | Old parameters for member 1: 
3: Rank: 0 | Old parameters for member 2: 
3: Rank: 0 | Number expt sites mapped to DOFs: 1
3: Performing data assimilation at time 0.0316...
3: Rank: 0 | Old parameters for member 0: 
3: Rank: 0 | Old parameters for member 1: 
3: Rank: 0 | Old parameters for member 2: 
3: Performing data assimilation at time 0.0316...
3: Rank: 0 | Old parameters for member 0: 
3: Rank: 0 | Old parameters for member 1: 
3: Rank: 0 | Old parameters for member 2: 
3: Rank: 0 | Number expt sites mapped to DOFs: 1
3: Rank: 0 | Number expt sites mapped to DOFs: 1
3: Getting the perturbed innovation...
3: Applying the Kalman gain...
3: Getting the perturbed innovation...
3: Applying the Kalman gain...
3: Getting the perturbed innovation...
3: Applying the Kalman gain...
3: Updating the ensemble members...
3: Done.
3: Updating the ensemble members...
3: Done.
3: Updating the ensemble members...
3: Done.
3: 70% completed
3: 70% completed
3: 70% completed
3: 80% completed
3: 80% completed
3: 80% completed
3: 90% completed
3: 90% completed
3: 90% completed
3: 100% completed
3: 100% completed
3: 100% completed
3: /var/jenkins/workspace/adamantine-nightly/tests/test_integration_da.cc(78): Leaving test case "integration_data_assimilation"; testing time: 62993001us
3: /var/jenkins/workspace/adamantine-nightly/tests/test_integration_da.cc(148): Entering test case "integration_3D_da_point_cloud_add_material"
3: /var/jenkins/workspace/adamantine-nightly/tests/test_integration_da.cc(78): Leaving test case "integration_data_assimilation"; testing time: 63167663us
3: /var/jenkins/workspace/adamantine-nightly/tests/test_integration_da.cc(148): Entering test case "integration_3D_da_point_cloud_add_material"
3: /var/jenkins/workspace/adamantine-nightly/tests/test_integration_da.cc(78): Leaving test case "integration_data_assimilation"; testing time: 63182458us
3: /var/jenkins/workspace/adamantine-nightly/tests/test_integration_da.cc(148): Entering test case "integration_3D_da_point_cloud_add_material"
3: Reading the experimental log file...
3: Done. Log entries found for 1 camera(s), with 1 frame(s).
3: Starting the main time stepping loop...
3: 10% completed
3: 20% completed
3: 30% completed
3: 40% completed
3: 50% completed
3: Rank: 1 | Old parameters for member 1: 
3: Rank: 2 | Old parameters for member 2: 
3: Performing data assimilation at time 0.12...
3: Rank: 0 | Old parameters for member 0: 
3: Rank: 2 | Number expt sites mapped to DOFs: 1
3: Rank: 1 | Number expt sites mapped to DOFs: 1
3: Rank: 0 | Number expt sites mapped to DOFs: 1
3: Getting the perturbed innovation...
3: Applying the Kalman gain...
3: Updating the ensemble members...
3: Done.
3: 60% completed
3: 70% completed
3: 80% completed
3: 90% completed
3: 100% completed
3: Reading the experimental log file...
3: Done. Log entries found for 1 camera(s), with 1 frame(s).
3: Reading the experimental log file...
3: Done. Log entries found for 1 camera(s), with 1 frame(s).
3: Reading the experimental log file...
3: Done. Log entries found for 1 camera(s), with 1 frame(s).
3: Starting the main time stepping loop...
3: Starting the main time stepping loop...
3: Starting the main time stepping loop...
3: 10% completed
3: 10% completed
3: 10% completed
3: 20% completed
3: 20% completed
3: 20% completed
3: 30% completed
3: 30% completed
3: 30% completed
3: 40% completed
3: 40% completed
3: 40% completed
3: 50% completed
3: 50% completed
3: 50% completed
3: Performing data assimilation at time 0.12...
3: Rank: 0 | Old parameters for member 0: 
3: Rank: 0 | Old parameters for member 1: 
3: Rank: 0 | Old parameters for member 2: 
3: Rank: 0 | Number expt sites mapped to DOFs: 1
3: Performing data assimilation at time 0.12...
3: Rank: 0 | Old parameters for member 0: 
3: Rank: 0 | Old parameters for member 1: 
3: Rank: 0 | Old parameters for member 2: 
3: Performing data assimilation at time 0.12...
3: Rank: 0 | Old parameters for member 0: 
3: Rank: 0 | Old parameters for member 1: 
3: Rank: 0 | Old parameters for member 2: 
3: Rank: 0 | Number expt sites mapped to DOFs: 1
3: Rank: 0 | Number expt sites mapped to DOFs: 1
3: Getting the perturbed innovation...
3: Applying the Kalman gain...
3: Getting the perturbed innovation...
3: Applying the Kalman gain...
3: Getting the perturbed innovation...
3: Applying the Kalman gain...
3: Updating the ensemble members...
3: Done.
3: 60% completed
3: Updating the ensemble members...
3: Updating the ensemble members...
3: Done.
3: 60% completed
3: Done.
3: 60% completed
3: 70% completed
3: 70% completed
3: 70% completed
3: 80% completed
3: 80% completed
3: 80% completed
3: 90% completed
3: 90% completed
3: 90% completed
3: 100% completed
3: 100% completed
3: 100% completed
3: /var/jenkins/workspace/adamantine-nightly/tests/test_integration_da.cc(148): Leaving test case "integration_3D_da_point_cloud_add_material"; testing time: 2430602us
3: /var/jenkins/workspace/adamantine-nightly/tests/test_integration_da.cc(231): Entering test case "integration_3D_da_ray_add_material"
3: /var/jenkins/workspace/adamantine-nightly/tests/test_integration_da.cc(148): Leaving test case "integration_3D_da_point_cloud_add_material"; testing time: 2470796us
3: /var/jenkins/workspace/adamantine-nightly/tests/test_integration_da.cc(231): Entering test case "integration_3D_da_ray_add_material"
3: /var/jenkins/workspace/adamantine-nightly/tests/test_integration_da.cc(148): Leaving test case "integration_3D_da_point_cloud_add_material"; testing time: 2636413us
3: /var/jenkins/workspace/adamantine-nightly/tests/test_integration_da.cc(231): Entering test case "integration_3D_da_ray_add_material"
3: Reading the experimental log file...
3: Done. Log entries found for 1 camera(s), with 1 frame(s).
3: Starting the main time stepping loop...
3: 10% completed
3: 20% completed
3: 30% completed
3: 40% completed
3: 50% completed
3: Rank: 1 | Old parameters for member 1: 
3: Rank: 1 | Number expt sites mapped to DOFs: 1
3: Performing data assimilation at time 0.12...
3: Rank: 0 | Old parameters for member 0: 
3: Rank: 2 | Old parameters for member 2: 
3: Rank: 0 | Number expt sites mapped to DOFs: 1
3: Rank: 2 | Number expt sites mapped to DOFs: 1
3: Getting the perturbed innovation...
3: Applying the Kalman gain...
3: Updating the ensemble members...
3: Done.
3: 60% completed
3: 70% completed
3: 80% completed
3: 90% completed
3: 100% completed
3: Reading the experimental log file...
3: Done. Log entries found for 1 camera(s), with 1 frame(s).
3: Reading the experimental log file...
3: Done. Log entries found for 1 camera(s), with 1 frame(s).
3: Reading the experimental log file...
3: Done. Log entries found for 1 camera(s), with 1 frame(s).
3: Starting the main time stepping loop...
3: Starting the main time stepping loop...
3: Starting the main time stepping loop...
3: 10% completed
3: 10% completed
3: 10% completed
3: 20% completed
3: 20% completed
3: 20% completed
3: 30% completed
3: 30% completed
3: 30% completed
3: 40% completed
3: 40% completed
3: 40% completed
3: 50% completed
3: 50% completed
3: 50% completed
3: Performing data assimilation at time 0.12...
3: Rank: 0 | Old parameters for member 0: 
3: Rank: 0 | Old parameters for member 1: 
3: Rank: 0 | Old parameters for member 2: 
3: Rank: 0 | Number expt sites mapped to DOFs: 1
3: Performing data assimilation at time 0.12...
3: Rank: 0 | Old parameters for member 0: 
3: Rank: 0 | Old parameters for member 1: 
3: Rank: 0 | Old parameters for member 2: 
3: Performing data assimilation at time 0.12...
3: Rank: 0 | Old parameters for member 0: 
3: Rank: 0 | Old parameters for member 1: 
3: Rank: 0 | Old parameters for member 2: 
3: Rank: 0 | Number expt sites mapped to DOFs: 1
3: Rank: 0 | Number expt sites mapped to DOFs: 1
3: Getting the perturbed innovation...
3: Applying the Kalman gain...
3: Getting the perturbed innovation...
3: Applying the Kalman gain...
3: Getting the perturbed innovation...
3: Applying the Kalman gain...
3: Updating the ensemble members...
3: Done.
3: 60% completed
3: Updating the ensemble members...
3: Updating the ensemble members...
3: Done.
3: 60% completed
3: Done.
3: 60% completed
3: 70% completed
3: 70% completed
3: 70% completed
3: 80% completed
3: 80% completed
3: 80% completed
3: 90% completed
3: 90% completed
3: 90% completed
3: 100% completed
3: 100% completed
3: 100% completed
3: 
3: *** No errors detected
3: /var/jenkins/workspace/adamantine-nightly/tests/test_integration_da.cc(231): Leaving test case "integration_3D_da_ray_add_material"; testing time: 2435904us
3: Leaving test module "Integration_Data_Assimilation"; testing time: 68049086us
3: /var/jenkins/workspace/adamantine-nightly/tests/test_integration_da.cc(231): Leaving test case "integration_3D_da_ray_add_material"; testing time: 2454846us
3: Leaving test module "Integration_Data_Assimilation"; testing time: 68093437us
3: 
3: *** No errors detected
3: /var/jenkins/workspace/adamantine-nightly/tests/test_integration_da.cc(231): Leaving test case "integration_3D_da_ray_add_material"; testing time: 2462230us
3: Leaving test module "Integration_Data_Assimilation"; testing time: 68091774us
3: 
3: *** No errors detected
3: 
45/48 Test  #3: test_integration_da_3 ....................   Passed   69.46 sec
test 4
      Start  4: test_integration_da_6

4: Test command: /usr/bin/mpiexec "-n" "6" "/var/jenkins/workspace/adamantine-nightly/build/bin/test_integration_da"
4: Working Directory: /var/jenkins/workspace/adamantine-nightly/build/tests
4: Test timeout computed to be: 7200
4: Running 3 test cases...
4: Entering test module "Integration_Data_Assimilation"
4: /var/jenkins/workspace/adamantine-nightly/tests/test_integration_da.cc(78): Entering test case "integration_data_assimilation"
4: Running 3 test cases...
4: Entering test module "Integration_Data_Assimilation"
4: /var/jenkins/workspace/adamantine-nightly/tests/test_integration_da.cc(78): Entering test case "integration_data_assimilation"
4: Running 3 test cases...
4: Entering test module "Integration_Data_Assimilation"
4: /var/jenkins/workspace/adamantine-nightly/tests/test_integration_da.cc(78): Entering test case "integration_data_assimilation"
4: Running 3 test cases...
4: Entering test module "Integration_Data_Assimilation"
4: /var/jenkins/workspace/adamantine-nightly/tests/test_integration_da.cc(78): Entering test case "integration_data_assimilation"
4: Running 3 test cases...
4: Entering test module "Integration_Data_Assimilation"
4: /var/jenkins/workspace/adamantine-nightly/tests/test_integration_da.cc(78): Entering test case "integration_data_assimilation"
4: Running 3 test cases...
4: Entering test module "Integration_Data_Assimilation"
4: /var/jenkins/workspace/adamantine-nightly/tests/test_integration_da.cc(78): Entering test case "integration_data_assimilation"
4: Reading the experimental log file...
4: Done. Log entries found for 1 camera(s), with 2 frame(s).
4: Starting the main time stepping loop...
4: 10% completed
4: 20% completed
4: 30% completed
4: 40% completed
4: Rank: 4 | Old parameters for member 2: 
4: Rank: 5 | Old parameters for member 2: 
4: Rank: 3 | Old parameters for member 1: 
4: Rank: 1 | Old parameters for member 0: 
4: Performing data assimilation at time 0.0211...
4: Rank: 0 | Old parameters for member 0: 
4: Rank: 2 | Old parameters for member 1: 
4: Rank: 5 | Number expt sites mapped to DOFs: 1
4: Rank: 4 | Number expt sites mapped to DOFs: 1
4: Rank: 2 | Number expt sites mapped to DOFs: 1
4: Rank: 3 | Number expt sites mapped to DOFs: 1
4: Rank: 0 | Number expt sites mapped to DOFs: 1
4: Rank: 1 | Number expt sites mapped to DOFs: 1
4: Getting the perturbed innovation...
4: Applying the Kalman gain...
4: Updating the ensemble members...
4: Done.
4: 50% completed
4: 60% completed
4: Rank: 2 | Old parameters for member 1: 
4: Rank: 3 | Old parameters for member 1: 
4: Rank: 4 | Old parameters for member 2: 
4: Rank: 5 | Old parameters for member 2: 
4: Performing data assimilation at time 0.0316...
4: Rank: 0 | Old parameters for member 0: 
4: Rank: 1 | Old parameters for member 0: 
4: Rank: 3 | Number expt sites mapped to DOFs: 1
4: Rank: 2 | Number expt sites mapped to DOFs: 1
4: Rank: 5 | Number expt sites mapped to DOFs: 1
4: Rank: 4 | Number expt sites mapped to DOFs: 1
4: Rank: 0 | Number expt sites mapped to DOFs: 1
4: Rank: 1 | Number expt sites mapped to DOFs: 1
4: Getting the perturbed innovation...
4: Applying the Kalman gain...
4: Updating the ensemble members...
4: Done.
4: 70% completed
4: 80% completed
4: 90% completed
4: 100% completed
4: Reading the experimental log file...
4: Done. Log entries found for 1 camera(s), with 2 frame(s).
4: Reading the experimental log file...
4: Done. Log entries found for 1 camera(s), with 2 frame(s).
4: Reading the experimental log file...
4: Done. Log entries found for 1 camera(s), with 2 frame(s).
4: Reading the experimental log file...
4: Done. Log entries found for 1 camera(s), with 2 frame(s).
4: Reading the experimental log file...
4: Done. Log entries found for 1 camera(s), with 2 frame(s).
4: Reading the experimental log file...
4: Done. Log entries found for 1 camera(s), with 2 frame(s).
4: Starting the main time stepping loop...
4: Starting the main time stepping loop...
4: Starting the main time stepping loop...
4: Starting the main time stepping loop...
4: Starting the main time stepping loop...
4: Starting the main time stepping loop...
4: 10% completed
4: 10% completed
4: 10% completed
4: 10% completed
4: 10% completed
4: 10% completed
4: 20% completed
4: 20% completed
4: 20% completed
4: 20% completed
4: 20% completed
4: 20% completed
4: 30% completed
4: 30% completed
4: 30% completed
4: 30% completed
4: 30% completed
4: 30% completed
4: 40% completed
4: 40% completed
4: 40% completed
4: 40% completed
4: 40% completed
4: 40% completed
4: Performing data assimilation at time 0.0211...
4: Rank: 0 | Old parameters for member 0: 
4: Rank: 0 | Old parameters for member 1: 
4: Rank: 0 | Old parameters for member 2: 
4: Rank: 0 | Number expt sites mapped to DOFs: 1
4: Performing data assimilation at time 0.0211...
4: Rank: 0 | Old parameters for member 0: 
4: Rank: 0 | Old parameters for member 1: 
4: Rank: 0 | Old parameters for member 2: 
4: Rank: 0 | Number expt sites mapped to DOFs: 1
4: Performing data assimilation at time 0.0211...
4: Rank: 0 | Old parameters for member 0: 
4: Rank: 0 | Old parameters for member 1: 
4: Rank: 0 | Old parameters for member 2: 
4: Rank: 0 | Number expt sites mapped to DOFs: 1
4: Performing data assimilation at time 0.0211...
4: Rank: 0 | Old parameters for member 0: 
4: Rank: 0 | Old parameters for member 1: 
4: Rank: 0 | Old parameters for member 2: 
4: Performing data assimilation at time 0.0211...
4: Rank: 0 | Old parameters for member 0: 
4: Rank: 0 | Old parameters for member 1: 
4: Rank: 0 | Old parameters for member 2: 
4: Performing data assimilation at time 0.0211...
4: Rank: 0 | Old parameters for member 0: 
4: Rank: 0 | Old parameters for member 1: 
4: Rank: 0 | Old parameters for member 2: 
4: Rank: 0 | Number expt sites mapped to DOFs: 1
4: Rank: 0 | Number expt sites mapped to DOFs: 1
4: Rank: 0 | Number expt sites mapped to DOFs: 1
4: Getting the perturbed innovation...
4: Applying the Kalman gain...
4: Getting the perturbed innovation...
4: Applying the Kalman gain...
4: Getting the perturbed innovation...
4: Applying the Kalman gain...
4: Getting the perturbed innovation...
4: Applying the Kalman gain...
4: Getting the perturbed innovation...
4: Applying the Kalman gain...
4: Getting the perturbed innovation...
4: Applying the Kalman gain...
4: Updating the ensemble members...
4: Done.
4: Updating the ensemble members...
4: Updating the ensemble members...
4: Done.
4: Done.
4: Updating the ensemble members...
4: Done.
4: Updating the ensemble members...
4: Done.
4: Updating the ensemble members...
4: Done.
4: 50% completed
4: 50% completed
4: 50% completed
4: 50% completed
4: 50% completed
4: 50% completed
4: 60% completed
4: 60% completed
4: 60% completed
4: 60% completed
4: 60% completed
4: 60% completed
4: Performing data assimilation at time 0.0316...
4: Rank: 0 | Old parameters for member 0: 
4: Rank: 0 | Old parameters for member 1: 
4: Rank: 0 | Old parameters for member 2: 
4: Performing data assimilation at time 0.0316...
4: Rank: 0 | Old parameters for member 0: 
4: Rank: 0 | Old parameters for member 1: 
4: Rank: 0 | Old parameters for member 2: 
4: Rank: 0 | Number expt sites mapped to DOFs: 1
4: Rank: 0 | Number expt sites mapped to DOFs: 1
4: Performing data assimilation at time 0.0316...
4: Rank: 0 | Old parameters for member 0: 
4: Rank: 0 | Old parameters for member 1: 
4: Rank: 0 | Old parameters for member 2: 
4: Rank: 0 | Number expt sites mapped to DOFs: 1
4: Performing data assimilation at time 0.0316...
4: Rank: 0 | Old parameters for member 0: 
4: Rank: 0 | Old parameters for member 1: 
4: Rank: 0 | Old parameters for member 2: 
4: Performing data assimilation at time 0.0316...
4: Rank: 0 | Old parameters for member 0: 
4: Rank: 0 | Old parameters for member 1: 
4: Rank: 0 | Old parameters for member 2: 
4: Rank: 0 | Number expt sites mapped to DOFs: 1
4: Rank: 0 | Number expt sites mapped to DOFs: 1
4: Performing data assimilation at time 0.0316...
4: Rank: 0 | Old parameters for member 0: 
4: Rank: 0 | Old parameters for member 1: 
4: Rank: 0 | Old parameters for member 2: 
4: Rank: 0 | Number expt sites mapped to DOFs: 1
4: Getting the perturbed innovation...
4: Applying the Kalman gain...
4: Getting the perturbed innovation...
4: Applying the Kalman gain...
4: Getting the perturbed innovation...
4: Getting the perturbed innovation...
4: Applying the Kalman gain...
4: Applying the Kalman gain...
4: Getting the perturbed innovation...
4: Applying the Kalman gain...
4: Getting the perturbed innovation...
4: Applying the Kalman gain...
4: Updating the ensemble members...
4: Done.
4: Updating the ensemble members...
4: Done.
4: Updating the ensemble members...
4: Done.
4: Updating the ensemble members...
4: Done.
4: Updating the ensemble members...
4: Done.
4: Updating the ensemble members...
4: Done.
4: 70% completed
4: 70% completed
4: 70% completed
4: 70% completed
4: 70% completed
4: 70% completed
4: 80% completed
4: 80% completed
4: 80% completed
4: 80% completed
4: 80% completed
4: 80% completed
4: 90% completed
4: 90% completed
4: 90% completed
4: 90% completed
4: 90% completed
4: 90% completed
4: 100% completed
4: 100% completed
4: 100% completed
4: 100% completed
4: /var/jenkins/workspace/adamantine-nightly/tests/test_integration_da.cc(78): Leaving test case "integration_data_assimilation"; testing time: 58307099us
4: /var/jenkins/workspace/adamantine-nightly/tests/test_integration_da.cc(148): Entering test case "integration_3D_da_point_cloud_add_material"
4: /var/jenkins/workspace/adamantine-nightly/tests/test_integration_da.cc(78): Leaving test case "integration_data_assimilation"; testing time: 58339699us
4: /var/jenkins/workspace/adamantine-nightly/tests/test_integration_da.cc(148): Entering test case "integration_3D_da_point_cloud_add_material"
4: /var/jenkins/workspace/adamantine-nightly/tests/test_integration_da.cc(78): Leaving test case "integration_data_assimilation"; testing time: 58376132us
4: /var/jenkins/workspace/adamantine-nightly/tests/test_integration_da.cc(148): Entering test case "integration_3D_da_point_cloud_add_material"
4: /var/jenkins/workspace/adamantine-nightly/tests/test_integration_da.cc(78): Leaving test case "integration_data_assimilation"; testing time: 58420508us
4: /var/jenkins/workspace/adamantine-nightly/tests/test_integration_da.cc(148): Entering test case "integration_3D_da_point_cloud_add_material"
4: 100% completed
4: 100% completed
4: /var/jenkins/workspace/adamantine-nightly/tests/test_integration_da.cc(78): Leaving test case "integration_data_assimilation"; testing time: 58688266us
4: /var/jenkins/workspace/adamantine-nightly/tests/test_integration_da.cc(148): Entering test case "integration_3D_da_point_cloud_add_material"
4: /var/jenkins/workspace/adamantine-nightly/tests/test_integration_da.cc(78): Leaving test case "integration_data_assimilation"; testing time: 58766542us
4: /var/jenkins/workspace/adamantine-nightly/tests/test_integration_da.cc(148): Entering test case "integration_3D_da_point_cloud_add_material"
4: Reading the experimental log file...
4: Done. Log entries found for 1 camera(s), with 1 frame(s).
4: Starting the main time stepping loop...
4: 10% completed
4: 20% completed
4: 30% completed
4: 40% completed
4: 50% completed
4: Rank: 2 | Old parameters for member 1: 
4: Rank: 3 | Old parameters for member 1: 
4: Performing data assimilation at time 0.12...
4: Rank: 0 | Old parameters for member 0: 
4: Rank: 1 | Old parameters for member 0: 
4: Rank: 4 | Old parameters for member 2: 
4: Rank: 5 | Old parameters for member 2: 
4: Rank: 3 | Number expt sites mapped to DOFs: 1
4: Rank: 2 | Number expt sites mapped to DOFs: 1
4: Rank: 0 | Number expt sites mapped to DOFs: 1
4: Rank: 1 | Number expt sites mapped to DOFs: 1
4: Rank: 4 | Number expt sites mapped to DOFs: 1
4: Rank: 5 | Number expt sites mapped to DOFs: 1
4: Getting the perturbed innovation...
4: Applying the Kalman gain...
4: Updating the ensemble members...
4: Done.
4: 60% completed
4: 70% completed
4: 80% completed
4: 90% completed
4: 100% completed
4: Reading the experimental log file...
4: Done. Log entries found for 1 camera(s), with 1 frame(s).
4: Reading the experimental log file...
4: Done. Log entries found for 1 camera(s), with 1 frame(s).
4: Reading the experimental log file...
4: Done. Log entries found for 1 camera(s), with 1 frame(s).
4: Reading the experimental log file...
4: Reading the experimental log file...
4: Done. Log entries found for 1 camera(s), with 1 frame(s).
4: Done. Log entries found for 1 camera(s), with 1 frame(s).
4: Reading the experimental log file...
4: Done. Log entries found for 1 camera(s), with 1 frame(s).
4: Starting the main time stepping loop...
4: Starting the main time stepping loop...
4: Starting the main time stepping loop...
4: Starting the main time stepping loop...
4: Starting the main time stepping loop...
4: Starting the main time stepping loop...
4: 10% completed
4: 10% completed
4: 10% completed
4: 10% completed
4: 10% completed
4: 10% completed
4: 20% completed
4: 20% completed
4: 20% completed
4: 20% completed
4: 20% completed
4: 20% completed
4: 30% completed
4: 30% completed
4: 30% completed
4: 30% completed
4: 30% completed
4: 30% completed
4: 40% completed
4: 40% completed
4: 40% completed
4: 40% completed
4: 40% completed
4: 40% completed
4: 50% completed
4: 50% completed
4: 50% completed
4: 50% completed
4: 50% completed
4: 50% completed
4: Performing data assimilation at time 0.12...
4: Rank: 0 | Old parameters for member 0: 
4: Rank: 0 | Old parameters for member 1: 
4: Rank: 0 | Old parameters for member 2: 
4: Rank: 0 | Number expt sites mapped to DOFs: 1
4: Performing data assimilation at time 0.12...
4: Rank: 0 | Old parameters for member 0: 
4: Rank: 0 | Old parameters for member 1: 
4: Rank: 0 | Old parameters for member 2: 
4: Performing data assimilation at time 0.12...
4: Rank: 0 | Old parameters for member 0: 
4: Rank: 0 | Old parameters for member 1: 
4: Rank: 0 | Old parameters for member 2: 
4: Rank: 0 | Number expt sites mapped to DOFs: 1
4: Rank: 0 | Number expt sites mapped to DOFs: 1
4: Performing data assimilation at time 0.12...
4: Rank: 0 | Old parameters for member 0: 
4: Rank: 0 | Old parameters for member 1: 
4: Rank: 0 | Old parameters for member 2: 
4: Performing data assimilation at time 0.12...
4: Rank: 0 | Old parameters for member 0: 
4: Rank: 0 | Old parameters for member 1: 
4: Rank: 0 | Old parameters for member 2: 
4: Performing data assimilation at time 0.12...
4: Rank: 0 | Old parameters for member 0: 
4: Rank: 0 | Old parameters for member 1: 
4: Rank: 0 | Old parameters for member 2: 
4: Rank: 0 | Number expt sites mapped to DOFs: 1
4: Rank: 0 | Number expt sites mapped to DOFs: 1
4: Rank: 0 | Number expt sites mapped to DOFs: 1
4: Getting the perturbed innovation...
4: Applying the Kalman gain...
4: Getting the perturbed innovation...
4: Applying the Kalman gain...
4: Getting the perturbed innovation...
4: Applying the Kalman gain...
4: Getting the perturbed innovation...
4: Applying the Kalman gain...
4: Getting the perturbed innovation...
4: Applying the Kalman gain...
4: Getting the perturbed innovation...
4: Applying the Kalman gain...
4: Updating the ensemble members...
4: Done.
4: 60% completed
4: Updating the ensemble members...
4: Updating the ensemble members...
4: Done.
4: Done.
4: 60% completed
4: 60% completed
4: Updating the ensemble members...
4: Updating the ensemble members...
4: Done.
4: Done.
4: 60% completed
4: 60% completed
4: Updating the ensemble members...
4: Done.
4: 60% completed
4: 70% completed
4: 70% completed
4: 70% completed
4: 70% completed
4: 70% completed
4: 70% completed
4: 80% completed
4: 80% completed
4: 80% completed
4: 90% completed
4: 80% completed
4: 80% completed
4: 80% completed
4: 90% completed
4: 90% completed
4: 90% completed
4: 90% completed
4: 90% completed
4: 100% completed
4: 100% completed
4: 100% completed
4: /var/jenkins/workspace/adamantine-nightly/tests/test_integration_da.cc(148): Leaving test case "integration_3D_da_point_cloud_add_material"; testing time: 2724103us
4: /var/jenkins/workspace/adamantine-nightly/tests/test_integration_da.cc(231): Entering test case "integration_3D_da_ray_add_material"
4: 100% completed
4: 100% completed
4: /var/jenkins/workspace/adamantine-nightly/tests/test_integration_da.cc(148): Leaving test case "integration_3D_da_point_cloud_add_material"; testing time: 2729386us
4: /var/jenkins/workspace/adamantine-nightly/tests/test_integration_da.cc(231): Entering test case "integration_3D_da_ray_add_material"
4: 100% completed
4: /var/jenkins/workspace/adamantine-nightly/tests/test_integration_da.cc(148): Leaving test case "integration_3D_da_point_cloud_add_material"; testing time: 2466084us
4: /var/jenkins/workspace/adamantine-nightly/tests/test_integration_da.cc(231): Entering test case "integration_3D_da_ray_add_material"
4: /var/jenkins/workspace/adamantine-nightly/tests/test_integration_da.cc(148): Leaving test case "integration_3D_da_point_cloud_add_material"; testing time: 2849362us
4: /var/jenkins/workspace/adamantine-nightly/tests/test_integration_da.cc(231): Entering test case "integration_3D_da_ray_add_material"
4: /var/jenkins/workspace/adamantine-nightly/tests/test_integration_da.cc(148): Leaving test case "integration_3D_da_point_cloud_add_material"; testing time: 2408772us
4: /var/jenkins/workspace/adamantine-nightly/tests/test_integration_da.cc(231): Entering test case "integration_3D_da_ray_add_material"
4: /var/jenkins/workspace/adamantine-nightly/tests/test_integration_da.cc(148): Leaving test case "integration_3D_da_point_cloud_add_material"; testing time: 2848398us
4: /var/jenkins/workspace/adamantine-nightly/tests/test_integration_da.cc(231): Entering test case "integration_3D_da_ray_add_material"
4: Reading the experimental log file...
4: Done. Log entries found for 1 camera(s), with 1 frame(s).
4: Starting the main time stepping loop...
4: 10% completed
4: 20% completed
4: 30% completed
4: 40% completed
4: 50% completed
4: Rank: 3 | Old parameters for member 1: 
4: Rank: 2 | Old parameters for member 1: 
4: Rank: 1 | Old parameters for member 0: 
4: Performing data assimilation at time 0.12...
4: Rank: 0 | Old parameters for member 0: 
4: Rank: 2 | Number expt sites mapped to DOFs: 1
4: Rank: 3 | Number expt sites mapped to DOFs: 1
4: Rank: 5 | Old parameters for member 2: 
4: Rank: 4 | Old parameters for member 2: 
4: Rank: 1 | Number expt sites mapped to DOFs: 1
4: Rank: 0 | Number expt sites mapped to DOFs: 1
4: Rank: 5 | Number expt sites mapped to DOFs: 1
4: Rank: 4 | Number expt sites mapped to DOFs: 1
4: Getting the perturbed innovation...
4: Applying the Kalman gain...
4: Updating the ensemble members...
4: Done.
4: 60% completed
4: 70% completed
4: 80% completed
4: 90% completed
4: 100% completed
4: Reading the experimental log file...
4: Done. Log entries found for 1 camera(s), with 1 frame(s).
4: Reading the experimental log file...
4: Done. Log entries found for 1 camera(s), with 1 frame(s).
4: Reading the experimental log file...
4: Done. Log entries found for 1 camera(s), with 1 frame(s).
4: Reading the experimental log file...
4: Done. Log entries found for 1 camera(s), with 1 frame(s).
4: Reading the experimental log file...
4: Done. Log entries found for 1 camera(s), with 1 frame(s).
4: Reading the experimental log file...
4: Done. Log entries found for 1 camera(s), with 1 frame(s).
4: Starting the main time stepping loop...
4: Starting the main time stepping loop...
4: Starting the main time stepping loop...
4: Starting the main time stepping loop...
4: Starting the main time stepping loop...
4: Starting the main time stepping loop...
4: 10% completed
4: 10% completed
4: 10% completed
4: 10% completed
4: 10% completed
4: 10% completed
4: 20% completed
4: 20% completed
4: 20% completed
4: 20% completed
4: 20% completed
4: 20% completed
4: 30% completed
4: 30% completed
4: 30% completed
4: 30% completed
4: 30% completed
4: 30% completed
4: 40% completed
4: 40% completed
4: 40% completed
4: 40% completed
4: 40% completed
4: 40% completed
4: 50% completed
4: 50% completed
4: 50% completed
4: 50% completed
4: 50% completed
4: 50% completed
4: Performing data assimilation at time 0.12...
4: Rank: 0 | Old parameters for member 0: 
4: Rank: 0 | Old parameters for member 1: 
4: Rank: 0 | Old parameters for member 2: 
4: Performing data assimilation at time 0.12...
4: Rank: 0 | Old parameters for member 0: 
4: Rank: 0 | Old parameters for member 1: 
4: Rank: 0 | Old parameters for member 2: 
4: Rank: 0 | Number expt sites mapped to DOFs: 1
4: Rank: 0 | Number expt sites mapped to DOFs: 1
4: Performing data assimilation at time 0.12...
4: Rank: 0 | Old parameters for member 0: 
4: Rank: 0 | Old parameters for member 1: 
4: Rank: 0 | Old parameters for member 2: 
4: Performing data assimilation at time 0.12...
4: Rank: 0 | Old parameters for member 0: 
4: Rank: 0 | Old parameters for member 1: 
4: Rank: 0 | Old parameters for member 2: 
4: Performing data assimilation at time 0.12...
4: Rank: 0 | Old parameters for member 0: 
4: Rank: 0 | Old parameters for member 1: 
4: Rank: 0 | Old parameters for member 2: 
4: Performing data assimilation at time 0.12...
4: Rank: 0 | Old parameters for member 0: 
4: Rank: 0 | Old parameters for member 1: 
4: Rank: 0 | Old parameters for member 2: 
4: Rank: 0 | Number expt sites mapped to DOFs: 1
4: Rank: 0 | Number expt sites mapped to DOFs: 1
4: Rank: 0 | Number expt sites mapped to DOFs: 1
4: Rank: 0 | Number expt sites mapped to DOFs: 1
4: Getting the perturbed innovation...
4: Applying the Kalman gain...
4: Getting the perturbed innovation...
4: Applying the Kalman gain...
4: Getting the perturbed innovation...
4: Applying the Kalman gain...
4: Getting the perturbed innovation...
4: Applying the Kalman gain...
4: Getting the perturbed innovation...
4: Applying the Kalman gain...
4: Getting the perturbed innovation...
4: Applying the Kalman gain...
4: Updating the ensemble members...
4: Done.
4: 60% completed
4: Updating the ensemble members...
4: Done.
4: 60% completed
4: Updating the ensemble members...
4: Updating the ensemble members...
4: Done.
4: 60% completed
4: Done.
4: 60% completed
4: Updating the ensemble members...
4: Done.
4: 60% completed
4: Updating the ensemble members...
4: Done.
4: 60% completed
4: 70% completed
4: 70% completed
4: 70% completed
4: 70% completed
4: 70% completed
4: 70% completed
4: 80% completed
4: 80% completed
4: 80% completed
4: 80% completed
4: 80% completed
4: 80% completed
4: 90% completed
4: 90% completed
4: 90% completed
4: 90% completed
4: 90% completed
4: 90% completed
4: 100% completed
4: 100% completed
4: 100% completed
4: 100% completed
4: 100% completed
4: 100% completed
4: /var/jenkins/workspace/adamantine-nightly/tests/test_integration_da.cc(231): Leaving test case "integration_3D_da_ray_add_material"; testing time: 2333325us
4: Leaving test module "Integration_Data_Assimilation"; testing time: 63508797us
4: 
4: *** No errors detected
4: /var/jenkins/workspace/adamantine-nightly/tests/test_integration_da.cc(231): Leaving test case "integration_3D_da_ray_add_material"; testing time: 2408111us
4: Leaving test module "Integration_Data_Assimilation"; testing time: 63508503us
4: 
4: *** No errors detected
4: /var/jenkins/workspace/adamantine-nightly/tests/test_integration_da.cc(231): Leaving test case "integration_3D_da_ray_add_material"; testing time: 2350631us
4: Leaving test module "Integration_Data_Assimilation"; testing time: 63538852us
4: 
4: *** No errors detected
4: 
4: *** No errors detected
4: /var/jenkins/workspace/adamantine-nightly/tests/test_integration_da.cc(231): Leaving test case "integration_3D_da_ray_add_material"; testing time: 2387772us
4: Leaving test module "Integration_Data_Assimilation"; testing time: 63542258us
4: 
4: *** No errors detected
4: /var/jenkins/workspace/adamantine-nightly/tests/test_integration_da.cc(231): Leaving test case "integration_3D_da_ray_add_material"; testing time: 2398637us
4: Leaving test module "Integration_Data_Assimilation"; testing time: 63548694us
4: /var/jenkins/workspace/adamantine-nightly/tests/test_integration_da.cc(231): Leaving test case "integration_3D_da_ray_add_material"; testing time: 2363038us
4: Leaving test module "Integration_Data_Assimilation"; testing time: 63519628us
4: 
4: *** No errors detected
4: 
46/48 Test  #4: test_integration_da_6 ....................   Passed   65.57 sec
test 7
      Start  7: test_closest_source_point_adaptation_3

7: Test command: /usr/bin/mpiexec "-n" "3" "/var/jenkins/workspace/adamantine-nightly/build/bin/test_closest_source_point_adaptation"
7: Working Directory: /var/jenkins/workspace/adamantine-nightly/build/tests
7: Test timeout computed to be: 7200
7: Running 1 test case...
7: Entering test module "ClosestSourcePointAdaptation"
7: /var/jenkins/workspace/adamantine-nightly/tests/test_closest_source_point_adaptation.cc(123): Entering test case "closest_source_point_adaptation"
7: Running 1 test case...
7: Entering test module "ClosestSourcePointAdaptation"
7: /var/jenkins/workspace/adamantine-nightly/tests/test_closest_source_point_adaptation.cc(123): Entering test case "closest_source_point_adaptation"
7: Running 1 test case...
7: Entering test module "ClosestSourcePointAdaptation"
7: /var/jenkins/workspace/adamantine-nightly/tests/test_closest_source_point_adaptation.cc(123): Entering test case "closest_source_point_adaptation"
7: /var/jenkins/workspace/adamantine-nightly/tests/test_closest_source_point_adaptation.cc(123): Leaving test case "closest_source_point_adaptation"; testing time: 7006767us
7: Leaving test module "ClosestSourcePointAdaptation"; testing time: 7006847us
7: 
7: *** No errors detected
7: /var/jenkins/workspace/adamantine-nightly/tests/test_closest_source_point_adaptation.cc(123): Leaving test case "closest_source_point_adaptation"; testing time: 7006410us
7: Leaving test module "ClosestSourcePointAdaptation"; testing time: 7006479us
7: 
7: *** No errors detected
7: 
7: *** No errors detected
7: /var/jenkins/workspace/adamantine-nightly/tests/test_closest_source_point_adaptation.cc(123): Leaving test case "closest_source_point_adaptation"; testing time: 7004979us
7: Leaving test module "ClosestSourcePointAdaptation"; testing time: 7005032us
7: 
47/48 Test  #7: test_closest_source_point_adaptation_3 ...   Passed    8.36 sec
test 8
      Start  8: test_closest_source_point_adaptation_6

8: Test command: /usr/bin/mpiexec "-n" "6" "/var/jenkins/workspace/adamantine-nightly/build/bin/test_closest_source_point_adaptation"
8: Working Directory: /var/jenkins/workspace/adamantine-nightly/build/tests
8: Test timeout computed to be: 7200
8: Running 1 test case...
8: Entering test module "ClosestSourcePointAdaptation"
8: /var/jenkins/workspace/adamantine-nightly/tests/test_closest_source_point_adaptation.cc(123): Entering test case "closest_source_point_adaptation"
8: Running 1 test case...
8: Entering test module "ClosestSourcePointAdaptation"
8: /var/jenkins/workspace/adamantine-nightly/tests/test_closest_source_point_adaptation.cc(123): Entering test case "closest_source_point_adaptation"
8: Running 1 test case...
8: Entering test module "ClosestSourcePointAdaptation"
8: /var/jenkins/workspace/adamantine-nightly/tests/test_closest_source_point_adaptation.cc(123): Entering test case "closest_source_point_adaptation"
8: Running 1 test case...
8: Entering test module "ClosestSourcePointAdaptation"
8: /var/jenkins/workspace/adamantine-nightly/tests/test_closest_source_point_adaptation.cc(123): Entering test case "closest_source_point_adaptation"
8: Running 1 test case...
8: Entering test module "ClosestSourcePointAdaptation"
8: /var/jenkins/workspace/adamantine-nightly/tests/test_closest_source_point_adaptation.cc(123): Entering test case "closest_source_point_adaptation"
8: Running 1 test case...
8: Entering test module "ClosestSourcePointAdaptation"
8: /var/jenkins/workspace/adamantine-nightly/tests/test_closest_source_point_adaptation.cc(123): Entering test case "closest_source_point_adaptation"
8: 
8: *** No errors detected
8: /var/jenkins/workspace/adamantine-nightly/tests/test_closest_source_point_adaptation.cc(123): Leaving test case "closest_source_point_adaptation"; testing time: 4412372us
8: Leaving test module "ClosestSourcePointAdaptation"; testing time: 4412426us
8: /var/jenkins/workspace/adamantine-nightly/tests/test_closest_source_point_adaptation.cc(123): Leaving test case "closest_source_point_adaptation"; testing time: 4411072us
8: Leaving test module "ClosestSourcePointAdaptation"; testing time: 4411151us
8: 
8: *** No errors detected
8: /var/jenkins/workspace/adamantine-nightly/tests/test_closest_source_point_adaptation.cc(123): Leaving test case "closest_source_point_adaptation"; testing time: 4411781us
8: Leaving test module "ClosestSourcePointAdaptation"; testing time: 4411840us
8: 
8: *** No errors detected
8: /var/jenkins/workspace/adamantine-nightly/tests/test_closest_source_point_adaptation.cc(123): Leaving test case "closest_source_point_adaptation"; testing time: 4416691us
8: Leaving test module "ClosestSourcePointAdaptation"; testing time: 4416732us
8: 
8: *** No errors detected
8: /var/jenkins/workspace/adamantine-nightly/tests/test_closest_source_point_adaptation.cc(123): Leaving test case "closest_source_point_adaptation"; testing time: 4415997us
8: Leaving test module "ClosestSourcePointAdaptation"; testing time: 4416054us
8: 
8: *** No errors detected
8: /var/jenkins/workspace/adamantine-nightly/tests/test_closest_source_point_adaptation.cc(123): Leaving test case "closest_source_point_adaptation"; testing time: 4417496us
8: Leaving test module "ClosestSourcePointAdaptation"; testing time: 4417535us
8: 
8: *** No errors detected
8: 
48/48 Test  #8: test_closest_source_point_adaptation_6 ...   Passed    6.43 sec

The following tests passed:
	test_closest_source_point_adaptation_1
	test_data_assimilator_1
	test_experimental_data_1
	test_geometry_1
	test_heat_source_1
	test_integration_da_2
	test_closest_source_point_adaptation_2
	test_material_property_device_1
	test_material_property_1
	test_integration_da_1
	test_post_processor_1
	test_quaternion_1
	test_scan_path_1
	test_mechanical_operator_1
	test_thermal_operator_1
	test_thermal_operator_device_1
	test_timer_1
	test_utils_1
	test_validate_input_database_1
	test_integration_2d_1
	test_integration_2d_device_1
	test_mechanical_physics_1
	test_thermal_physics_device_1
	test_integration_3d_amr_device_1
	test_integration_3d_amr_1
	test_integration_da_augmented_1
	test_material_deposition_1
	test_microstructure_1
	test_thermal_physics_1
	test_ensemble_management_1
	test_integration_3d_device_1
	test_integration_2d_2
	test_integration_2d_device_2
	test_integration_3d_amr_2
	test_integration_3d_amr_device_2
	test_integration_da_augmented_2
	test_material_deposition_2
	test_microstructure_2
	test_thermal_physics_2
	test_ensemble_management_2
	test_integration_thermoelastic_2
	test_integration_da_3
	test_integration_da_6
	test_closest_source_point_adaptation_3
	test_closest_source_point_adaptation_6

94% tests passed, 3 tests failed out of 48

Total Test time (real) = 12889.51 sec

The following tests FAILED:
	 31 - test_integration_3d_1 (Timeout)
	 32 - test_integration_3d_2 (Timeout)
	 39 - test_integration_thermoelastic_1 (Timeout)
Errors while running CTest
Output from these tests are in: /var/jenkins/workspace/adamantine-nightly/build/Testing/Temporary/LastTest.log
Use "--rerun-failed --output-on-failure" to re-run the failed cases verbosely.
[Pipeline] }
[Pipeline] // dir
Post stage
[Pipeline] xunit
INFO: Processing CTest-Version 3.x (default)
[Pipeline] }
[Pipeline] // withEnv
[Pipeline] }
$ docker stop --time=1 a4f5f8b9791f59c38290c1cde123017d0874f87ac04c658ba4a7ab4e46c08009
INFO: [CTest-Version 3.x (default)] - 1 test report file(s) were found with the pattern 'build/Testing/**/Test.xml' relative to '/var/jenkins/workspace/adamantine-nightly' for the testing framework 'CTest-Version 3.x (default)'.
$ docker rm -f --volumes a4f5f8b9791f59c38290c1cde123017d0874f87ac04c658ba4a7ab4e46c08009
[Pipeline] // withDockerContainer
[Pipeline] }
[Pipeline] // withEnv
[Pipeline] }
[Pipeline] // node
[Pipeline] }
[Pipeline] // stage
[Pipeline] }
Failed in branch CUDA
[Pipeline] // parallel
[Pipeline] }
[Pipeline] // stage
[Pipeline] }
[Pipeline] // timeout
[Pipeline] }
[Pipeline] // withEnv
[Pipeline] End of Pipeline
ERROR: script returned exit code 8
Finished: FAILURE