38: Updating the ensemble members...
38: Rank: 1 | New parameters for member 2: 0.107206
38: Done.
38: Rank: 0 | New parameters for member 0: 0.121104
38: Rank: 0 | New parameters for member 1: 0.142225
38: 80% completed
38: 90% completed
38: 100% completed
38: [1;34;49m/var/jenkins/workspace/adamantine-nightly/tests/test_integration_da_augmented.cc(19): Leaving test case "integration_3D_data_assimilation_augmented"; testing time: 38268530us
38: [1;34;49m/var/jenkins/workspace/adamantine-nightly/tests/test_integration_da_augmented.cc(19): Leaving test case "integration_3D_data_assimilation_augmented"; testing time: 38268508us
38: [0;39;49m[1;34;49mLeaving test module "Integration_Data_Assimilation_Augmented"; testing time: 38268903us
38: [0;39;49m
38: [1;32;49m*** No errors detected
38: [0;39;49m
38: [1;32;49m*** No errors detected
38: [0;39;49m[0;39;49m[1;34;49mLeaving test module "Integration_Data_Assimilation_Augmented"; testing time: 38281818us
38: [0;39;49m
38/48 Test #38: test_integration_da_augmented_2 .......... Passed 39.77 sec
test 40
Start 40: test_integration_thermoelastic_2
40: Test command: /usr/bin/mpiexec "-n" "2" "/var/jenkins/workspace/adamantine-nightly/build/bin/test_integration_thermoelastic"
40: Working Directory: /var/jenkins/workspace/adamantine-nightly/build/tests
40: Test timeout computed to be: 7200
40: Running 2 test cases...
40: [1;34;49mEntering test module "Integration_Thermoelastic"
40: [0;39;49m[1;34;49m/var/jenkins/workspace/adamantine-nightly/tests/test_integration_thermoelastic.cc(19): Entering test case "integration_thermoelastic"
40: Running 2 test cases...
40: [1;34;49mEntering test module "Integration_Thermoelastic"
40: [0;39;49m[1;34;49m/var/jenkins/workspace/adamantine-nightly/tests/test_integration_thermoelastic.cc(19): Entering test case "integration_thermoelastic"
32: n_time_step: 601 time: 6 n_dofs (thermal) after cell activation: 1220
32: 60% completed
32: n_time_step: 624 time: 6.23 n_dofs (thermal) after cell activation: 1221
32: n_time_step: 647 time: 6.46 n_dofs (thermal) after cell activation: 1222
34/48 Test #31: test_integration_3d_1 ....................***Timeout 7200.11 sec
32: n_time_step: 671 time: 6.7 n_dofs (thermal) after cell activation: 1223
32: n_time_step: 694 time: 6.93 n_dofs (thermal) after cell activation: 1224
32: 70% completed
32: n_time_step: 717 time: 7.16 n_dofs (thermal) after cell activation: 1226
32: n_time_step: 740 time: 7.39 n_dofs (thermal) after cell activation: 1227
32: n_time_step: 763 time: 7.62 n_dofs (thermal) after cell activation: 1228
40: [0;39;49m[0;39;49m10% completed
32: 50% completed
32: n_time_step: 787 time: 7.86 n_dofs (thermal) after cell activation: 1229
39: 50% completed
32: 80% completed
32: n_time_step: 810 time: 8.09 n_dofs (thermal) after cell activation: 1230
32: n_time_step: 833 time: 8.32 n_dofs (thermal) after cell activation: 1231
32: n_time_step: 857 time: 8.56 n_dofs (thermal) after cell activation: 1232
32: n_time_step: 880 time: 8.79 n_dofs (thermal) after cell activation: 1233
39/48 Test #32: test_integration_3d_2 ....................***Timeout 7200.01 sec
test 42
Start 42: test_material_deposition_2
42: Test command: /usr/bin/mpiexec "-n" "2" "/var/jenkins/workspace/adamantine-nightly/build/bin/test_material_deposition"
42: Working Directory: /var/jenkins/workspace/adamantine-nightly/build/tests
42: Test timeout computed to be: 7200
42: Running 11 test cases...
42: [1;34;49mEntering test module "MaterialDeposition"
42: [0;39;49m[1;34;49m/var/jenkins/workspace/adamantine-nightly/tests/test_material_deposition.cc(50): Entering test case "read_material_deposition_file_2d"
42: Running 11 test cases...
42: [1;34;49mEntering test module "MaterialDeposition"
42: [0;39;49m[1;34;49m/var/jenkins/workspace/adamantine-nightly/tests/test_material_deposition.cc(50): Entering test case "read_material_deposition_file_2d"
42: [0;39;49m[1;34;49m/var/jenkins/workspace/adamantine-nightly/tests/test_material_deposition.cc(50): Leaving test case "read_material_deposition_file_2d"; testing time: 300us
42: [0;39;49m[1;34;49m/var/jenkins/workspace/adamantine-nightly/tests/test_material_deposition.cc(92): Entering test case "read_material_deposition_file_3d"
42: [0;39;49m[1;34;49m/var/jenkins/workspace/adamantine-nightly/tests/test_material_deposition.cc(50): Leaving test case "read_material_deposition_file_2d"; testing time: 355us
42: [0;39;49m[1;34;49m/var/jenkins/workspace/adamantine-nightly/tests/test_material_deposition.cc(92): Entering test case "read_material_deposition_file_3d"
42: [0;39;49m[1;34;49m/var/jenkins/workspace/adamantine-nightly/tests/test_material_deposition.cc(92): Leaving test case "read_material_deposition_file_3d"; testing time: 173us
42: [0;39;49m[1;33;49m/var/jenkins/workspace/adamantine-nightly/tests/test_material_deposition.cc(134): Test case "get_elements_to_activate_2d" is skipped because precondition failed: the test only works in serial
42: [0;39;49m[1;33;49m/var/jenkins/workspace/adamantine-nightly/tests/test_material_deposition.cc(195): Test case "get_elements_to_activate_3d" is skipped because precondition failed: the test only works in serial
42: [0;39;49m[1;34;49m/var/jenkins/workspace/adamantine-nightly/tests/test_material_deposition.cc(262): Entering test case "material_deposition"
42: [0;39;49m[1;34;49m/var/jenkins/workspace/adamantine-nightly/tests/test_material_deposition.cc(92): Leaving test case "read_material_deposition_file_3d"; testing time: 204us
42: [0;39;49m[1;33;49m/var/jenkins/workspace/adamantine-nightly/tests/test_material_deposition.cc(134): Test case "get_elements_to_activate_2d" is skipped because precondition failed: the test only works in serial
42: [0;39;49m[1;33;49m/var/jenkins/workspace/adamantine-nightly/tests/test_material_deposition.cc(195): Test case "get_elements_to_activate_3d" is skipped because precondition failed: the test only works in serial
42: [0;39;49m[1;34;49m/var/jenkins/workspace/adamantine-nightly/tests/test_material_deposition.cc(262): Entering test case "material_deposition"
35/48 Test #39: test_integration_thermoelastic_1 .........***Timeout 7200.11 sec
test 34
Start 34: test_integration_3d_amr_2
34: Test command: /usr/bin/mpiexec "-n" "2" "/var/jenkins/workspace/adamantine-nightly/build/bin/test_integration_3d_amr"
34: Working Directory: /var/jenkins/workspace/adamantine-nightly/build/tests
34: Test timeout computed to be: 7200
42: [0;39;49m[1;34;49m/var/jenkins/workspace/adamantine-nightly/tests/test_material_deposition.cc(262): Leaving test case "material_deposition"; testing time: 11412345us
42: [0;39;49m[1;34;49m/var/jenkins/workspace/adamantine-nightly/tests/test_material_deposition.cc(395): Entering test case "deposition_from_scan_path_2d"
42: [0;39;49m[1;34;49m/var/jenkins/workspace/adamantine-nightly/tests/test_material_deposition.cc(395): Leaving test case "deposition_from_scan_path_2d"; testing time: 248us
42: [0;39;49m[1;34;49m/var/jenkins/workspace/adamantine-nightly/tests/test_material_deposition.cc(445): Entering test case "deposition_from_scan_path_3d"
42: [0;39;49m[1;34;49m/var/jenkins/workspace/adamantine-nightly/tests/test_material_deposition.cc(262): Leaving test case "material_deposition"; testing time: 11412527us
42: [0;39;49m[1;34;49m/var/jenkins/workspace/adamantine-nightly/tests/test_material_deposition.cc(445): Leaving test case "deposition_from_scan_path_3d"; testing time: 168us
42: [0;39;49m[1;34;49m/var/jenkins/workspace/adamantine-nightly/tests/test_material_deposition.cc(499): Entering test case "deposition_from_L_scan_path_3d"
42: [0;39;49m[1;34;49m/var/jenkins/workspace/adamantine-nightly/tests/test_material_deposition.cc(499): Leaving test case "deposition_from_L_scan_path_3d"; testing time: 193us
42: [0;39;49m[1;34;49m/var/jenkins/workspace/adamantine-nightly/tests/test_material_deposition.cc(586): Entering test case "deposition_from_diagonal_scan_path_3d"
42: [0;39;49m[1;34;49m/var/jenkins/workspace/adamantine-nightly/tests/test_material_deposition.cc(586): Leaving test case "deposition_from_diagonal_scan_path_3d"; testing time: 164us
42: [0;39;49m[1;34;49m/var/jenkins/workspace/adamantine-nightly/tests/test_material_deposition.cc(640): Entering test case "merge_multiple_deposition_paths"
42: [0;39;49m[1;34;49m/var/jenkins/workspace/adamantine-nightly/tests/test_material_deposition.cc(640): Leaving test case "merge_multiple_deposition_paths"; testing time: 102us
42: [0;39;49m[1;34;49m/var/jenkins/workspace/adamantine-nightly/tests/test_material_deposition.cc(697): Entering test case "deposition_quaternion_straight_line"
42: [0;39;49m[1;34;49m/var/jenkins/workspace/adamantine-nightly/tests/test_material_deposition.cc(697): Leaving test case "deposition_quaternion_straight_line"; testing time: 506us
42: [0;39;49m[1;34;49mLeaving test module "MaterialDeposition"; testing time: 11415820us
42: [0;39;49m
42: [1;32;49m*** No errors detected
42: [0;39;49m[0;39;49m[1;34;49m/var/jenkins/workspace/adamantine-nightly/tests/test_material_deposition.cc(395): Entering test case "deposition_from_scan_path_2d"
42: [0;39;49m[1;34;49m/var/jenkins/workspace/adamantine-nightly/tests/test_material_deposition.cc(395): Leaving test case "deposition_from_scan_path_2d"; testing time: 327us
42: [0;39;49m[1;34;49m/var/jenkins/workspace/adamantine-nightly/tests/test_material_deposition.cc(445): Entering test case "deposition_from_scan_path_3d"
42: [0;39;49m[1;34;49m/var/jenkins/workspace/adamantine-nightly/tests/test_material_deposition.cc(445): Leaving test case "deposition_from_scan_path_3d"; testing time: 173us
42: [0;39;49m[1;34;49m/var/jenkins/workspace/adamantine-nightly/tests/test_material_deposition.cc(499): Entering test case "deposition_from_L_scan_path_3d"
42: [0;39;49m[1;34;49m/var/jenkins/workspace/adamantine-nightly/tests/test_material_deposition.cc(499): Leaving test case "deposition_from_L_scan_path_3d"; testing time: 199us
42: [0;39;49m[1;34;49m/var/jenkins/workspace/adamantine-nightly/tests/test_material_deposition.cc(586): Entering test case "deposition_from_diagonal_scan_path_3d"
42: [0;39;49m[1;34;49m/var/jenkins/workspace/adamantine-nightly/tests/test_material_deposition.cc(586): Leaving test case "deposition_from_diagonal_scan_path_3d"; testing time: 167us
42: [0;39;49m[1;34;49m/var/jenkins/workspace/adamantine-nightly/tests/test_material_deposition.cc(640): Entering test case "merge_multiple_deposition_paths"
42: [0;39;49m[1;34;49m/var/jenkins/workspace/adamantine-nightly/tests/test_material_deposition.cc(640): Leaving test case "merge_multiple_deposition_paths"; testing time: 111us
42: [0;39;49m[1;34;49m/var/jenkins/workspace/adamantine-nightly/tests/test_material_deposition.cc(697): Entering test case "deposition_quaternion_straight_line"
42: [0;39;49m[1;34;49m/var/jenkins/workspace/adamantine-nightly/tests/test_material_deposition.cc(697): Leaving test case "deposition_quaternion_straight_line"; testing time: 518us
42: [0;39;49m[1;34;49mLeaving test module "MaterialDeposition"; testing time: 11428547us
42: [0;39;49m
42: [1;32;49m*** No errors detected
42: [0;39;49m
40/48 Test #42: test_material_deposition_2 ............... Passed 12.19 sec
test 44
Start 44: test_microstructure_2
44: Test command: /usr/bin/mpiexec "-n" "2" "/var/jenkins/workspace/adamantine-nightly/build/bin/test_microstructure"
44: Working Directory: /var/jenkins/workspace/adamantine-nightly/build/tests
44: Test timeout computed to be: 7200
44: Running 1 test case...
44: [1;34;49mEntering test module "MicroStructure"
44: [0;39;49m[1;34;49m/var/jenkins/workspace/adamantine-nightly/tests/test_microstructure.cc(53): Entering test case "G_and_R"
44: Running 1 test case...
44: [1;34;49mEntering test module "MicroStructure"
44: [0;39;49m[1;34;49m/var/jenkins/workspace/adamantine-nightly/tests/test_microstructure.cc(53): Entering test case "G_and_R"
44:
44: [1;32;49m*** No errors detected
44: [0;39;49m[0;39;49m[1;36;49mTest case G_and_R did not check any assertions[0;39;49m
44: [1;34;49m/var/jenkins/workspace/adamantine-nightly/tests/test_microstructure.cc(53): Leaving test case "G_and_R"; testing time: 238571us
44: [0;39;49m[1;34;49mLeaving test module "MicroStructure"; testing time: 238629us
44: [0;39;49m[0;39;49m[1;34;49m/var/jenkins/workspace/adamantine-nightly/tests/test_microstructure.cc(53): Leaving test case "G_and_R"; testing time: 251388us
44: [0;39;49m[1;34;49mLeaving test module "MicroStructure"; testing time: 251453us
44: [0;39;49m
44: [1;32;49m*** No errors detected
44: [0;39;49m
41/48 Test #44: test_microstructure_2 .................... Passed 1.00 sec
test 46
Start 46: test_thermal_physics_2
46: Test command: /usr/bin/mpiexec "-n" "2" "/var/jenkins/workspace/adamantine-nightly/build/bin/test_thermal_physics"
46: Working Directory: /var/jenkins/workspace/adamantine-nightly/build/tests
46: Test timeout computed to be: 7200
34: Running 2 test cases...
34: [1;34;49mEntering test module "Integration_3D_AMR"
34: [0;39;49m[1;34;49m/var/jenkins/workspace/adamantine-nightly/tests/test_integration_3d_amr.cc(19): Entering test case "integration_3D_amr"
34: Running 2 test cases...
34: [1;34;49mEntering test module "Integration_3D_AMR"
34: [0;39;49m[1;34;49m/var/jenkins/workspace/adamantine-nightly/tests/test_integration_3d_amr.cc(19): Entering test case "integration_3D_amr"
46: Running 7 test cases...
46: [1;34;49mEntering test module "ThermalPhysics"
46: [0;39;49m[1;34;49m/var/jenkins/workspace/adamantine-nightly/tests/test_thermal_physics.cc(15): Entering test case "thermal_2d_explicit_host"
46: Running 7 test cases...
46: [1;34;49mEntering test module "ThermalPhysics"
46: [0;39;49m[1;34;49m/var/jenkins/workspace/adamantine-nightly/tests/test_thermal_physics.cc(15): Entering test case "thermal_2d_explicit_host"
46: [0;39;49m[1;34;49m/var/jenkins/workspace/adamantine-nightly/tests/test_thermal_physics.cc(15): Leaving test case "thermal_2d_explicit_host"; testing time: 203475us
46: [0;39;49m[1;34;49m/var/jenkins/workspace/adamantine-nightly/tests/test_thermal_physics.cc(28): Entering test case "thermal_2d_manufactured_solution_host"
46: [0;39;49m[1;34;49m/var/jenkins/workspace/adamantine-nightly/tests/test_thermal_physics.cc(15): Leaving test case "thermal_2d_explicit_host"; testing time: 203588us
46: [0;39;49m[1;34;49m/var/jenkins/workspace/adamantine-nightly/tests/test_thermal_physics.cc(28): Entering test case "thermal_2d_manufactured_solution_host"
46: [0;39;49m[1;34;49m/var/jenkins/workspace/adamantine-nightly/tests/test_thermal_physics.cc(28): Leaving test case "thermal_2d_manufactured_solution_host"; testing time: 159156us
46: [0;39;49m[1;34;49m/var/jenkins/workspace/adamantine-nightly/tests/test_thermal_physics.cc(28): Leaving test case "thermal_2d_manufactured_solution_host"; testing time: 158921us
46: [0;39;49m[1;34;49m/var/jenkins/workspace/adamantine-nightly/tests/test_thermal_physics.cc(33): Entering test case "initial_temperature_host"
46: [0;39;49m[1;34;49m/var/jenkins/workspace/adamantine-nightly/tests/test_thermal_physics.cc(33): Entering test case "initial_temperature_host"
46: [0;39;49m[1;34;49m/var/jenkins/workspace/adamantine-nightly/tests/test_thermal_physics.cc(33): Leaving test case "initial_temperature_host"; testing time: 171325us
46: [0;39;49m[1;34;49m/var/jenkins/workspace/adamantine-nightly/tests/test_thermal_physics.cc(38): Entering test case "energy_conservation_host"
46: [0;39;49m[1;34;49m/var/jenkins/workspace/adamantine-nightly/tests/test_thermal_physics.cc(33): Leaving test case "initial_temperature_host"; testing time: 173926us
46: [0;39;49m[1;34;49m/var/jenkins/workspace/adamantine-nightly/tests/test_thermal_physics.cc(38): Entering test case "energy_conservation_host"
34: [0;39;49m10% completed
34: 20% completed
46: [0;39;49m[1;34;49m/var/jenkins/workspace/adamantine-nightly/tests/test_thermal_physics.cc(38): Leaving test case "energy_conservation_host"; testing time: 3616505us
46: [0;39;49m[1;34;49m/var/jenkins/workspace/adamantine-nightly/tests/test_thermal_physics.cc(38): Leaving test case "energy_conservation_host"; testing time: 3616466us
46: [0;39;49m[1;34;49m/var/jenkins/workspace/adamantine-nightly/tests/test_thermal_physics.cc(43): Entering test case "radiation_bcs_host"
46: [0;39;49m[1;34;49m/var/jenkins/workspace/adamantine-nightly/tests/test_thermal_physics.cc(43): Entering test case "radiation_bcs_host"
34: 30% completed
34: 40% completed
34: 50% completed
46: [0;39;49m[1;34;49m/var/jenkins/workspace/adamantine-nightly/tests/test_thermal_physics.cc(43): Leaving test case "radiation_bcs_host"; testing time: 3398790us
46: [0;39;49m[1;34;49m/var/jenkins/workspace/adamantine-nightly/tests/test_thermal_physics.cc(48): Entering test case "convection_bcs_host"
46: [0;39;49m[1;34;49m/var/jenkins/workspace/adamantine-nightly/tests/test_thermal_physics.cc(43): Leaving test case "radiation_bcs_host"; testing time: 3398067us
46: [0;39;49m[1;34;49m/var/jenkins/workspace/adamantine-nightly/tests/test_thermal_physics.cc(48): Entering test case "convection_bcs_host"
34: 60% completed
34: 70% completed
34: 80% completed
34: 90% completed
34: 100% completed
34: [0;39;49m[1;34;49m/var/jenkins/workspace/adamantine-nightly/tests/test_integration_3d_amr.cc(19): Leaving test case "integration_3D_amr"; testing time: 14766621us
34: [0;39;49m[1;34;49m/var/jenkins/workspace/adamantine-nightly/tests/test_integration_3d_amr.cc(60): Entering test case "integration_3D_amr_refine_coarsen"
34: [1;34;49m/var/jenkins/workspace/adamantine-nightly/tests/test_integration_3d_amr.cc(19): Leaving test case "integration_3D_amr"; testing time: 14871254us
34: [0;39;49m[1;34;49m/var/jenkins/workspace/adamantine-nightly/tests/test_integration_3d_amr.cc(60): Entering test case "integration_3D_amr_refine_coarsen"
34: [0;39;49m10% completed
46: [0;39;49m[1;34;49m/var/jenkins/workspace/adamantine-nightly/tests/test_thermal_physics.cc(48): Leaving test case "convection_bcs_host"; testing time: 42087810us
46: [0;39;49m[1;34;49m/var/jenkins/workspace/adamantine-nightly/tests/test_thermal_physics.cc(48): Leaving test case "convection_bcs_host"; testing time: 42075051us
46: [0;39;49m[1;34;49m/var/jenkins/workspace/adamantine-nightly/tests/test_thermal_physics.cc(53): Entering test case "reference_temperature_host"
46: [0;39;49m[1;34;49m/var/jenkins/workspace/adamantine-nightly/tests/test_thermal_physics.cc(53): Entering test case "reference_temperature_host"
46: [0;39;49m[1;34;49m/var/jenkins/workspace/adamantine-nightly/tests/test_thermal_physics.cc(53): Leaving test case "reference_temperature_host"; testing time: 184232us
46: [0;39;49m[1;34;49mLeaving test module "ThermalPhysics"; testing time: 49836822us
46: [0;39;49m
46: [1;32;49m*** No errors detected
46: [0;39;49m[0;39;49m[1;34;49m/var/jenkins/workspace/adamantine-nightly/tests/test_thermal_physics.cc(53): Leaving test case "reference_temperature_host"; testing time: 195202us
46: [0;39;49m[1;34;49mLeaving test module "ThermalPhysics"; testing time: 49860466us
46: [0;39;49m
46: [1;32;49m*** No errors detected
46: [0;39;49m
42/48 Test #46: test_thermal_physics_2 ................... Passed 50.61 sec
test 48
Start 48: test_ensemble_management_2
48: Test command: /usr/bin/mpiexec "-n" "2" "/var/jenkins/workspace/adamantine-nightly/build/bin/test_ensemble_management"
48: Working Directory: /var/jenkins/workspace/adamantine-nightly/build/tests
48: Test timeout computed to be: 7200
48: Running 1 test case...
48: [1;34;49mEntering test module "EnsembleManagement"
48: [0;39;49m[1;34;49m/var/jenkins/workspace/adamantine-nightly/tests/test_ensemble_management.cc(17): Entering test case "database_ensemble"
48: Running 1 test case...
48: [1;34;49mEntering test module "EnsembleManagement"
48: [0;39;49m[1;34;49m/var/jenkins/workspace/adamantine-nightly/tests/test_ensemble_management.cc(17): Entering test case "database_ensemble"
48: [0;39;49m[1;34;49m/var/jenkins/workspace/adamantine-nightly/tests/test_ensemble_management.cc(17): Leaving test case "database_ensemble"; testing time: 365us
48: [0;39;49m[1;34;49mLeaving test module "EnsembleManagement"; testing time: 393us
48: [0;39;49m
48: [1;32;49m*** No errors detected
48: [0;39;49m[0;39;49m[1;34;49m/var/jenkins/workspace/adamantine-nightly/tests/test_ensemble_management.cc(17): Leaving test case "database_ensemble"; testing time: 2447us
48: [0;39;49m[1;34;49mLeaving test module "EnsembleManagement"; testing time: 2482us
48: [0;39;49m
48: [1;32;49m*** No errors detected
48: [0;39;49m
43/48 Test #48: test_ensemble_management_2 ............... Passed 0.73 sec
40: 20% completed
34: 20% completed
34: 30% completed
34: 40% completed
34: 50% completed
34: 60% completed
34: 70% completed
34: 80% completed
34: 90% completed
32: 60% completed
34: 100% completed
34: [0;39;49m[1;34;49m/var/jenkins/workspace/adamantine-nightly/tests/test_integration_3d_amr.cc(60): Leaving test case "integration_3D_amr_refine_coarsen"; testing time: 141042073us
34: [0;39;49m[1;34;49mLeaving test module "Integration_3D_AMR"; testing time: 155810019us
34: [0;39;49m
34: [1;32;49m*** No errors detected
34: [0;39;49m[1;34;49m/var/jenkins/workspace/adamantine-nightly/tests/test_integration_3d_amr.cc(60): Leaving test case "integration_3D_amr_refine_coarsen"; testing time: 141032ms
34: [0;39;49m[1;34;49mLeaving test module "Integration_3D_AMR"; testing time: 155905017us
34: [0;39;49m
34: [1;32;49m*** No errors detected
34: [0;39;49m
36/48 Test #34: test_integration_3d_amr_2 ................ Passed 163.23 sec
test 36
Start 36: test_integration_3d_amr_device_2
36: Test command: /usr/bin/mpiexec "-n" "2" "/var/jenkins/workspace/adamantine-nightly/build/bin/test_integration_3d_amr_device"
36: Working Directory: /var/jenkins/workspace/adamantine-nightly/build/tests
36: Test timeout computed to be: 7200
36: Running 1 test case...
36: [1;34;49mEntering test module "Integration_3D_AMR"
36: [0;39;49m[1;34;49m/var/jenkins/workspace/adamantine-nightly/tests/test_integration_3d_amr_device.cc(19): Entering test case "integration_3D_amr_device"
36: Running 1 test case...
36: [1;34;49mEntering test module "Integration_3D_AMR"
36: [0;39;49m[1;34;49m/var/jenkins/workspace/adamantine-nightly/tests/test_integration_3d_amr_device.cc(19): Entering test case "integration_3D_amr_device"
36: [0;39;49m10% completed
40: 30% completed
36: 20% completed
36: 30% completed
36: 40% completed
36: 50% completed
36: 60% completed
36: 70% completed
36: 80% completed
36: 90% completed
36: 100% completed
36:
36: [1;32;49m*** No errors detected
36: [0;39;49m[0;39;49m[1;34;49m/var/jenkins/workspace/adamantine-nightly/tests/test_integration_3d_amr_device.cc(19): Leaving test case "integration_3D_amr_device"; testing time: 123052167us
36: [0;39;49m[1;34;49mLeaving test module "Integration_3D_AMR"; testing time: 123052830us
36: [0;39;49m
36: [1;32;49m*** No errors detected
36: [0;39;49m[1;34;49m/var/jenkins/workspace/adamantine-nightly/tests/test_integration_3d_amr_device.cc(19): Leaving test case "integration_3D_amr_device"; testing time: 123080728us
36: [0;39;49m[1;34;49mLeaving test module "Integration_3D_AMR"; testing time: 123081622us
36: [0;39;49m
37/48 Test #36: test_integration_3d_amr_device_2 ......... Passed 132.28 sec
test 38
Start 38: test_integration_da_augmented_2
38: Test command: /usr/bin/mpiexec "-n" "2" "/var/jenkins/workspace/adamantine-nightly/build/bin/test_integration_da_augmented"
38: Working Directory: /var/jenkins/workspace/adamantine-nightly/build/tests
38: Test timeout computed to be: 7200
38: Running 1 test case...
38: [1;34;49mEntering test module "Integration_Data_Assimilation_Augmented"
38: [0;39;49m[1;34;49m/var/jenkins/workspace/adamantine-nightly/tests/test_integration_da_augmented.cc(19): Entering test case "integration_3D_data_assimilation_augmented"
38: Running 1 test case...
38: [1;34;49mEntering test module "Integration_Data_Assimilation_Augmented"
38: [0;39;49m[1;34;49m/var/jenkins/workspace/adamantine-nightly/tests/test_integration_da_augmented.cc(19): Entering test case "integration_3D_data_assimilation_augmented"
38: [0;39;49mReading the experimental log file...
38: Done. Log entries found for 1 camera(s), with 2 frame(s).
38: Starting the main time stepping loop...
38: 10% completed
40: 40% completed
38: 20% completed
38: 30% completed
38: [0;39;49mRank: 1 | Old parameters for member 2: 0.446065
38: Rank: 1 | Number expt sites mapped to DOFs: 2
38: 40% completed
38: 50% completed
38: 60% completed
38: 70% completed
38: Performing data assimilation at time 0.04...
38: Rank: 0 | Old parameters for member 0: 0.413453
38: Rank: 0 | Old parameters for member 1: 0.385362
38: Rank: 0 | Number expt sites mapped to DOFs: 2
38: Getting the perturbed innovation...
38: Applying the Kalman gain...
38: Updating the ensemble members...
38: Rank: 1 | New parameters for member 2: 0.107206
38: Done.
38: Rank: 0 | New parameters for member 0: 0.121104
38: Rank: 0 | New parameters for member 1: 0.142225
38: 80% completed
38: 90% completed
38: 100% completed
38:
38: [1;32;49m*** No errors detected
38: [0;39;49m
38: [1;32;49m*** No errors detected
38: [0;39;49m[1;34;49m/var/jenkins/workspace/adamantine-nightly/tests/test_integration_da_augmented.cc(19): Leaving test case "integration_3D_data_assimilation_augmented"; testing time: 70828465us
38: [0;39;49m[1;34;49mLeaving test module "Integration_Data_Assimilation_Augmented"; testing time: 70828795us
38: [0;39;49m[1;34;49m/var/jenkins/workspace/adamantine-nightly/tests/test_integration_da_augmented.cc(19): Leaving test case "integration_3D_data_assimilation_augmented"; testing time: 70858920us
38: [0;39;49m[1;34;49mLeaving test module "Integration_Data_Assimilation_Augmented"; testing time: 70859366us
38: [0;39;49m
38/48 Test #38: test_integration_da_augmented_2 .......... Passed 78.17 sec
test 40
Start 40: test_integration_thermoelastic_2
40: Test command: /usr/bin/mpiexec "-n" "2" "/var/jenkins/workspace/adamantine-nightly/build/bin/test_integration_thermoelastic"
40: Working Directory: /var/jenkins/workspace/adamantine-nightly/build/tests
40: Test timeout computed to be: 7200
40: Running 2 test cases...
40: [1;34;49mEntering test module "Integration_Thermoelastic"
40: [0;39;49m[1;34;49m/var/jenkins/workspace/adamantine-nightly/tests/test_integration_thermoelastic.cc(19): Entering test case "integration_thermoelastic"
40: Running 2 test cases...
40: [1;34;49mEntering test module "Integration_Thermoelastic"
40: [0;39;49m[1;34;49m/var/jenkins/workspace/adamantine-nightly/tests/test_integration_thermoelastic.cc(19): Entering test case "integration_thermoelastic"
40: 50% completed
40: 60% completed
32: 70% completed
40: 70% completed
40: 80% completed
40: 90% completed
40: [0;39;49m[0;39;49m10% completed
40: 100% completed
40: [1;34;49m/var/jenkins/workspace/adamantine-nightly/tests/test_integration_thermoelastic.cc(19): Leaving test case "integration_thermoelastic"; testing time: 1802531708us
40: [0;39;49m[1;34;49m/var/jenkins/workspace/adamantine-nightly/tests/test_integration_thermoelastic.cc(47): Entering test case "integration_thermoelastic_add_material"
40: [1;34;49m/var/jenkins/workspace/adamantine-nightly/tests/test_integration_thermoelastic.cc(19): Leaving test case "integration_thermoelastic"; testing time: 1802531394us
40: [0;39;49m[1;34;49m/var/jenkins/workspace/adamantine-nightly/tests/test_integration_thermoelastic.cc(47): Entering test case "integration_thermoelastic_add_material"
32: 80% completed
40: [0;39;49m[0;39;49m10% completed
40: 20% completed
39/48 Test #32: test_integration_3d_2 ....................***Timeout 7200.01 sec
test 42
Start 42: test_material_deposition_2
42: Test command: /usr/bin/mpiexec "-n" "2" "/var/jenkins/workspace/adamantine-nightly/build/bin/test_material_deposition"
42: Working Directory: /var/jenkins/workspace/adamantine-nightly/build/tests
42: Test timeout computed to be: 7200
42: Running 11 test cases...
42: [1;34;49mEntering test module "MaterialDeposition"
42: [0;39;49m[1;34;49m/var/jenkins/workspace/adamantine-nightly/tests/test_material_deposition.cc(50): Entering test case "read_material_deposition_file_2d"
42: [0;39;49m[1;34;49m/var/jenkins/workspace/adamantine-nightly/tests/test_material_deposition.cc(50): Leaving test case "read_material_deposition_file_2d"; testing time: 482us
42: [0;39;49m[1;34;49m/var/jenkins/workspace/adamantine-nightly/tests/test_material_deposition.cc(92): Entering test case "read_material_deposition_file_3d"
42: [0;39;49m[1;34;49m/var/jenkins/workspace/adamantine-nightly/tests/test_material_deposition.cc(92): Leaving test case "read_material_deposition_file_3d"; testing time: 234us
42: [0;39;49m[1;33;49m/var/jenkins/workspace/adamantine-nightly/tests/test_material_deposition.cc(134): Test case "get_elements_to_activate_2d" is skipped because precondition failed: the test only works in serial
42: [0;39;49m[1;33;49m/var/jenkins/workspace/adamantine-nightly/tests/test_material_deposition.cc(195): Test case "get_elements_to_activate_3d" is skipped because precondition failed: the test only works in serial
42: [0;39;49m[1;34;49m/var/jenkins/workspace/adamantine-nightly/tests/test_material_deposition.cc(262): Entering test case "material_deposition"
42: Running 11 test cases...
42: [1;34;49mEntering test module "MaterialDeposition"
42: [0;39;49m[1;34;49m/var/jenkins/workspace/adamantine-nightly/tests/test_material_deposition.cc(50): Entering test case "read_material_deposition_file_2d"
42: [0;39;49m[1;34;49m/var/jenkins/workspace/adamantine-nightly/tests/test_material_deposition.cc(50): Leaving test case "read_material_deposition_file_2d"; testing time: 439us
42: [0;39;49m[1;34;49m/var/jenkins/workspace/adamantine-nightly/tests/test_material_deposition.cc(92): Entering test case "read_material_deposition_file_3d"
42: [0;39;49m[1;34;49m/var/jenkins/workspace/adamantine-nightly/tests/test_material_deposition.cc(92): Leaving test case "read_material_deposition_file_3d"; testing time: 228us
42: [0;39;49m[1;33;49m/var/jenkins/workspace/adamantine-nightly/tests/test_material_deposition.cc(134): Test case "get_elements_to_activate_2d" is skipped because precondition failed: the test only works in serial
42: [0;39;49m[1;33;49m/var/jenkins/workspace/adamantine-nightly/tests/test_material_deposition.cc(195): Test case "get_elements_to_activate_3d" is skipped because precondition failed: the test only works in serial
42: [0;39;49m[1;34;49m/var/jenkins/workspace/adamantine-nightly/tests/test_material_deposition.cc(262): Entering test case "material_deposition"
40: 30% completed
42: [0;39;49m[1;34;49m/var/jenkins/workspace/adamantine-nightly/tests/test_material_deposition.cc(262): Leaving test case "material_deposition"; testing time: 16517493us
42: [0;39;49m[1;34;49m/var/jenkins/workspace/adamantine-nightly/tests/test_material_deposition.cc(395): Entering test case "deposition_from_scan_path_2d"
42: [0;39;49m[1;34;49m/var/jenkins/workspace/adamantine-nightly/tests/test_material_deposition.cc(262): Leaving test case "material_deposition"; testing time: 16607049us
42: [0;39;49m[1;34;49m/var/jenkins/workspace/adamantine-nightly/tests/test_material_deposition.cc(395): Entering test case "deposition_from_scan_path_2d"
42: [0;39;49m[1;34;49m/var/jenkins/workspace/adamantine-nightly/tests/test_material_deposition.cc(395): Leaving test case "deposition_from_scan_path_2d"; testing time: 298us
42: [0;39;49m[1;34;49m/var/jenkins/workspace/adamantine-nightly/tests/test_material_deposition.cc(445): Entering test case "deposition_from_scan_path_3d"
42: [0;39;49m[1;34;49m/var/jenkins/workspace/adamantine-nightly/tests/test_material_deposition.cc(445): Leaving test case "deposition_from_scan_path_3d"; testing time: 262us
42: [0;39;49m[1;34;49m/var/jenkins/workspace/adamantine-nightly/tests/test_material_deposition.cc(499): Entering test case "deposition_from_L_scan_path_3d"
42: [0;39;49m[1;34;49m/var/jenkins/workspace/adamantine-nightly/tests/test_material_deposition.cc(395): Leaving test case "deposition_from_scan_path_2d"; testing time: 356us
42: [0;39;49m[1;34;49m/var/jenkins/workspace/adamantine-nightly/tests/test_material_deposition.cc(445): Entering test case "deposition_from_scan_path_3d"
42: [0;39;49m[1;34;49m/var/jenkins/workspace/adamantine-nightly/tests/test_material_deposition.cc(499): Leaving test case "deposition_from_L_scan_path_3d"; testing time: 259us
42: [0;39;49m[1;34;49m/var/jenkins/workspace/adamantine-nightly/tests/test_material_deposition.cc(586): Entering test case "deposition_from_diagonal_scan_path_3d"
42: [0;39;49m[1;34;49m/var/jenkins/workspace/adamantine-nightly/tests/test_material_deposition.cc(445): Leaving test case "deposition_from_scan_path_3d"; testing time: 253us
42: [0;39;49m[1;34;49m/var/jenkins/workspace/adamantine-nightly/tests/test_material_deposition.cc(499): Entering test case "deposition_from_L_scan_path_3d"
42: [0;39;49m[1;34;49m/var/jenkins/workspace/adamantine-nightly/tests/test_material_deposition.cc(586): Leaving test case "deposition_from_diagonal_scan_path_3d"; testing time: 233us
42: [0;39;49m[1;34;49m/var/jenkins/workspace/adamantine-nightly/tests/test_material_deposition.cc(640): Entering test case "merge_multiple_deposition_paths"
42: [0;39;49m[1;34;49m/var/jenkins/workspace/adamantine-nightly/tests/test_material_deposition.cc(499): Leaving test case "deposition_from_L_scan_path_3d"; testing time: 277us
42: [0;39;49m[1;34;49m/var/jenkins/workspace/adamantine-nightly/tests/test_material_deposition.cc(586): Entering test case "deposition_from_diagonal_scan_path_3d"
42: [0;39;49m[1;34;49m/var/jenkins/workspace/adamantine-nightly/tests/test_material_deposition.cc(640): Leaving test case "merge_multiple_deposition_paths"; testing time: 146us
42: [0;39;49m[1;34;49m/var/jenkins/workspace/adamantine-nightly/tests/test_material_deposition.cc(697): Entering test case "deposition_quaternion_straight_line"
42: [0;39;49m[1;34;49m/var/jenkins/workspace/adamantine-nightly/tests/test_material_deposition.cc(586): Leaving test case "deposition_from_diagonal_scan_path_3d"; testing time: 233us
42: [0;39;49m[1;34;49m/var/jenkins/workspace/adamantine-nightly/tests/test_material_deposition.cc(640): Entering test case "merge_multiple_deposition_paths"
42: [0;39;49m[1;34;49m/var/jenkins/workspace/adamantine-nightly/tests/test_material_deposition.cc(640): Leaving test case "merge_multiple_deposition_paths"; testing time: 143us
42: [0;39;49m[1;34;49m/var/jenkins/workspace/adamantine-nightly/tests/test_material_deposition.cc(697): Entering test case "deposition_quaternion_straight_line"
42:
42: [1;32;49m*** No errors detected
42: [0;39;49m[0;39;49m[1;34;49m/var/jenkins/workspace/adamantine-nightly/tests/test_material_deposition.cc(697): Leaving test case "deposition_quaternion_straight_line"; testing time: 672us
42: [0;39;49m[1;34;49mLeaving test module "MaterialDeposition"; testing time: 16521975us
42: [0;39;49m
42: [1;32;49m*** No errors detected
42: [0;39;49m[0;39;49m[1;34;49m/var/jenkins/workspace/adamantine-nightly/tests/test_material_deposition.cc(697): Leaving test case "deposition_quaternion_straight_line"; testing time: 697us
42: [0;39;49m[1;34;49mLeaving test module "MaterialDeposition"; testing time: 16611785us
42: [0;39;49m
40/48 Test #42: test_material_deposition_2 ............... Passed 23.28 sec
test 44
Start 44: test_microstructure_2
44: Test command: /usr/bin/mpiexec "-n" "2" "/var/jenkins/workspace/adamantine-nightly/build/bin/test_microstructure"
44: Working Directory: /var/jenkins/workspace/adamantine-nightly/build/tests
44: Test timeout computed to be: 7200
44: Running 1 test case...
44: [1;34;49mEntering test module "MicroStructure"
44: [0;39;49m[1;34;49m/var/jenkins/workspace/adamantine-nightly/tests/test_microstructure.cc(53): Entering test case "G_and_R"
44: Running 1 test case...
44: [1;34;49mEntering test module "MicroStructure"
44: [0;39;49m[1;34;49m/var/jenkins/workspace/adamantine-nightly/tests/test_microstructure.cc(53): Entering test case "G_and_R"
44:
44: [1;32;49m*** No errors detected
44: [0;39;49m[0;39;49m[1;36;49mTest case G_and_R did not check any assertions[0;39;49m
44: [1;34;49m/var/jenkins/workspace/adamantine-nightly/tests/test_microstructure.cc(53): Leaving test case "G_and_R"; testing time: 426591us
44: [0;39;49m[1;34;49mLeaving test module "MicroStructure"; testing time: 426643us
44: [0;39;49m[0;39;49m[1;34;49m/var/jenkins/workspace/adamantine-nightly/tests/test_microstructure.cc(53): Leaving test case "G_and_R"; testing time: 440674us
44: [0;39;49m[1;34;49mLeaving test module "MicroStructure"; testing time: 440728us
44: [0;39;49m
44: [1;32;49m*** No errors detected
44: [0;39;49m
41/48 Test #44: test_microstructure_2 .................... Passed 6.28 sec
test 46
Start 46: test_thermal_physics_2
46: Test command: /usr/bin/mpiexec "-n" "2" "/var/jenkins/workspace/adamantine-nightly/build/bin/test_thermal_physics"
46: Working Directory: /var/jenkins/workspace/adamantine-nightly/build/tests
46: Test timeout computed to be: 7200
46: Running 7 test cases...
46: [1;34;49mEntering test module "ThermalPhysics"
46: [0;39;49m[1;34;49m/var/jenkins/workspace/adamantine-nightly/tests/test_thermal_physics.cc(15): Entering test case "thermal_2d_explicit_host"
46: Running 7 test cases...
46: [1;34;49mEntering test module "ThermalPhysics"
46: [0;39;49m[1;34;49m/var/jenkins/workspace/adamantine-nightly/tests/test_thermal_physics.cc(15): Entering test case "thermal_2d_explicit_host"
46: [0;39;49m[1;34;49m/var/jenkins/workspace/adamantine-nightly/tests/test_thermal_physics.cc(15): Leaving test case "thermal_2d_explicit_host"; testing time: 340153us
46: [0;39;49m[1;34;49m/var/jenkins/workspace/adamantine-nightly/tests/test_thermal_physics.cc(28): Entering test case "thermal_2d_manufactured_solution_host"
46: [0;39;49m[1;34;49m/var/jenkins/workspace/adamantine-nightly/tests/test_thermal_physics.cc(15): Leaving test case "thermal_2d_explicit_host"; testing time: 308067us
46: [0;39;49m[1;34;49m/var/jenkins/workspace/adamantine-nightly/tests/test_thermal_physics.cc(28): Entering test case "thermal_2d_manufactured_solution_host"
46: [0;39;49m[1;34;49m/var/jenkins/workspace/adamantine-nightly/tests/test_thermal_physics.cc(28): Leaving test case "thermal_2d_manufactured_solution_host"; testing time: 222767us
46: [0;39;49m[1;34;49m/var/jenkins/workspace/adamantine-nightly/tests/test_thermal_physics.cc(33): Entering test case "initial_temperature_host"
46: [0;39;49m[1;34;49m/var/jenkins/workspace/adamantine-nightly/tests/test_thermal_physics.cc(28): Leaving test case "thermal_2d_manufactured_solution_host"; testing time: 222604us
46: [0;39;49m[1;34;49m/var/jenkins/workspace/adamantine-nightly/tests/test_thermal_physics.cc(33): Entering test case "initial_temperature_host"
46: [0;39;49m[1;34;49m/var/jenkins/workspace/adamantine-nightly/tests/test_thermal_physics.cc(33): Leaving test case "initial_temperature_host"; testing time: 204506us
46: [0;39;49m[1;34;49m/var/jenkins/workspace/adamantine-nightly/tests/test_thermal_physics.cc(38): Entering test case "energy_conservation_host"
46: [0;39;49m[1;34;49m/var/jenkins/workspace/adamantine-nightly/tests/test_thermal_physics.cc(33): Leaving test case "initial_temperature_host"; testing time: 204597us
46: [0;39;49m[1;34;49m/var/jenkins/workspace/adamantine-nightly/tests/test_thermal_physics.cc(38): Entering test case "energy_conservation_host"
46: [0;39;49m[1;34;49m/var/jenkins/workspace/adamantine-nightly/tests/test_thermal_physics.cc(38): Leaving test case "energy_conservation_host"; testing time: 9005082us
46: [0;39;49m[1;34;49m/var/jenkins/workspace/adamantine-nightly/tests/test_thermal_physics.cc(43): Entering test case "radiation_bcs_host"
46: [0;39;49m[1;34;49m/var/jenkins/workspace/adamantine-nightly/tests/test_thermal_physics.cc(38): Leaving test case "energy_conservation_host"; testing time: 9005240us
46: [0;39;49m[1;34;49m/var/jenkins/workspace/adamantine-nightly/tests/test_thermal_physics.cc(43): Entering test case "radiation_bcs_host"
46: [0;39;49m[1;34;49m/var/jenkins/workspace/adamantine-nightly/tests/test_thermal_physics.cc(43): Leaving test case "radiation_bcs_host"; testing time: 4355229us
46: [0;39;49m[1;34;49m/var/jenkins/workspace/adamantine-nightly/tests/test_thermal_physics.cc(48): Entering test case "convection_bcs_host"
46: [0;39;49m[1;34;49m/var/jenkins/workspace/adamantine-nightly/tests/test_thermal_physics.cc(43): Leaving test case "radiation_bcs_host"; testing time: 4355236us
46: [0;39;49m[1;34;49m/var/jenkins/workspace/adamantine-nightly/tests/test_thermal_physics.cc(48): Entering test case "convection_bcs_host"
40: 40% completed
46: [0;39;49m[1;34;49m/var/jenkins/workspace/adamantine-nightly/tests/test_thermal_physics.cc(48): Leaving test case "convection_bcs_host"; testing time: 79310788us
46: [0;39;49m[1;34;49m/var/jenkins/workspace/adamantine-nightly/tests/test_thermal_physics.cc(53): Entering test case "reference_temperature_host"
46: [0;39;49m[1;34;49m/var/jenkins/workspace/adamantine-nightly/tests/test_thermal_physics.cc(48): Leaving test case "convection_bcs_host"; testing time: 79311ms
46: [0;39;49m[1;34;49m/var/jenkins/workspace/adamantine-nightly/tests/test_thermal_physics.cc(53): Entering test case "reference_temperature_host"
46:
46: [1;32;49m*** No errors detected
46: [0;39;49m[0;39;49m[1;34;49m/var/jenkins/workspace/adamantine-nightly/tests/test_thermal_physics.cc(53): Leaving test case "reference_temperature_host"; testing time: 192135us
46: [0;39;49m[1;34;49mLeaving test module "ThermalPhysics"; testing time: 93599637us
46: [0;39;49m[0;39;49m[1;34;49m/var/jenkins/workspace/adamantine-nightly/tests/test_thermal_physics.cc(53): Leaving test case "reference_temperature_host"; testing time: 248774us
46: [0;39;49m[1;34;49mLeaving test module "ThermalPhysics"; testing time: 93688467us
46: [0;39;49m
46: [1;32;49m*** No errors detected
46: [0;39;49m
42/48 Test #46: test_thermal_physics_2 ................... Passed 100.27 sec
test 48
Start 48: test_ensemble_management_2
48: Test command: /usr/bin/mpiexec "-n" "2" "/var/jenkins/workspace/adamantine-nightly/build/bin/test_ensemble_management"
48: Working Directory: /var/jenkins/workspace/adamantine-nightly/build/tests
48: Test timeout computed to be: 7200
48: Running 1 test case...
48: [1;34;49mEntering test module "EnsembleManagement"
48: [0;39;49m[1;34;49m/var/jenkins/workspace/adamantine-nightly/tests/test_ensemble_management.cc(17): Entering test case "database_ensemble"
48: Running 1 test case...
48: [1;34;49mEntering test module "EnsembleManagement"
48: [0;39;49m[1;34;49m/var/jenkins/workspace/adamantine-nightly/tests/test_ensemble_management.cc(17): Entering test case "database_ensemble"
48: [0;39;49m[1;34;49m/var/jenkins/workspace/adamantine-nightly/tests/test_ensemble_management.cc(17): Leaving test case "database_ensemble"; testing time: 24232us
48: [0;39;49m[1;34;49mLeaving test module "EnsembleManagement"; testing time: 24262us
48: [0;39;49m
48: [1;32;49m*** No errors detected
48: [0;39;49m[0;39;49m[1;34;49m/var/jenkins/workspace/adamantine-nightly/tests/test_ensemble_management.cc(17): Leaving test case "database_ensemble"; testing time: 71458us
48: [0;39;49m[1;34;49mLeaving test module "EnsembleManagement"; testing time: 71505us
48: [0;39;49m
48: [1;32;49m*** No errors detected
48: [0;39;49m
43/48 Test #48: test_ensemble_management_2 ............... Passed 7.36 sec
40: 20% completed
40: 50% completed
40: 60% completed
40: 30% completed
40: 70% completed
40: 80% completed
40: 90% completed
40: 40% completed
40: 100% completed
40: [1;34;49m/var/jenkins/workspace/adamantine-nightly/tests/test_integration_thermoelastic.cc(47): Leaving test case "integration_thermoelastic_add_material"; testing time: 834886629us
40: [0;39;49m[1;34;49mLeaving test module "Integration_Thermoelastic"; testing time: 2637419873us
40: [0;39;49m
40: [1;32;49m*** No errors detected
40: [0;39;49m[1;34;49m/var/jenkins/workspace/adamantine-nightly/tests/test_integration_thermoelastic.cc(47): Leaving test case "integration_thermoelastic_add_material"; testing time: 834886502us
40: [0;39;49m[1;34;49mLeaving test module "Integration_Thermoelastic"; testing time: 2637419667us
40: [0;39;49m
40: [1;32;49m*** No errors detected
40: [0;39;49m
44/48 Test #40: test_integration_thermoelastic_2 ......... Passed 2638.15 sec
test 3
Start 3: test_integration_da_3
3: Test command: /usr/bin/mpiexec "-n" "3" "/var/jenkins/workspace/adamantine-nightly/build/bin/test_integration_da"
3: Working Directory: /var/jenkins/workspace/adamantine-nightly/build/tests
3: Test timeout computed to be: 7200
3: Running 3 test cases...
3: [1;34;49mEntering test module "Integration_Data_Assimilation"
3: Running 3 test cases...
3: [0;39;49m[1;34;49m/var/jenkins/workspace/adamantine-nightly/tests/test_integration_da.cc(78): Entering test case "integration_data_assimilation"
3: Running 3 test cases...
3: [1;34;49mEntering test module "Integration_Data_Assimilation"
3: [1;34;49mEntering test module "Integration_Data_Assimilation"
3: [0;39;49m[1;34;49m/var/jenkins/workspace/adamantine-nightly/tests/test_integration_da.cc(78): Entering test case "integration_data_assimilation"
3: [0;39;49m[1;34;49m/var/jenkins/workspace/adamantine-nightly/tests/test_integration_da.cc(78): Entering test case "integration_data_assimilation"
3: [0;39;49mReading the experimental log file...
3: Done. Log entries found for 1 camera(s), with 2 frame(s).
3: Starting the main time stepping loop...
3: 10% completed
3: 20% completed
3: 30% completed
3: 40% completed
3: [0;39;49mRank: 1 | Old parameters for member 1:
3: Rank: 1 | Number expt sites mapped to DOFs: 1
3: [0;39;49mRank: 2 | Old parameters for member 2:
3: Rank: 2 | Number expt sites mapped to DOFs: 1
3: Performing data assimilation at time 0.0211...
3: Rank: 0 | Old parameters for member 0:
3: Rank: 0 | Number expt sites mapped to DOFs: 1
3: Getting the perturbed innovation...
3: Applying the Kalman gain...
3: Updating the ensemble members...
3: Done.
3: 50% completed
3: 60% completed
3: Rank: 1 | Old parameters for member 1:
3: Rank: 2 | Old parameters for member 2:
3: Rank: 1 | Number expt sites mapped to DOFs: 1
3: Performing data assimilation at time 0.0316...
3: Rank: 0 | Old parameters for member 0:
3: Rank: 2 | Number expt sites mapped to DOFs: 1
3: Rank: 0 | Number expt sites mapped to DOFs: 1
3: Getting the perturbed innovation...
3: Applying the Kalman gain...
3: Updating the ensemble members...
3: Done.
3: 70% completed
3: 80% completed
3: 90% completed
3: 100% completed
3: Reading the experimental log file...
3: Done. Log entries found for 1 camera(s), with 2 frame(s).
3: Reading the experimental log file...
3: Done. Log entries found for 1 camera(s), with 2 frame(s).
3: Reading the experimental log file...
3: Done. Log entries found for 1 camera(s), with 2 frame(s).
3: Starting the main time stepping loop...
3: Starting the main time stepping loop...
3: Starting the main time stepping loop...
3: 10% completed
3: 10% completed
3: 10% completed
3: 20% completed
3: 20% completed
3: 20% completed
3: 30% completed
3: 30% completed
3: 30% completed
3: 40% completed
3: 40% completed
3: 40% completed
3: Performing data assimilation at time 0.0211...
3: Rank: 0 | Old parameters for member 0:
3: Rank: 0 | Old parameters for member 1:
3: Rank: 0 | Old parameters for member 2:
3: Rank: 0 | Number expt sites mapped to DOFs: 1
3: Performing data assimilation at time 0.0211...
3: Rank: 0 | Old parameters for member 0:
3: Rank: 0 | Old parameters for member 1:
3: Rank: 0 | Old parameters for member 2:
3: Performing data assimilation at time 0.0211...
3: Rank: 0 | Old parameters for member 0:
3: Rank: 0 | Old parameters for member 1:
3: Rank: 0 | Old parameters for member 2:
3: Rank: 0 | Number expt sites mapped to DOFs: 1
3: Rank: 0 | Number expt sites mapped to DOFs: 1
3: Getting the perturbed innovation...
3: Applying the Kalman gain...
3: Getting the perturbed innovation...
3: Applying the Kalman gain...
3: Getting the perturbed innovation...
3: Applying the Kalman gain...
3: Updating the ensemble members...
3: Done.
3: Updating the ensemble members...
3: Done.
3: Updating the ensemble members...
3: Done.
3: 50% completed
3: 50% completed
3: 50% completed
3: 60% completed
3: 60% completed
3: 60% completed
3: Performing data assimilation at time 0.0316...
3: Rank: 0 | Old parameters for member 0:
3: Rank: 0 | Old parameters for member 1:
3: Rank: 0 | Old parameters for member 2:
3: Performing data assimilation at time 0.0316...
3: Rank: 0 | Old parameters for member 0:
3: Rank: 0 | Old parameters for member 1:
3: Rank: 0 | Old parameters for member 2:
3: Rank: 0 | Number expt sites mapped to DOFs: 1
3: Rank: 0 | Number expt sites mapped to DOFs: 1
3: Performing data assimilation at time 0.0316...
3: Rank: 0 | Old parameters for member 0:
3: Rank: 0 | Old parameters for member 1:
3: Rank: 0 | Old parameters for member 2:
3: Rank: 0 | Number expt sites mapped to DOFs: 1
3: Getting the perturbed innovation...
3: Applying the Kalman gain...
3: Getting the perturbed innovation...
3: Applying the Kalman gain...
3: Getting the perturbed innovation...
3: Applying the Kalman gain...
3: Updating the ensemble members...
3: Done.
3: Updating the ensemble members...
3: Done.
3: Updating the ensemble members...
3: Done.
3: 70% completed
3: 70% completed
3: 70% completed
3: 80% completed
3: 80% completed
3: 80% completed
3: 90% completed
3: 90% completed
3: 90% completed
3: 100% completed
3: 100% completed
3: 100% completed
3: [1;34;49m/var/jenkins/workspace/adamantine-nightly/tests/test_integration_da.cc(78): Leaving test case "integration_data_assimilation"; testing time: 40006389us
3: [0;39;49m[1;34;49m/var/jenkins/workspace/adamantine-nightly/tests/test_integration_da.cc(148): Entering test case "integration_3D_da_point_cloud_add_material"
3: [1;34;49m/var/jenkins/workspace/adamantine-nightly/tests/test_integration_da.cc(78): Leaving test case "integration_data_assimilation"; testing time: 40116774us
3: [0;39;49m[1;34;49m/var/jenkins/workspace/adamantine-nightly/tests/test_integration_da.cc(148): Entering test case "integration_3D_da_point_cloud_add_material"
3: [1;34;49m/var/jenkins/workspace/adamantine-nightly/tests/test_integration_da.cc(78): Leaving test case "integration_data_assimilation"; testing time: 40216320us
3: [0;39;49m[1;34;49m/var/jenkins/workspace/adamantine-nightly/tests/test_integration_da.cc(148): Entering test case "integration_3D_da_point_cloud_add_material"
3: [0;39;49mReading the experimental log file...
3: Done. Log entries found for 1 camera(s), with 1 frame(s).
3: Starting the main time stepping loop...
3: 10% completed
3: 20% completed
3: 30% completed
3: 40% completed
3: 50% completed
3: [0;39;49mRank: 2 | Old parameters for member 2:
3: Rank: 2 | Number expt sites mapped to DOFs: 1
3: Performing data assimilation at time 0.12...
3: Rank: 0 | Old parameters for member 0:
3: [0;39;49mRank: 1 | Old parameters for member 1:
3: Rank: 0 | Number expt sites mapped to DOFs: 1
3: Rank: 1 | Number expt sites mapped to DOFs: 1
3: Getting the perturbed innovation...
3: Applying the Kalman gain...
3: Updating the ensemble members...
3: Done.
3: 60% completed
3: 70% completed
3: 80% completed
3: 90% completed
3: 100% completed
3: Reading the experimental log file...
3: Done. Log entries found for 1 camera(s), with 1 frame(s).
3: Reading the experimental log file...
3: Done. Log entries found for 1 camera(s), with 1 frame(s).
3: Reading the experimental log file...
3: Done. Log entries found for 1 camera(s), with 1 frame(s).
3: Starting the main time stepping loop...
3: Starting the main time stepping loop...
3: Starting the main time stepping loop...
3: 10% completed
3: 10% completed
3: 10% completed
3: 20% completed
3: 20% completed
3: 20% completed
3: 30% completed
3: 30% completed
3: 30% completed
3: 40% completed
3: 40% completed
3: 40% completed
3: 50% completed
3: 50% completed
3: 50% completed
3: Performing data assimilation at time 0.12...
3: Rank: 0 | Old parameters for member 0:
3: Rank: 0 | Old parameters for member 1:
3: Rank: 0 | Old parameters for member 2:
3: Rank: 0 | Number expt sites mapped to DOFs: 1
3: Performing data assimilation at time 0.12...
3: Rank: 0 | Old parameters for member 0:
3: Rank: 0 | Old parameters for member 1:
3: Rank: 0 | Old parameters for member 2:
3: Performing data assimilation at time 0.12...
3: Rank: 0 | Old parameters for member 0:
3: Rank: 0 | Old parameters for member 1:
3: Rank: 0 | Old parameters for member 2:
3: Rank: 0 | Number expt sites mapped to DOFs: 1
3: Rank: 0 | Number expt sites mapped to DOFs: 1
3: Getting the perturbed innovation...
3: Applying the Kalman gain...
3: Getting the perturbed innovation...
3: Applying the Kalman gain...
3: Getting the perturbed innovation...
3: Applying the Kalman gain...
3: Updating the ensemble members...
3: Done.
3: 60% completed
3: Updating the ensemble members...
3: Done.
3: 60% completed
3: Updating the ensemble members...
3: Done.
3: 60% completed
3: 70% completed
3: 70% completed
3: 70% completed
3: 80% completed
3: 80% completed
3: 80% completed
3: 90% completed
3: 90% completed
3: 90% completed
3: 100% completed
3: 100% completed
3: 100% completed
3: [1;34;49m/var/jenkins/workspace/adamantine-nightly/tests/test_integration_da.cc(148): Leaving test case "integration_3D_da_point_cloud_add_material"; testing time: 1819639us
3: [0;39;49m[1;34;49m/var/jenkins/workspace/adamantine-nightly/tests/test_integration_da.cc(231): Entering test case "integration_3D_da_ray_add_material"
3: [1;34;49m/var/jenkins/workspace/adamantine-nightly/tests/test_integration_da.cc(148): Leaving test case "integration_3D_da_point_cloud_add_material"; testing time: 1959459us
3: [0;39;49m[1;34;49m/var/jenkins/workspace/adamantine-nightly/tests/test_integration_da.cc(231): Entering test case "integration_3D_da_ray_add_material"
3: [1;34;49m/var/jenkins/workspace/adamantine-nightly/tests/test_integration_da.cc(148): Leaving test case "integration_3D_da_point_cloud_add_material"; testing time: 1749862us
3: [0;39;49m[1;34;49m/var/jenkins/workspace/adamantine-nightly/tests/test_integration_da.cc(231): Entering test case "integration_3D_da_ray_add_material"
3: [0;39;49mReading the experimental log file...
3: Done. Log entries found for 1 camera(s), with 1 frame(s).
3: Starting the main time stepping loop...
3: 10% completed
3: 20% completed
3: 30% completed
3: 40% completed
3: 50% completed
3: [0;39;49mRank: 2 | Old parameters for member 2:
3: Performing data assimilation at time 0.12...
3: Rank: 0 | Old parameters for member 0:
3: [0;39;49mRank: 1 | Old parameters for member 1:
3: Rank: 2 | Number expt sites mapped to DOFs: 1
3: Rank: 0 | Number expt sites mapped to DOFs: 1
3: Rank: 1 | Number expt sites mapped to DOFs: 1
3: Getting the perturbed innovation...
3: Applying the Kalman gain...
3: Updating the ensemble members...
3: Done.
3: 60% completed
3: 70% completed
3: 80% completed
3: 90% completed
3: 100% completed
3: Reading the experimental log file...
3: Done. Log entries found for 1 camera(s), with 1 frame(s).
3: Reading the experimental log file...
3: Done. Log entries found for 1 camera(s), with 1 frame(s).
3: Reading the experimental log file...
3: Done. Log entries found for 1 camera(s), with 1 frame(s).
3: Starting the main time stepping loop...
3: Starting the main time stepping loop...
3: Starting the main time stepping loop...
3: 10% completed
3: 10% completed
3: 10% completed
3: 20% completed
3: 20% completed
3: 20% completed
3: 30% completed
3: 30% completed
3: 30% completed
3: 40% completed
3: 40% completed
3: 40% completed
3: 50% completed
3: 50% completed
3: 50% completed
3: Performing data assimilation at time 0.12...
3: Rank: 0 | Old parameters for member 0:
3: Rank: 0 | Old parameters for member 1:
3: Rank: 0 | Old parameters for member 2:
3: Performing data assimilation at time 0.12...
3: Rank: 0 | Old parameters for member 0:
3: Rank: 0 | Old parameters for member 1:
3: Rank: 0 | Old parameters for member 2:
3: Performing data assimilation at time 0.12...
3: Rank: 0 | Old parameters for member 0:
3: Rank: 0 | Old parameters for member 1:
3: Rank: 0 | Old parameters for member 2:
3: Rank: 0 | Number expt sites mapped to DOFs: 1
3: Rank: 0 | Number expt sites mapped to DOFs: 1
3: Rank: 0 | Number expt sites mapped to DOFs: 1
3: Getting the perturbed innovation...
3: Applying the Kalman gain...
3: Getting the perturbed innovation...
3: Applying the Kalman gain...
3: Getting the perturbed innovation...
3: Applying the Kalman gain...
3: Updating the ensemble members...
3: Done.
3: 60% completed
3: Updating the ensemble members...
3: Updating the ensemble members...
3: Done.
3: 60% completed
3: Done.
3: 60% completed
3: 70% completed
3: 70% completed
3: 70% completed
3: 80% completed
3: 80% completed
3: 80% completed
3: 90% completed
3: 90% completed
3: 90% completed
3: 100% completed
3: 100% completed
3: 100% completed
3: [1;34;49m/var/jenkins/workspace/adamantine-nightly/tests/test_integration_da.cc(231): Leaving test case "integration_3D_da_ray_add_material"; testing time: 1790719us
3: [0;39;49m[1;34;49mLeaving test module "Integration_Data_Assimilation"; testing time: 43727324us
3: [0;39;49m
3: [1;32;49m*** No errors detected
3: [0;39;49m[1;34;49m/var/jenkins/workspace/adamantine-nightly/tests/test_integration_da.cc(231): Leaving test case "integration_3D_da_ray_add_material"; testing time: 1773737us
3: [0;39;49m[1;34;49mLeaving test module "Integration_Data_Assimilation"; testing time: 43739768us
3: [0;39;49m
3: [1;32;49m*** No errors detected
3: [0;39;49m[1;34;49m/var/jenkins/workspace/adamantine-nightly/tests/test_integration_da.cc(231): Leaving test case "integration_3D_da_ray_add_material"; testing time: 1779902us
3: [0;39;49m[1;34;49mLeaving test module "Integration_Data_Assimilation"; testing time: 43746277us
3: [0;39;49m
3: [1;32;49m*** No errors detected
3: [0;39;49m
45/48 Test #3: test_integration_da_3 .................... Passed 44.41 sec
test 4
Start 4: test_integration_da_6
4: Test command: /usr/bin/mpiexec "-n" "6" "/var/jenkins/workspace/adamantine-nightly/build/bin/test_integration_da"
4: Working Directory: /var/jenkins/workspace/adamantine-nightly/build/tests
4: Test timeout computed to be: 7200
4: Running 3 test cases...
4: Running 3 test cases...
4: [1;34;49mEntering test module "Integration_Data_Assimilation"
4: [0;39;49m[1;34;49m/var/jenkins/workspace/adamantine-nightly/tests/test_integration_da.cc(78): Entering test case "integration_data_assimilation"
4: Running 3 test cases...
4: [1;34;49mEntering test module "Integration_Data_Assimilation"
4: [0;39;49m[1;34;49m/var/jenkins/workspace/adamantine-nightly/tests/test_integration_da.cc(78): Entering test case "integration_data_assimilation"
4: Running 3 test cases...
4: [1;34;49mEntering test module "Integration_Data_Assimilation"
4: [0;39;49m[1;34;49m/var/jenkins/workspace/adamantine-nightly/tests/test_integration_da.cc(78): Entering test case "integration_data_assimilation"
4: [1;34;49mEntering test module "Integration_Data_Assimilation"
4: [0;39;49m[1;34;49m/var/jenkins/workspace/adamantine-nightly/tests/test_integration_da.cc(78): Entering test case "integration_data_assimilation"
4: Running 3 test cases...
4: Running 3 test cases...
4: [1;34;49mEntering test module "Integration_Data_Assimilation"
4: [0;39;49m[1;34;49m/var/jenkins/workspace/adamantine-nightly/tests/test_integration_da.cc(78): Entering test case "integration_data_assimilation"
4: [1;34;49mEntering test module "Integration_Data_Assimilation"
4: [0;39;49m[1;34;49m/var/jenkins/workspace/adamantine-nightly/tests/test_integration_da.cc(78): Entering test case "integration_data_assimilation"
4: [0;39;49mReading the experimental log file...
4: Done. Log entries found for 1 camera(s), with 2 frame(s).
4: Starting the main time stepping loop...
4: 10% completed
4: 20% completed
4: 30% completed
4: 40% completed
4: [0;39;49mRank: 1 | Old parameters for member 0:
4: Performing data assimilation at time 0.0211...
4: Rank: 0 | Old parameters for member 0:
4: [0;39;49mRank: 5 | Old parameters for member 2:
4: [0;39;49mRank: 4 | Old parameters for member 2:
4: [0;39;49mRank: 3 | Old parameters for member 1:
4: [0;39;49mRank: 2 | Old parameters for member 1:
4: Rank: 0 | Number expt sites mapped to DOFs: 1
4: Rank: 1 | Number expt sites mapped to DOFs: 1
4: Rank: 5 | Number expt sites mapped to DOFs: 1
4: Rank: 4 | Number expt sites mapped to DOFs: 1
4: Rank: 2 | Number expt sites mapped to DOFs: 1
4: Rank: 3 | Number expt sites mapped to DOFs: 1
4: Getting the perturbed innovation...
4: Applying the Kalman gain...
4: Updating the ensemble members...
4: Done.
4: 50% completed
4: 60% completed
4: Performing data assimilation at time 0.0316...
4: Rank: 0 | Old parameters for member 0:
4: Rank: 1 | Old parameters for member 0:
4: Rank: 3 | Old parameters for member 1:
4: Rank: 2 | Old parameters for member 1:
4: Rank: 4 | Old parameters for member 2:
4: Rank: 5 | Old parameters for member 2:
4: Rank: 2 | Number expt sites mapped to DOFs: 1
4: Rank: 3 | Number expt sites mapped to DOFs: 1
4: Rank: 0 | Number expt sites mapped to DOFs: 1
4: Rank: 1 | Number expt sites mapped to DOFs: 1
4: Rank: 5 | Number expt sites mapped to DOFs: 1
4: Rank: 4 | Number expt sites mapped to DOFs: 1
4: Getting the perturbed innovation...
4: Applying the Kalman gain...
4: Updating the ensemble members...
4: Done.
4: 70% completed
4: 80% completed
4: 90% completed
4: 100% completed
4: Reading the experimental log file...
4: Done. Log entries found for 1 camera(s), with 2 frame(s).
4: Reading the experimental log file...
4: Done. Log entries found for 1 camera(s), with 2 frame(s).
4: Reading the experimental log file...
4: Done. Log entries found for 1 camera(s), with 2 frame(s).
4: Reading the experimental log file...
4: Done. Log entries found for 1 camera(s), with 2 frame(s).
4: Reading the experimental log file...
4: Done. Log entries found for 1 camera(s), with 2 frame(s).
4: Reading the experimental log file...
4: Done. Log entries found for 1 camera(s), with 2 frame(s).
4: Starting the main time stepping loop...
4: Starting the main time stepping loop...
4: Starting the main time stepping loop...
4: Starting the main time stepping loop...
4: Starting the main time stepping loop...
4: Starting the main time stepping loop...
4: 10% completed
4: 10% completed
4: 10% completed
4: 10% completed
4: 10% completed
4: 10% completed
4: 20% completed
4: 20% completed
4: 20% completed
4: 20% completed
4: 20% completed
4: 20% completed
4: 30% completed
4: 30% completed
4: 30% completed
4: 30% completed
4: 30% completed
4: 30% completed
4: 40% completed
4: 40% completed
4: 40% completed
4: 40% completed
4: 40% completed
4: 40% completed
4: Performing data assimilation at time 0.0211...
4: Rank: 0 | Old parameters for member 0:
4: Rank: 0 | Old parameters for member 1:
4: Rank: 0 | Old parameters for member 2:
4: Rank: 0 | Number expt sites mapped to DOFs: 1
4: Performing data assimilation at time 0.0211...
4: Rank: 0 | Old parameters for member 0:
4: Rank: 0 | Old parameters for member 1:
4: Rank: 0 | Old parameters for member 2:
4: Performing data assimilation at time 0.0211...
4: Rank: 0 | Old parameters for member 0:
4: Rank: 0 | Old parameters for member 1:
4: Performing data assimilation at time 0.0211...
4: Rank: 0 | Old parameters for member 0:
4: Rank: 0 | Old parameters for member 1:
4: Rank: 0 | Old parameters for member 2:
4: Rank: 0 | Old parameters for member 2:
4: Performing data assimilation at time 0.0211...
4: Rank: 0 | Old parameters for member 0:
4: Rank: 0 | Old parameters for member 1:
4: Rank: 0 | Old parameters for member 2:
4: Rank: 0 | Number expt sites mapped to DOFs: 1
4: Rank: 0 | Number expt sites mapped to DOFs: 1
4: Rank: 0 | Number expt sites mapped to DOFs: 1
4: Rank: 0 | Number expt sites mapped to DOFs: 1
4: Performing data assimilation at time 0.0211...
4: Rank: 0 | Old parameters for member 0:
4: Rank: 0 | Old parameters for member 1:
4: Rank: 0 | Old parameters for member 2:
4: Rank: 0 | Number expt sites mapped to DOFs: 1
4: Getting the perturbed innovation...
4: Applying the Kalman gain...
4: Getting the perturbed innovation...
4: Applying the Kalman gain...
4: Getting the perturbed innovation...
4: Applying the Kalman gain...
4: Getting the perturbed innovation...
4: Applying the Kalman gain...
4: Getting the perturbed innovation...
4: Applying the Kalman gain...
4: Getting the perturbed innovation...
4: Applying the Kalman gain...
4: Updating the ensemble members...
4: Done.
4: Updating the ensemble members...
4: Done.
4: Updating the ensemble members...
4: Updating the ensemble members...
4: Done.
4: Done.
4: Updating the ensemble members...
4: Done.
4: Updating the ensemble members...
4: Done.
4: 50% completed
4: 50% completed
4: 50% completed
4: 50% completed
4: 50% completed
4: 50% completed
4: 60% completed
4: 60% completed
4: 60% completed
4: 60% completed
4: 60% completed
4: 60% completed
4: Performing data assimilation at time 0.0316...
4: Rank: 0 | Old parameters for member 0:
4: Rank: 0 | Old parameters for member 1:
4: Rank: 0 | Old parameters for member 2:
4: Rank: 0 | Number expt sites mapped to DOFs: 1
4: Performing data assimilation at time 0.0316...
4: Rank: 0 | Old parameters for member 0:
4: Rank: 0 | Old parameters for member 1:
4: Rank: 0 | Old parameters for member 2:
4: Performing data assimilation at time 0.0316...
4: Rank: 0 | Old parameters for member 0:
4: Rank: 0 | Old parameters for member 1:
4: Rank: 0 | Old parameters for member 2:
4: Rank: 0 | Number expt sites mapped to DOFs: 1
4: Rank: 0 | Number expt sites mapped to DOFs: 1
4: Performing data assimilation at time 0.0316...
4: Rank: 0 | Old parameters for member 0:
4: Rank: 0 | Old parameters for member 1:
4: Rank: 0 | Old parameters for member 2:
4: Rank: 0 | Number expt sites mapped to DOFs: 1
4: Performing data assimilation at time 0.0316...
4: Rank: 0 | Old parameters for member 0:
4: Rank: 0 | Old parameters for member 1:
4: Rank: 0 | Old parameters for member 2:
4: Rank: 0 | Number expt sites mapped to DOFs: 1
4: Performing data assimilation at time 0.0316...
4: Rank: 0 | Old parameters for member 0:
4: Rank: 0 | Old parameters for member 1:
4: Rank: 0 | Old parameters for member 2:
4: Rank: 0 | Number expt sites mapped to DOFs: 1
4: Getting the perturbed innovation...
4: Applying the Kalman gain...
4: Getting the perturbed innovation...
4: Applying the Kalman gain...
4: Getting the perturbed innovation...
4: Applying the Kalman gain...
4: Getting the perturbed innovation...
4: Applying the Kalman gain...
4: Getting the perturbed innovation...
4: Applying the Kalman gain...
4: Getting the perturbed innovation...
4: Applying the Kalman gain...
4: Updating the ensemble members...
4: Done.
4: Updating the ensemble members...
4: Updating the ensemble members...
4: Done.
4: Done.
4: Updating the ensemble members...
4: Done.
4: Updating the ensemble members...
4: Done.
4: Updating the ensemble members...
4: Done.
4: 70% completed
4: 70% completed
4: 70% completed
4: 70% completed
4: 70% completed
4: 70% completed
4: 80% completed
4: 80% completed
4: 80% completed
4: 80% completed
4: 80% completed
4: 80% completed
4: 90% completed
4: 90% completed
4: 90% completed
4: 90% completed
4: 90% completed
4: 90% completed
4: 100% completed
4: 100% completed
4: 100% completed
4: 100% completed
4: 100% completed
4: [1;34;49m/var/jenkins/workspace/adamantine-nightly/tests/test_integration_da.cc(78): Leaving test case "integration_data_assimilation"; testing time: 36935432us
4: [0;39;49m[1;34;49m/var/jenkins/workspace/adamantine-nightly/tests/test_integration_da.cc(148): Entering test case "integration_3D_da_point_cloud_add_material"
4: [1;34;49m/var/jenkins/workspace/adamantine-nightly/tests/test_integration_da.cc(78): Leaving test case "integration_data_assimilation"; testing time: 36980693us
4: [0;39;49m[1;34;49m/var/jenkins/workspace/adamantine-nightly/tests/test_integration_da.cc(148): Entering test case "integration_3D_da_point_cloud_add_material"
4: [1;34;49m/var/jenkins/workspace/adamantine-nightly/tests/test_integration_da.cc(78): Leaving test case "integration_data_assimilation"; testing time: 37002146us
4: [0;39;49m[1;34;49m/var/jenkins/workspace/adamantine-nightly/tests/test_integration_da.cc(148): Entering test case "integration_3D_da_point_cloud_add_material"
4: 100% completed
4: [1;34;49m/var/jenkins/workspace/adamantine-nightly/tests/test_integration_da.cc(78): Leaving test case "integration_data_assimilation"; testing time: 37050043us
4: [0;39;49m[1;34;49m/var/jenkins/workspace/adamantine-nightly/tests/test_integration_da.cc(148): Entering test case "integration_3D_da_point_cloud_add_material"
4: [1;34;49m/var/jenkins/workspace/adamantine-nightly/tests/test_integration_da.cc(78): Leaving test case "integration_data_assimilation"; testing time: 37090794us
4: [0;39;49m[1;34;49m/var/jenkins/workspace/adamantine-nightly/tests/test_integration_da.cc(148): Entering test case "integration_3D_da_point_cloud_add_material"
4: [1;34;49m/var/jenkins/workspace/adamantine-nightly/tests/test_integration_da.cc(78): Leaving test case "integration_data_assimilation"; testing time: 37202949us
4: [0;39;49m[1;34;49m/var/jenkins/workspace/adamantine-nightly/tests/test_integration_da.cc(148): Entering test case "integration_3D_da_point_cloud_add_material"
4: [0;39;49mReading the experimental log file...
4: Done. Log entries found for 1 camera(s), with 1 frame(s).
4: Starting the main time stepping loop...
4: 10% completed
4: 20% completed
4: 30% completed
4: 40% completed
4: 50% completed
4: [0;39;49mRank: 4 | Old parameters for member 2:
4: [0;39;49mRank: 5 | Old parameters for member 2:
4: [0;39;49mRank: 2 | Old parameters for member 1:
4: [0;39;49mRank: 3 | Old parameters for member 1:
4: Rank: 2 | Number expt sites mapped to DOFs: 1
4: Rank: 4 | Number expt sites mapped to DOFs: 1
4: Rank: 5 | Number expt sites mapped to DOFs: 1
4: Rank: 3 | Number expt sites mapped to DOFs: 1
4: Performing data assimilation at time 0.12...
4: Rank: 0 | Old parameters for member 0:
4: [0;39;49mRank: 1 | Old parameters for member 0:
4: Rank: 1 | Number expt sites mapped to DOFs: 1
4: Rank: 0 | Number expt sites mapped to DOFs: 1
4: Getting the perturbed innovation...
4: Applying the Kalman gain...
4: Updating the ensemble members...
4: Done.
4: 60% completed
4: 70% completed
4: 80% completed
4: 90% completed
4: 100% completed
4: Reading the experimental log file...
4: Done. Log entries found for 1 camera(s), with 1 frame(s).
4: Reading the experimental log file...
4: Done. Log entries found for 1 camera(s), with 1 frame(s).
4: Reading the experimental log file...
4: Done. Log entries found for 1 camera(s), with 1 frame(s).
4: Reading the experimental log file...
4: Done. Log entries found for 1 camera(s), with 1 frame(s).
4: Reading the experimental log file...
4: Done. Log entries found for 1 camera(s), with 1 frame(s).
4: Reading the experimental log file...
4: Done. Log entries found for 1 camera(s), with 1 frame(s).
4: Starting the main time stepping loop...
4: Starting the main time stepping loop...
4: Starting the main time stepping loop...
4: Starting the main time stepping loop...
4: Starting the main time stepping loop...
4: Starting the main time stepping loop...
4: 10% completed
4: 10% completed
4: 10% completed
4: 10% completed
4: 10% completed
4: 10% completed
4: 20% completed
4: 20% completed
4: 20% completed
4: 20% completed
4: 20% completed
4: 30% completed
4: 20% completed
4: 30% completed
4: 30% completed
4: 30% completed
4: 30% completed
4: 40% completed
4: 30% completed
4: 40% completed
4: 40% completed
4: 40% completed
4: 50% completed
4: 40% completed
4: 40% completed
4: 50% completed
4: 50% completed
4: 50% completed
4: Performing data assimilation at time 0.12...
4: Rank: 0 | Old parameters for member 0:
4: Rank: 0 | Old parameters for member 1:
4: Rank: 0 | Old parameters for member 2:
4: Rank: 0 | Number expt sites mapped to DOFs: 1
4: 50% completed
4: 50% completed
4: Performing data assimilation at time 0.12...
4: Performing data assimilation at time 0.12...
4: Rank: 0 | Old parameters for member 0:
4: Rank: 0 | Old parameters for member 1:
4: Rank: 0 | Old parameters for member 2:
4: Rank: 0 | Old parameters for member 0:
4: Rank: 0 | Old parameters for member 1:
4: Rank: 0 | Old parameters for member 2:
4: Rank: 0 | Number expt sites mapped to DOFs: 1
4: Rank: 0 | Number expt sites mapped to DOFs: 1
4: Performing data assimilation at time 0.12...
4: Rank: 0 | Old parameters for member 0:
4: Rank: 0 | Old parameters for member 1:
4: Rank: 0 | Old parameters for member 2:
4: Rank: 0 | Number expt sites mapped to DOFs: 1
4: Performing data assimilation at time 0.12...
4: Rank: 0 | Old parameters for member 0:
4: Rank: 0 | Old parameters for member 1:
4: Rank: 0 | Old parameters for member 2:
4: Performing data assimilation at time 0.12...
4: Rank: 0 | Old parameters for member 0:
4: Rank: 0 | Old parameters for member 1:
4: Rank: 0 | Old parameters for member 2:
4: Rank: 0 | Number expt sites mapped to DOFs: 1
4: Rank: 0 | Number expt sites mapped to DOFs: 1
4: Getting the perturbed innovation...
4: Applying the Kalman gain...
4: Getting the perturbed innovation...
4: Applying the Kalman gain...
4: Getting the perturbed innovation...
4: Applying the Kalman gain...
4: Getting the perturbed innovation...
4: Applying the Kalman gain...
4: Getting the perturbed innovation...
4: Applying the Kalman gain...
4: Getting the perturbed innovation...
4: Applying the Kalman gain...
4: Updating the ensemble members...
4: Done.
4: 60% completed
4: Updating the ensemble members...
4: Done.
4: 60% completed
4: Updating the ensemble members...
4: Done.
4: 60% completed
4: Updating the ensemble members...
4: Done.
4: 60% completed
4: 70% completed
4: Updating the ensemble members...
4: Done.
4: 60% completed
4: Updating the ensemble members...
4: Done.
4: 60% completed
4: 70% completed
4: 70% completed
4: 70% completed
4: 80% completed
4: 70% completed
4: 70% completed
4: 80% completed
4: 90% completed
4: 80% completed
4: 80% completed
4: 80% completed
4: 80% completed
4: 90% completed
4: 90% completed
4: 90% completed
4: 90% completed
4: 90% completed
4: 100% completed
4: 100% completed
4: [1;34;49m/var/jenkins/workspace/adamantine-nightly/tests/test_integration_da.cc(148): Leaving test case "integration_3D_da_point_cloud_add_material"; testing time: 1941457us
4: [0;39;49m[1;34;49m/var/jenkins/workspace/adamantine-nightly/tests/test_integration_da.cc(231): Entering test case "integration_3D_da_ray_add_material"
4: 100% completed
4: 100% completed
4: 100% completed
4: 100% completed
4: [1;34;49m/var/jenkins/workspace/adamantine-nightly/tests/test_integration_da.cc(148): Leaving test case "integration_3D_da_point_cloud_add_material"; testing time: 1919904us
4: [0;39;49m[1;34;49m/var/jenkins/workspace/adamantine-nightly/tests/test_integration_da.cc(231): Entering test case "integration_3D_da_ray_add_material"
4: [1;34;49m/var/jenkins/workspace/adamantine-nightly/tests/test_integration_da.cc(148): Leaving test case "integration_3D_da_point_cloud_add_material"; testing time: 1865875us
4: [0;39;49m[1;34;49m/var/jenkins/workspace/adamantine-nightly/tests/test_integration_da.cc(231): Entering test case "integration_3D_da_ray_add_material"
4: [1;34;49m/var/jenkins/workspace/adamantine-nightly/tests/test_integration_da.cc(148): Leaving test case "integration_3D_da_point_cloud_add_material"; testing time: 1924739us
4: [0;39;49m[1;34;49m/var/jenkins/workspace/adamantine-nightly/tests/test_integration_da.cc(231): Entering test case "integration_3D_da_ray_add_material"
4: [1;34;49m/var/jenkins/workspace/adamantine-nightly/tests/test_integration_da.cc(148): Leaving test case "integration_3D_da_point_cloud_add_material"; testing time: 1724017us
4: [0;39;49m[1;34;49m/var/jenkins/workspace/adamantine-nightly/tests/test_integration_da.cc(231): Entering test case "integration_3D_da_ray_add_material"
4: [1;34;49m/var/jenkins/workspace/adamantine-nightly/tests/test_integration_da.cc(148): Leaving test case "integration_3D_da_point_cloud_add_material"; testing time: 1840389us
4: [0;39;49m[1;34;49m/var/jenkins/workspace/adamantine-nightly/tests/test_integration_da.cc(231): Entering test case "integration_3D_da_ray_add_material"
4: [0;39;49mReading the experimental log file...
4: Done. Log entries found for 1 camera(s), with 1 frame(s).
4: Starting the main time stepping loop...
4: 10% completed
4: 20% completed
4: 30% completed
4: 40% completed
4: 50% completed
4: Performing data assimilation at time 0.12...
4: [0;39;49mRank: 1 | Old parameters for member 0:
4: Rank: 0 | Old parameters for member 0:
4: Rank: 1 | Number expt sites mapped to DOFs: 1
4: Rank: 0 | Number expt sites mapped to DOFs: 1
4: [0;39;49mRank: 4 | Old parameters for member 2:
4: [0;39;49mRank: 5 | Old parameters for member 2:
4: [0;39;49mRank: 3 | Old parameters for member 1:
4: [0;39;49mRank: 2 | Old parameters for member 1:
4: Rank: 4 | Number expt sites mapped to DOFs: 1
4: Rank: 5 | Number expt sites mapped to DOFs: 1
4: Rank: 2 | Number expt sites mapped to DOFs: 1
4: Rank: 3 | Number expt sites mapped to DOFs: 1
4: Getting the perturbed innovation...
4: Applying the Kalman gain...
4: Updating the ensemble members...
4: Done.
4: 60% completed
4: 70% completed
4: 80% completed
4: 90% completed
4: 100% completed
4: Reading the experimental log file...
4: Reading the experimental log file...
4: Done. Log entries found for 1 camera(s), with 1 frame(s).
4: Done. Log entries found for 1 camera(s), with 1 frame(s).
4: Reading the experimental log file...
4: Done. Log entries found for 1 camera(s), with 1 frame(s).
4: Reading the experimental log file...
4: Done. Log entries found for 1 camera(s), with 1 frame(s).
4: Reading the experimental log file...
4: Done. Log entries found for 1 camera(s), with 1 frame(s).
4: Reading the experimental log file...
4: Done. Log entries found for 1 camera(s), with 1 frame(s).
4: Starting the main time stepping loop...
4: Starting the main time stepping loop...
4: Starting the main time stepping loop...
4: Starting the main time stepping loop...
4: Starting the main time stepping loop...
4: Starting the main time stepping loop...
4: 10% completed
4: 10% completed
4: 10% completed
4: 10% completed
4: 10% completed
4: 10% completed
4: 20% completed
4: 20% completed
4: 20% completed
4: 20% completed
4: 20% completed
4: 20% completed
4: 30% completed
4: 40% completed
4: 30% completed
4: 30% completed
4: 30% completed
4: 30% completed
4: 30% completed
4: 50% completed
4: 40% completed
4: 40% completed
4: 40% completed
4: 40% completed
4: 40% completed
4: Performing data assimilation at time 0.12...
4: Rank: 0 | Old parameters for member 0:
4: Rank: 0 | Old parameters for member 1:
4: Rank: 0 | Old parameters for member 2:
4: Rank: 0 | Number expt sites mapped to DOFs: 1
4: 50% completed
4: Performing data assimilation at time 0.12...
4: Rank: 0 | Old parameters for member 0:
4: Rank: 0 | Old parameters for member 1:
4: Rank: 0 | Old parameters for member 2:
4: 50% completed
4: 50% completed
4: 50% completed
4: 50% completed
4: Rank: 0 | Number expt sites mapped to DOFs: 1
4: Performing data assimilation at time 0.12...
4: Performing data assimilation at time 0.12...
4: Rank: 0 | Old parameters for member 0:
4: Rank: 0 | Old parameters for member 1:
4: Rank: 0 | Old parameters for member 2:
4: Rank: 0 | Old parameters for member 0:
4: Rank: 0 | Old parameters for member 1:
4: Performing data assimilation at time 0.12...
4: Rank: 0 | Old parameters for member 0:
4: Rank: 0 | Old parameters for member 2:
4: Rank: 0 | Old parameters for member 1:
4: Rank: 0 | Old parameters for member 2:
4: Performing data assimilation at time 0.12...
4: Rank: 0 | Old parameters for member 0:
4: Rank: 0 | Old parameters for member 1:
4: Rank: 0 | Old parameters for member 2:
4: Rank: 0 | Number expt sites mapped to DOFs: 1
4: Rank: 0 | Number expt sites mapped to DOFs: 1
4: Rank: 0 | Number expt sites mapped to DOFs: 1
4: Rank: 0 | Number expt sites mapped to DOFs: 1
4: Getting the perturbed innovation...
4: Applying the Kalman gain...
4: Getting the perturbed innovation...
4: Applying the Kalman gain...
4: Getting the perturbed innovation...
4: Applying the Kalman gain...
4: Getting the perturbed innovation...
4: Getting the perturbed innovation...
4: Applying the Kalman gain...
4: Applying the Kalman gain...
4: Getting the perturbed innovation...
4: Applying the Kalman gain...
4: Updating the ensemble members...
4: Done.
4: 60% completed
4: 70% completed
4: Updating the ensemble members...
4: Done.
4: 60% completed
4: 80% completed
4: 70% completed
4: Updating the ensemble members...
4: Updating the ensemble members...
4: Updating the ensemble members...
4: Done.
4: 60% completed
4: Done.
4: Done.
4: 60% completed
4: 60% completed
4: Updating the ensemble members...
4: 90% completed
4: Done.
4: 60% completed
4: 80% completed
4: 70% completed
4: 70% completed
4: 70% completed
4: 70% completed
4: 90% completed
4: 80% completed
4: 80% completed
4: 80% completed
4: 80% completed
4: 90% completed
4: 90% completed
4: 90% completed
4: 90% completed
4: 100% completed
4: 100% completed
4:
4: [1;32;49m*** No errors detected
4: [0;39;49m[1;34;49m/var/jenkins/workspace/adamantine-nightly/tests/test_integration_da.cc(231): Leaving test case "integration_3D_da_ray_add_material"; testing time: 1700173us
4: [0;39;49m[1;34;49mLeaving test module "Integration_Data_Assimilation"; testing time: 40631652us
4: [0;39;49m[1;34;49m/var/jenkins/workspace/adamantine-nightly/tests/test_integration_da.cc(231): Leaving test case "integration_3D_da_ray_add_material"; testing time: 1774337us
4: [0;39;49m[1;34;49mLeaving test module "Integration_Data_Assimilation"; testing time: 40651427us
4: [0;39;49m
4: [1;32;49m*** No errors detected
4: [0;39;49m100% completed
4: 100% completed
4: 100% completed
4: 100% completed
4: [1;34;49m/var/jenkins/workspace/adamantine-nightly/tests/test_integration_da.cc(231): Leaving test case "integration_3D_da_ray_add_material"; testing time: 1812077us
4: [0;39;49m[1;34;49mLeaving test module "Integration_Data_Assimilation"; testing time: 40712916us
4: [0;39;49m
4: [1;32;49m*** No errors detected
4: [0;39;49m[1;34;49m/var/jenkins/workspace/adamantine-nightly/tests/test_integration_da.cc(231): Leaving test case "integration_3D_da_ray_add_material"; testing time: 1802234us
4: [0;39;49m[1;34;49mLeaving test module "Integration_Data_Assimilation"; testing time: 40729343us
4: [0;39;49m
4: [1;32;49m*** No errors detected
4: [0;39;49m[1;34;49m/var/jenkins/workspace/adamantine-nightly/tests/test_integration_da.cc(231): Leaving test case "integration_3D_da_ray_add_material"; testing time: 1815058us
4: [0;39;49m[1;34;49mLeaving test module "Integration_Data_Assimilation"; testing time: 40731266us
4: [0;39;49m
4: [1;32;49m*** No errors detected
4: [0;39;49m[1;34;49m/var/jenkins/workspace/adamantine-nightly/tests/test_integration_da.cc(231): Leaving test case "integration_3D_da_ray_add_material"; testing time: 1808184us
4: [0;39;49m[1;34;49mLeaving test module "Integration_Data_Assimilation"; testing time: 40735404us
4: [0;39;49m
4: [1;32;49m*** No errors detected
4: [0;39;49m
46/48 Test #4: test_integration_da_6 .................... Passed 41.46 sec
test 7
Start 7: test_closest_source_point_adaptation_3
7: Test command: /usr/bin/mpiexec "-n" "3" "/var/jenkins/workspace/adamantine-nightly/build/bin/test_closest_source_point_adaptation"
7: Working Directory: /var/jenkins/workspace/adamantine-nightly/build/tests
7: Test timeout computed to be: 7200
7: Running 1 test case...
7: Running 1 test case...
7: [1;34;49mEntering test module "ClosestSourcePointAdaptation"
7: [0;39;49m[1;34;49m/var/jenkins/workspace/adamantine-nightly/tests/test_closest_source_point_adaptation.cc(123): Entering test case "closest_source_point_adaptation"
7: [1;34;49mEntering test module "ClosestSourcePointAdaptation"
7: [0;39;49m[1;34;49m/var/jenkins/workspace/adamantine-nightly/tests/test_closest_source_point_adaptation.cc(123): Entering test case "closest_source_point_adaptation"
7: Running 1 test case...
7: [1;34;49mEntering test module "ClosestSourcePointAdaptation"
7: [0;39;49m[1;34;49m/var/jenkins/workspace/adamantine-nightly/tests/test_closest_source_point_adaptation.cc(123): Entering test case "closest_source_point_adaptation"
7:
7: [1;32;49m*** No errors detected
7: [0;39;49m
7: [1;32;49m*** No errors detected
7: [0;39;49m[0;39;49m[1;34;49m/var/jenkins/workspace/adamantine-nightly/tests/test_closest_source_point_adaptation.cc(123): Leaving test case "closest_source_point_adaptation"; testing time: 5717163us
7: [0;39;49m[1;34;49mLeaving test module "ClosestSourcePointAdaptation"; testing time: 5717225us
7: [0;39;49m[0;39;49m[1;34;49m/var/jenkins/workspace/adamantine-nightly/tests/test_closest_source_point_adaptation.cc(123): Leaving test case "closest_source_point_adaptation"; testing time: 5717276us
7: [0;39;49m[1;34;49mLeaving test module "ClosestSourcePointAdaptation"; testing time: 5717344us
7: [0;39;49m[0;39;49m[1;34;49m/var/jenkins/workspace/adamantine-nightly/tests/test_closest_source_point_adaptation.cc(123): Leaving test case "closest_source_point_adaptation"; testing time: 5717539us
7: [0;39;49m[1;34;49mLeaving test module "ClosestSourcePointAdaptation"; testing time: 5717636us
7: [0;39;49m
7: [1;32;49m*** No errors detected
7: [0;39;49m
47/48 Test #7: test_closest_source_point_adaptation_3 ... Passed 6.36 sec
test 8
Start 8: test_closest_source_point_adaptation_6
8: Test command: /usr/bin/mpiexec "-n" "6" "/var/jenkins/workspace/adamantine-nightly/build/bin/test_closest_source_point_adaptation"
8: Working Directory: /var/jenkins/workspace/adamantine-nightly/build/tests
8: Test timeout computed to be: 7200
8: Running 1 test case...
8: [1;34;49mEntering test module "ClosestSourcePointAdaptation"
8: Running 1 test case...
8: [0;39;49m[1;34;49m/var/jenkins/workspace/adamantine-nightly/tests/test_closest_source_point_adaptation.cc(123): Entering test case "closest_source_point_adaptation"
8: Running 1 test case...
8: [1;34;49mEntering test module "ClosestSourcePointAdaptation"
8: [0;39;49m[1;34;49m/var/jenkins/workspace/adamantine-nightly/tests/test_closest_source_point_adaptation.cc(123): Entering test case "closest_source_point_adaptation"
8: [1;34;49mEntering test module "ClosestSourcePointAdaptation"
8: [0;39;49m[1;34;49m/var/jenkins/workspace/adamantine-nightly/tests/test_closest_source_point_adaptation.cc(123): Entering test case "closest_source_point_adaptation"
8: Running 1 test case...
8: Running 1 test case...
8: Running 1 test case...
8: [1;34;49mEntering test module "ClosestSourcePointAdaptation"
8: [1;34;49mEntering test module "ClosestSourcePointAdaptation"
8: [1;34;49mEntering test module "ClosestSourcePointAdaptation"
8: [0;39;49m[1;34;49m/var/jenkins/workspace/adamantine-nightly/tests/test_closest_source_point_adaptation.cc(123): Entering test case "closest_source_point_adaptation"
8: [0;39;49m[1;34;49m/var/jenkins/workspace/adamantine-nightly/tests/test_closest_source_point_adaptation.cc(123): Entering test case "closest_source_point_adaptation"
8: [0;39;49m[1;34;49m/var/jenkins/workspace/adamantine-nightly/tests/test_closest_source_point_adaptation.cc(123): Entering test case "closest_source_point_adaptation"
8:
8: [1;32;49m*** No errors detected
8: [0;39;49m[0;39;49m[1;34;49m/var/jenkins/workspace/adamantine-nightly/tests/test_closest_source_point_adaptation.cc(123): Leaving test case "closest_source_point_adaptation"; testing time: 3589653us
8: [0;39;49m[1;34;49mLeaving test module "ClosestSourcePointAdaptation"; testing time: 3589710us
8: [0;39;49m[0;39;49m[1;34;49m/var/jenkins/workspace/adamantine-nightly/tests/test_closest_source_point_adaptation.cc(123): Leaving test case "closest_source_point_adaptation"; testing time: 3589973us
8: [0;39;49m[1;34;49mLeaving test module "ClosestSourcePointAdaptation"; testing time: 3590038us
8: [0;39;49m[0;39;49m[1;34;49m/var/jenkins/workspace/adamantine-nightly/tests/test_closest_source_point_adaptation.cc(123): Leaving test case "closest_source_point_adaptation"; testing time: 3590063us
8: [0;39;49m[1;34;49m/var/jenkins/workspace/adamantine-nightly/tests/test_closest_source_point_adaptation.cc(123): Leaving test case "closest_source_point_adaptation"; testing time: 3590026us
8: [0;39;49m[1;34;49mLeaving test module "ClosestSourcePointAdaptation"; testing time: 3590087us
8: [0;39;49m
8: [1;32;49m*** No errors detected
8: [0;39;49m
8: [1;32;49m*** No errors detected
8: [0;39;49m[0;39;49m[1;34;49mLeaving test module "ClosestSourcePointAdaptation"; testing time: 3590114us
8: [0;39;49m
8: [1;32;49m*** No errors detected
8: [0;39;49m[0;39;49m[1;34;49m/var/jenkins/workspace/adamantine-nightly/tests/test_closest_source_point_adaptation.cc(123): Leaving test case "closest_source_point_adaptation"; testing time: 3590419us
8: [0;39;49m[1;34;49mLeaving test module "ClosestSourcePointAdaptation"; testing time: 3590499us
8: [0;39;49m
8: [1;32;49m*** No errors detected
8: [0;39;49m[0;39;49m[1;34;49m/var/jenkins/workspace/adamantine-nightly/tests/test_closest_source_point_adaptation.cc(123): Leaving test case "closest_source_point_adaptation"; testing time: 3590557us
8: [0;39;49m[1;34;49mLeaving test module "ClosestSourcePointAdaptation"; testing time: 3590634us
8: [0;39;49m
8: [1;32;49m*** No errors detected
8: [0;39;49m
48/48 Test #8: test_closest_source_point_adaptation_6 ... Passed 4.32 sec
The following tests passed:
test_closest_source_point_adaptation_1
test_data_assimilator_1
test_experimental_data_1
test_geometry_1
test_heat_source_1
test_integration_da_2
test_closest_source_point_adaptation_2
test_material_property_1
test_material_property_device_1
test_integration_da_1
test_post_processor_1
test_quaternion_1
test_scan_path_1
test_thermal_operator_1
test_thermal_operator_device_1
test_mechanical_operator_1
test_timer_1
test_utils_1
test_validate_input_database_1
test_integration_2d_1
test_integration_2d_device_1
test_thermal_physics_device_1
test_mechanical_physics_1
test_integration_3d_amr_1
test_integration_3d_amr_device_1
test_integration_da_augmented_1
test_material_deposition_1
test_microstructure_1
test_thermal_physics_1
test_ensemble_management_1
test_integration_3d_device_1
test_integration_2d_2
test_integration_2d_device_2
test_integration_3d_amr_2
test_integration_3d_amr_device_2
test_integration_da_augmented_2
test_material_deposition_2
test_microstructure_2
test_thermal_physics_2
test_ensemble_management_2
test_integration_thermoelastic_2
test_integration_da_3
test_integration_da_6
test_closest_source_point_adaptation_3
test_closest_source_point_adaptation_6
94% tests passed, 3 tests failed out of 48
Total Test time (real) = 10901.23 sec
The following tests FAILED:
31 - test_integration_3d_1 (Timeout)
32 - test_integration_3d_2 (Timeout)
39 - test_integration_thermoelastic_1 (Timeout)
Errors while running CTest
Output from these tests are in: /var/jenkins/workspace/adamantine-nightly/build/Testing/Temporary/LastTest.log
Use "--rerun-failed --output-on-failure" to re-run the failed cases verbosely.
[Pipeline] }
[Pipeline] // dir
Post stage
[Pipeline] xunit
INFO: Processing CTest-Version 3.x (default)
[Pipeline] }
[Pipeline] // withEnv
[Pipeline] }
$ docker stop --time=1 e7fddd65308e083c100fa7aa7c4dad802907a9448c098386a35ac54bd6c62fb7
INFO: [CTest-Version 3.x (default)] - 1 test report file(s) were found with the pattern 'build/Testing/**/Test.xml' relative to '/var/jenkins/workspace/adamantine-nightly' for the testing framework 'CTest-Version 3.x (default)'.
$ docker rm -f --volumes e7fddd65308e083c100fa7aa7c4dad802907a9448c098386a35ac54bd6c62fb7
[Pipeline] // withDockerContainer
[Pipeline] }
[Pipeline] // withEnv
[Pipeline] }
[Pipeline] // node
[Pipeline] }
[Pipeline] // stage
[Pipeline] }
Failed in branch CPU
40: 50% completed
40: 60% completed
40: 70% completed
40: 80% completed
40: 90% completed
40: 100% completed
40: [1;34;49m/var/jenkins/workspace/adamantine-nightly/tests/test_integration_thermoelastic.cc(19): Leaving test case "integration_thermoelastic"; testing time: 2686484348us
40: [0;39;49m[1;34;49m/var/jenkins/workspace/adamantine-nightly/tests/test_integration_thermoelastic.cc(47): Entering test case "integration_thermoelastic_add_material"
40: [1;34;49m/var/jenkins/workspace/adamantine-nightly/tests/test_integration_thermoelastic.cc(19): Leaving test case "integration_thermoelastic"; testing time: 2686418135us
40: [0;39;49m[1;34;49m/var/jenkins/workspace/adamantine-nightly/tests/test_integration_thermoelastic.cc(47): Entering test case "integration_thermoelastic_add_material"
40: [0;39;49m[0;39;49m10% completed
40: 20% completed
40: 30% completed
40: 40% completed
40: 50% completed
40: 60% completed
40: 70% completed
40: 80% completed
40: 90% completed
40: 100% completed
40:
40: [1;32;49m*** No errors detected
40: [0;39;49m[1;34;49m/var/jenkins/workspace/adamantine-nightly/tests/test_integration_thermoelastic.cc(47): Leaving test case "integration_thermoelastic_add_material"; testing time: 1355479937us
40: [0;39;49m[1;34;49mLeaving test module "Integration_Thermoelastic"; testing time: 4041967696us
40: [0;39;49m[1;34;49m/var/jenkins/workspace/adamantine-nightly/tests/test_integration_thermoelastic.cc(47): Leaving test case "integration_thermoelastic_add_material"; testing time: 1355479822us
40: [0;39;49m[1;34;49mLeaving test module "Integration_Thermoelastic"; testing time: 4041901795us
40: [0;39;49m
40: [1;32;49m*** No errors detected
40: [0;39;49m
44/48 Test #40: test_integration_thermoelastic_2 ......... Passed 4047.98 sec
test 3
Start 3: test_integration_da_3
3: Test command: /usr/bin/mpiexec "-n" "3" "/var/jenkins/workspace/adamantine-nightly/build/bin/test_integration_da"
3: Working Directory: /var/jenkins/workspace/adamantine-nightly/build/tests
3: Test timeout computed to be: 7200
3: Running 3 test cases...
3: [1;34;49mEntering test module "Integration_Data_Assimilation"
3: [0;39;49m[1;34;49m/var/jenkins/workspace/adamantine-nightly/tests/test_integration_da.cc(78): Entering test case "integration_data_assimilation"
3: Running 3 test cases...
3: [1;34;49mEntering test module "Integration_Data_Assimilation"
3: [0;39;49m[1;34;49m/var/jenkins/workspace/adamantine-nightly/tests/test_integration_da.cc(78): Entering test case "integration_data_assimilation"
3: Running 3 test cases...
3: [1;34;49mEntering test module "Integration_Data_Assimilation"
3: [0;39;49m[1;34;49m/var/jenkins/workspace/adamantine-nightly/tests/test_integration_da.cc(78): Entering test case "integration_data_assimilation"
3: [0;39;49mReading the experimental log file...
3: Done. Log entries found for 1 camera(s), with 2 frame(s).
3: Starting the main time stepping loop...
3: 10% completed
3: 20% completed
3: 30% completed
3: 40% completed
3: Performing data assimilation at time 0.0211...
3: Rank: 0 | Old parameters for member 0:
3: [0;39;49mRank: 2 | Old parameters for member 2:
3: [0;39;49mRank: 1 | Old parameters for member 1:
3: Rank: 0 | Number expt sites mapped to DOFs: 1
3: Rank: 2 | Number expt sites mapped to DOFs: 1
3: Rank: 1 | Number expt sites mapped to DOFs: 1
3: Getting the perturbed innovation...
3: Applying the Kalman gain...
3: Updating the ensemble members...
3: Done.
3: 50% completed
3: 60% completed
3: Performing data assimilation at time 0.0316...
3: Rank: 0 | Old parameters for member 0:
3: Rank: 2 | Old parameters for member 2:
3: Rank: 1 | Old parameters for member 1:
3: Rank: 0 | Number expt sites mapped to DOFs: 1
3: Rank: 2 | Number expt sites mapped to DOFs: 1
3: Rank: 1 | Number expt sites mapped to DOFs: 1
3: Getting the perturbed innovation...
3: Applying the Kalman gain...
3: Updating the ensemble members...
3: Done.
3: 70% completed
3: 80% completed
3: 90% completed
3: 100% completed
3: Reading the experimental log file...
3: Done. Log entries found for 1 camera(s), with 2 frame(s).
3: Reading the experimental log file...
3: Done. Log entries found for 1 camera(s), with 2 frame(s).
3: Reading the experimental log file...
3: Done. Log entries found for 1 camera(s), with 2 frame(s).
3: Starting the main time stepping loop...
3: Starting the main time stepping loop...
3: Starting the main time stepping loop...
3: 10% completed
3: 10% completed
3: 10% completed
3: 20% completed
3: 20% completed
3: 20% completed
3: 30% completed
3: 30% completed
3: 30% completed
3: 40% completed
3: 40% completed
3: 40% completed
3: Performing data assimilation at time 0.0211...
3: Rank: 0 | Old parameters for member 0:
3: Rank: 0 | Old parameters for member 1:
3: Rank: 0 | Old parameters for member 2:
3: Performing data assimilation at time 0.0211...
3: Rank: 0 | Old parameters for member 0:
3: Rank: 0 | Old parameters for member 1:
3: Rank: 0 | Old parameters for member 2:
3: Rank: 0 | Number expt sites mapped to DOFs: 1
3: Rank: 0 | Number expt sites mapped to DOFs: 1
3: Performing data assimilation at time 0.0211...
3: Rank: 0 | Old parameters for member 0:
3: Rank: 0 | Old parameters for member 1:
3: Rank: 0 | Old parameters for member 2:
3: Rank: 0 | Number expt sites mapped to DOFs: 1
3: Getting the perturbed innovation...
3: Applying the Kalman gain...
3: Getting the perturbed innovation...
3: Applying the Kalman gain...
3: Getting the perturbed innovation...
3: Applying the Kalman gain...
3: Updating the ensemble members...
3: Done.
3: Updating the ensemble members...
3: Done.
3: Updating the ensemble members...
3: Done.
3: 50% completed
3: 50% completed
3: 50% completed
3: 60% completed
3: 60% completed
3: 60% completed
3: Performing data assimilation at time 0.0316...
3: Rank: 0 | Old parameters for member 0:
3: Rank: 0 | Old parameters for member 1:
3: Rank: 0 | Old parameters for member 2:
3: Rank: 0 | Number expt sites mapped to DOFs: 1
3: Performing data assimilation at time 0.0316...
3: Rank: 0 | Old parameters for member 0:
3: Rank: 0 | Old parameters for member 1:
3: Rank: 0 | Old parameters for member 2:
3: Rank: 0 | Number expt sites mapped to DOFs: 1
3: Performing data assimilation at time 0.0316...
3: Rank: 0 | Old parameters for member 0:
3: Rank: 0 | Old parameters for member 1:
3: Rank: 0 | Old parameters for member 2:
3: Rank: 0 | Number expt sites mapped to DOFs: 1
3: Getting the perturbed innovation...
3: Applying the Kalman gain...
3: Getting the perturbed innovation...
3: Applying the Kalman gain...
3: Getting the perturbed innovation...
3: Applying the Kalman gain...
3: Updating the ensemble members...
3: Done.
3: Updating the ensemble members...
3: Done.
3: Updating the ensemble members...
3: Done.
3: 70% completed
3: 70% completed
3: 70% completed
3: 80% completed
3: 80% completed
3: 80% completed
3: 90% completed
3: 90% completed
3: 90% completed
3: 100% completed
3: 100% completed
3: [1;34;49m/var/jenkins/workspace/adamantine-nightly/tests/test_integration_da.cc(78): Leaving test case "integration_data_assimilation"; testing time: 62409240us
3: [0;39;49m[1;34;49m/var/jenkins/workspace/adamantine-nightly/tests/test_integration_da.cc(148): Entering test case "integration_3D_da_point_cloud_add_material"
3: [1;34;49m/var/jenkins/workspace/adamantine-nightly/tests/test_integration_da.cc(78): Leaving test case "integration_data_assimilation"; testing time: 62488204us
3: [0;39;49m[1;34;49m/var/jenkins/workspace/adamantine-nightly/tests/test_integration_da.cc(148): Entering test case "integration_3D_da_point_cloud_add_material"
3: 100% completed
3: [1;34;49m/var/jenkins/workspace/adamantine-nightly/tests/test_integration_da.cc(78): Leaving test case "integration_data_assimilation"; testing time: 62873987us
3: [0;39;49m[1;34;49m/var/jenkins/workspace/adamantine-nightly/tests/test_integration_da.cc(148): Entering test case "integration_3D_da_point_cloud_add_material"
3: [0;39;49mReading the experimental log file...
3: Done. Log entries found for 1 camera(s), with 1 frame(s).
3: Starting the main time stepping loop...
3: 10% completed
3: 20% completed
3: 30% completed
3: 40% completed
3: 50% completed
3: [0;39;49mRank: 1 | Old parameters for member 1:
3: Performing data assimilation at time 0.12...
3: Rank: 0 | Old parameters for member 0:
3: [0;39;49mRank: 2 | Old parameters for member 2:
3: Rank: 1 | Number expt sites mapped to DOFs: 1
3: Rank: 2 | Number expt sites mapped to DOFs: 1
3: Rank: 0 | Number expt sites mapped to DOFs: 1
3: Getting the perturbed innovation...
3: Applying the Kalman gain...
3: Updating the ensemble members...
3: Done.
3: 60% completed
3: 70% completed
3: 80% completed
3: 90% completed
3: 100% completed
3: Reading the experimental log file...
3: Done. Log entries found for 1 camera(s), with 1 frame(s).
3: Reading the experimental log file...
3: Done. Log entries found for 1 camera(s), with 1 frame(s).
3: Reading the experimental log file...
3: Done. Log entries found for 1 camera(s), with 1 frame(s).
3: Starting the main time stepping loop...
3: Starting the main time stepping loop...
3: Starting the main time stepping loop...
3: 10% completed
3: 10% completed
3: 10% completed
3: 20% completed
3: 20% completed
3: 20% completed
3: 30% completed
3: 30% completed
3: 30% completed
3: 40% completed
3: 40% completed
3: 40% completed
3: 50% completed
3: 50% completed
3: 50% completed
3: Performing data assimilation at time 0.12...
3: Rank: 0 | Old parameters for member 0:
3: Rank: 0 | Old parameters for member 1:
3: Rank: 0 | Old parameters for member 2:
3: Performing data assimilation at time 0.12...
3: Rank: 0 | Old parameters for member 0:
3: Rank: 0 | Old parameters for member 1:
3: Rank: 0 | Old parameters for member 2:
3: Performing data assimilation at time 0.12...
3: Rank: 0 | Old parameters for member 0:
3: Rank: 0 | Old parameters for member 1:
3: Rank: 0 | Old parameters for member 2:
3: Rank: 0 | Number expt sites mapped to DOFs: 1
3: Rank: 0 | Number expt sites mapped to DOFs: 1
3: Rank: 0 | Number expt sites mapped to DOFs: 1
3: Getting the perturbed innovation...
3: Applying the Kalman gain...
3: Getting the perturbed innovation...
3: Applying the Kalman gain...
3: Getting the perturbed innovation...
3: Applying the Kalman gain...
3: Updating the ensemble members...
3: Updating the ensemble members...
3: Done.
3: 60% completed
3: Done.
3: 60% completed
3: Updating the ensemble members...
3: Done.
3: 60% completed
3: 70% completed
3: 70% completed
3: 70% completed
3: 80% completed
3: 80% completed
3: 80% completed
3: 90% completed
3: 90% completed
3: 90% completed
3: 100% completed
3: 100% completed
3: 100% completed
3: [1;34;49m/var/jenkins/workspace/adamantine-nightly/tests/test_integration_da.cc(148): Leaving test case "integration_3D_da_point_cloud_add_material"; testing time: 2872335us
3: [0;39;49m[1;34;49m/var/jenkins/workspace/adamantine-nightly/tests/test_integration_da.cc(231): Entering test case "integration_3D_da_ray_add_material"
3: [1;34;49m/var/jenkins/workspace/adamantine-nightly/tests/test_integration_da.cc(148): Leaving test case "integration_3D_da_point_cloud_add_material"; testing time: 2811405us
3: [0;39;49m[1;34;49m/var/jenkins/workspace/adamantine-nightly/tests/test_integration_da.cc(231): Entering test case "integration_3D_da_ray_add_material"
3: [1;34;49m/var/jenkins/workspace/adamantine-nightly/tests/test_integration_da.cc(148): Leaving test case "integration_3D_da_point_cloud_add_material"; testing time: 2425769us
3: [0;39;49m[1;34;49m/var/jenkins/workspace/adamantine-nightly/tests/test_integration_da.cc(231): Entering test case "integration_3D_da_ray_add_material"
3: [0;39;49mReading the experimental log file...
3: Done. Log entries found for 1 camera(s), with 1 frame(s).
3: Starting the main time stepping loop...
3: 10% completed
3: 20% completed
3: 30% completed
3: 40% completed
3: 50% completed
3: Performing data assimilation at time 0.12...
3: Rank: 0 | Old parameters for member 0:
3: Rank: 0 | Number expt sites mapped to DOFs: 1
3: [0;39;49mRank: 2 | Old parameters for member 2:
3: [0;39;49mRank: 1 | Old parameters for member 1:
3: Rank: 2 | Number expt sites mapped to DOFs: 1
3: Rank: 1 | Number expt sites mapped to DOFs: 1
3: Getting the perturbed innovation...
3: Applying the Kalman gain...
3: Updating the ensemble members...
3: Done.
3: 60% completed
3: 70% completed
3: 80% completed
3: 90% completed
3: 100% completed
3: Reading the experimental log file...
3: Done. Log entries found for 1 camera(s), with 1 frame(s).
3: Reading the experimental log file...
3: Done. Log entries found for 1 camera(s), with 1 frame(s).
3: Reading the experimental log file...
3: Done. Log entries found for 1 camera(s), with 1 frame(s).
3: Starting the main time stepping loop...
3: Starting the main time stepping loop...
3: Starting the main time stepping loop...
3: 10% completed
3: 10% completed
3: 10% completed
3: 20% completed
3: 20% completed
3: 20% completed
3: 30% completed
3: 30% completed
3: 30% completed
3: 40% completed
3: 40% completed
3: 40% completed
3: 50% completed
3: 50% completed
3: 50% completed
3: Performing data assimilation at time 0.12...
3: Rank: 0 | Old parameters for member 0:
3: Rank: 0 | Old parameters for member 1:
3: Rank: 0 | Old parameters for member 2:
3: Rank: 0 | Number expt sites mapped to DOFs: 1
3: Performing data assimilation at time 0.12...
3: Rank: 0 | Old parameters for member 0:
3: Rank: 0 | Old parameters for member 1:
3: Rank: 0 | Old parameters for member 2:
3: Rank: 0 | Number expt sites mapped to DOFs: 1
3: Performing data assimilation at time 0.12...
3: Rank: 0 | Old parameters for member 0:
3: Rank: 0 | Old parameters for member 1:
3: Rank: 0 | Old parameters for member 2:
3: Rank: 0 | Number expt sites mapped to DOFs: 1
3: Getting the perturbed innovation...
3: Applying the Kalman gain...
3: Getting the perturbed innovation...
3: Applying the Kalman gain...
3: Getting the perturbed innovation...
3: Applying the Kalman gain...
3: Updating the ensemble members...
3: Done.
3: 60% completed
3: Updating the ensemble members...
3: Done.
3: 60% completed
3: Updating the ensemble members...
3: Done.
3: 60% completed
3: 70% completed
3: 70% completed
3: 70% completed
3: 80% completed
3: 80% completed
3: 80% completed
3: 90% completed
3: 90% completed
3: 90% completed
3: 100% completed
3: 100% completed
3: 100% completed
3: [1;34;49m/var/jenkins/workspace/adamantine-nightly/tests/test_integration_da.cc(231): Leaving test case "integration_3D_da_ray_add_material"; testing time: 2418079us
3: [0;39;49m[1;34;49mLeaving test module "Integration_Data_Assimilation"; testing time: 67699792us
3: [0;39;49m
3: [1;32;49m*** No errors detected
3: [0;39;49m
3: [1;32;49m*** No errors detected
3: [0;39;49m[1;34;49m/var/jenkins/workspace/adamantine-nightly/tests/test_integration_da.cc(231): Leaving test case "integration_3D_da_ray_add_material"; testing time: 2408657us
3: [0;39;49m[1;34;49mLeaving test module "Integration_Data_Assimilation"; testing time: 67708383us
3: [0;39;49m[1;34;49m/var/jenkins/workspace/adamantine-nightly/tests/test_integration_da.cc(231): Leaving test case "integration_3D_da_ray_add_material"; testing time: 2427837us
3: [0;39;49m[1;34;49mLeaving test module "Integration_Data_Assimilation"; testing time: 67727733us
3: [0;39;49m
3: [1;32;49m*** No errors detected
3: [0;39;49m
45/48 Test #3: test_integration_da_3 .................... Passed 69.04 sec
test 4
Start 4: test_integration_da_6
4: Test command: /usr/bin/mpiexec "-n" "6" "/var/jenkins/workspace/adamantine-nightly/build/bin/test_integration_da"
4: Working Directory: /var/jenkins/workspace/adamantine-nightly/build/tests
4: Test timeout computed to be: 7200
4: Running 3 test cases...
4: [1;34;49mEntering test module "Integration_Data_Assimilation"
4: [0;39;49m[1;34;49m/var/jenkins/workspace/adamantine-nightly/tests/test_integration_da.cc(78): Entering test case "integration_data_assimilation"
4: Running 3 test cases...
4: [1;34;49mEntering test module "Integration_Data_Assimilation"
4: [0;39;49m[1;34;49m/var/jenkins/workspace/adamantine-nightly/tests/test_integration_da.cc(78): Entering test case "integration_data_assimilation"
4: Running 3 test cases...
4: [1;34;49mEntering test module "Integration_Data_Assimilation"
4: [0;39;49m[1;34;49m/var/jenkins/workspace/adamantine-nightly/tests/test_integration_da.cc(78): Entering test case "integration_data_assimilation"
4: Running 3 test cases...
4: [1;34;49mEntering test module "Integration_Data_Assimilation"
4: [0;39;49m[1;34;49m/var/jenkins/workspace/adamantine-nightly/tests/test_integration_da.cc(78): Entering test case "integration_data_assimilation"
4: Running 3 test cases...
4: [1;34;49mEntering test module "Integration_Data_Assimilation"
4: [0;39;49m[1;34;49m/var/jenkins/workspace/adamantine-nightly/tests/test_integration_da.cc(78): Entering test case "integration_data_assimilation"
4: Running 3 test cases...
4: [1;34;49mEntering test module "Integration_Data_Assimilation"
4: [0;39;49m[1;34;49m/var/jenkins/workspace/adamantine-nightly/tests/test_integration_da.cc(78): Entering test case "integration_data_assimilation"
4: [0;39;49mReading the experimental log file...
4: Done. Log entries found for 1 camera(s), with 2 frame(s).
4: Starting the main time stepping loop...
4: 10% completed
4: 20% completed
4: 30% completed
4: 40% completed
4: [0;39;49mRank: 3 | Old parameters for member 1:
4: [0;39;49mRank: 5 | Old parameters for member 2:
4: [0;39;49mRank: 2 | Old parameters for member 1:
4: [0;39;49mRank: 4 | Old parameters for member 2:
4: Performing data assimilation at time 0.0211...
4: Rank: 0 | Old parameters for member 0:
4: [0;39;49mRank: 1 | Old parameters for member 0:
4: Rank: 3 | Number expt sites mapped to DOFs: 1
4: Rank: 5 | Number expt sites mapped to DOFs: 1
4: Rank: 2 | Number expt sites mapped to DOFs: 1
4: Rank: 4 | Number expt sites mapped to DOFs: 1
4: Rank: 0 | Number expt sites mapped to DOFs: 1
4: Rank: 1 | Number expt sites mapped to DOFs: 1
4: Getting the perturbed innovation...
4: Applying the Kalman gain...
4: Updating the ensemble members...
4: Done.
4: 50% completed
4: 60% completed
4: Rank: 4 | Old parameters for member 2:
4: Rank: 5 | Old parameters for member 2:
4: Rank: 4 | Number expt sites mapped to DOFs: 1
4: Rank: 5 | Number expt sites mapped to DOFs: 1
4: Rank: 2 | Old parameters for member 1:
4: Rank: 3 | Old parameters for member 1:
4: Performing data assimilation at time 0.0316...
4: Rank: 0 | Old parameters for member 0:
4: Rank: 1 | Old parameters for member 0:
4: Rank: 2 | Number expt sites mapped to DOFs: 1
4: Rank: 3 | Number expt sites mapped to DOFs: 1
4: Rank: 0 | Number expt sites mapped to DOFs: 1
4: Rank: 1 | Number expt sites mapped to DOFs: 1
4: Getting the perturbed innovation...
4: Applying the Kalman gain...
4: Updating the ensemble members...
4: Done.
4: 70% completed
4: 80% completed
4: 90% completed
4: 100% completed
4: Reading the experimental log file...
4: Done. Log entries found for 1 camera(s), with 2 frame(s).
4: Reading the experimental log file...
4: Done. Log entries found for 1 camera(s), with 2 frame(s).
4: Reading the experimental log file...
4: Done. Log entries found for 1 camera(s), with 2 frame(s).
4: Reading the experimental log file...
4: Done. Log entries found for 1 camera(s), with 2 frame(s).
4: Reading the experimental log file...
4: Done. Log entries found for 1 camera(s), with 2 frame(s).
4: Reading the experimental log file...
4: Done. Log entries found for 1 camera(s), with 2 frame(s).
4: Starting the main time stepping loop...
4: Starting the main time stepping loop...
4: Starting the main time stepping loop...
4: Starting the main time stepping loop...
4: Starting the main time stepping loop...
4: Starting the main time stepping loop...
4: 10% completed
4: 10% completed
4: 10% completed
4: 10% completed
4: 10% completed
4: 10% completed
4: 20% completed
4: 20% completed
4: 20% completed
4: 20% completed
4: 20% completed
4: 20% completed
4: 30% completed
4: 30% completed
4: 30% completed
4: 30% completed
4: 30% completed
4: 30% completed
4: 40% completed
4: 40% completed
4: 40% completed
4: 40% completed
4: 40% completed
4: 40% completed
4: Performing data assimilation at time 0.0211...
4: Rank: 0 | Old parameters for member 0:
4: Rank: 0 | Old parameters for member 1:
4: Rank: 0 | Old parameters for member 2:
4: Rank: 0 | Number expt sites mapped to DOFs: 1
4: Performing data assimilation at time 0.0211...
4: Rank: 0 | Old parameters for member 0:
4: Rank: 0 | Old parameters for member 1:
4: Rank: 0 | Old parameters for member 2:
4: Performing data assimilation at time 0.0211...
4: Rank: 0 | Old parameters for member 0:
4: Rank: 0 | Old parameters for member 1:
4: Rank: 0 | Old parameters for member 2:
4: Rank: 0 | Number expt sites mapped to DOFs: 1
4: Performing data assimilation at time 0.0211...
4: Rank: 0 | Old parameters for member 0:
4: Rank: 0 | Old parameters for member 1:
4: Rank: 0 | Old parameters for member 2:
4: Rank: 0 | Number expt sites mapped to DOFs: 1
4: Performing data assimilation at time 0.0211...
4: Rank: 0 | Old parameters for member 0:
4: Rank: 0 | Old parameters for member 1:
4: Rank: 0 | Old parameters for member 2:
4: Rank: 0 | Number expt sites mapped to DOFs: 1
4: Rank: 0 | Number expt sites mapped to DOFs: 1
4: Performing data assimilation at time 0.0211...
4: Rank: 0 | Old parameters for member 0:
4: Rank: 0 | Old parameters for member 1:
4: Rank: 0 | Old parameters for member 2:
4: Rank: 0 | Number expt sites mapped to DOFs: 1
4: Getting the perturbed innovation...
4: Applying the Kalman gain...
4: Getting the perturbed innovation...
4: Applying the Kalman gain...
4: Getting the perturbed innovation...
4: Applying the Kalman gain...
4: Getting the perturbed innovation...
4: Applying the Kalman gain...
4: Getting the perturbed innovation...
4: Applying the Kalman gain...
4: Getting the perturbed innovation...
4: Applying the Kalman gain...
4: Updating the ensemble members...
4: Done.
4: Updating the ensemble members...
4: Done.
4: Updating the ensemble members...
4: Done.
4: Updating the ensemble members...
4: Done.
4: Updating the ensemble members...
4: Done.
4: Updating the ensemble members...
4: Done.
4: 50% completed
4: 50% completed
4: 50% completed
4: 50% completed
4: 50% completed
4: 50% completed
4: 60% completed
4: 60% completed
4: 60% completed
4: 60% completed
4: 60% completed
4: 60% completed
4: Performing data assimilation at time 0.0316...
4: Rank: 0 | Old parameters for member 0:
4: Rank: 0 | Old parameters for member 1:
4: Rank: 0 | Old parameters for member 2:
4: Rank: 0 | Number expt sites mapped to DOFs: 1
4: Performing data assimilation at time 0.0316...
4: Rank: 0 | Old parameters for member 0:
4: Rank: 0 | Old parameters for member 1:
4: Rank: 0 | Old parameters for member 2:
4: Performing data assimilation at time 0.0316...
4: Rank: 0 | Old parameters for member 0:
4: Rank: 0 | Old parameters for member 1:
4: Rank: 0 | Old parameters for member 2:
4: Rank: 0 | Number expt sites mapped to DOFs: 1
4: Rank: 0 | Number expt sites mapped to DOFs: 1
4: Performing data assimilation at time 0.0316...
4: Rank: 0 | Old parameters for member 0:
4: Rank: 0 | Old parameters for member 1:
4: Rank: 0 | Old parameters for member 2:
4: Rank: 0 | Number expt sites mapped to DOFs: 1
4: Performing data assimilation at time 0.0316...
4: Rank: 0 | Old parameters for member 0:
4: Rank: 0 | Old parameters for member 1:
4: Rank: 0 | Old parameters for member 2:
4: Rank: 0 | Number expt sites mapped to DOFs: 1
4: Performing data assimilation at time 0.0316...
4: Rank: 0 | Old parameters for member 0:
4: Rank: 0 | Old parameters for member 1:
4: Rank: 0 | Old parameters for member 2:
4: Rank: 0 | Number expt sites mapped to DOFs: 1
4: Getting the perturbed innovation...
4: Applying the Kalman gain...
4: Getting the perturbed innovation...
4: Applying the Kalman gain...
4: Getting the perturbed innovation...
4: Applying the Kalman gain...
4: Getting the perturbed innovation...
4: Applying the Kalman gain...
4: Getting the perturbed innovation...
4: Applying the Kalman gain...
4: Getting the perturbed innovation...
4: Applying the Kalman gain...
4: Updating the ensemble members...
4: Done.
4: Updating the ensemble members...
4: Done.
4: Updating the ensemble members...
4: Done.
4: Updating the ensemble members...
4: Done.
4: Updating the ensemble members...
4: Done.
4: Updating the ensemble members...
4: Done.
4: 70% completed
4: 70% completed
4: 70% completed
4: 70% completed
4: 70% completed
4: 70% completed
4: 80% completed
4: 80% completed
4: 80% completed
4: 80% completed
4: 80% completed
4: 80% completed
4: 90% completed
4: 90% completed
4: 90% completed
4: 90% completed
4: 90% completed
4: 90% completed
4: 100% completed
4: 100% completed
4: 100% completed
4: 100% completed
4: [1;34;49m/var/jenkins/workspace/adamantine-nightly/tests/test_integration_da.cc(78): Leaving test case "integration_data_assimilation"; testing time: 57574960us
4: [0;39;49m[1;34;49m/var/jenkins/workspace/adamantine-nightly/tests/test_integration_da.cc(148): Entering test case "integration_3D_da_point_cloud_add_material"
4: 100% completed
4: [1;34;49m/var/jenkins/workspace/adamantine-nightly/tests/test_integration_da.cc(78): Leaving test case "integration_data_assimilation"; testing time: 57645077us
4: [0;39;49m[1;34;49m/var/jenkins/workspace/adamantine-nightly/tests/test_integration_da.cc(148): Entering test case "integration_3D_da_point_cloud_add_material"
4: [1;34;49m/var/jenkins/workspace/adamantine-nightly/tests/test_integration_da.cc(78): Leaving test case "integration_data_assimilation"; testing time: 57700598us
4: [0;39;49m[1;34;49m/var/jenkins/workspace/adamantine-nightly/tests/test_integration_da.cc(148): Entering test case "integration_3D_da_point_cloud_add_material"
4: 100% completed
4: [1;34;49m/var/jenkins/workspace/adamantine-nightly/tests/test_integration_da.cc(78): Leaving test case "integration_data_assimilation"; testing time: 57843337us
4: [0;39;49m[1;34;49m/var/jenkins/workspace/adamantine-nightly/tests/test_integration_da.cc(148): Entering test case "integration_3D_da_point_cloud_add_material"
4: [1;34;49m/var/jenkins/workspace/adamantine-nightly/tests/test_integration_da.cc(78): Leaving test case "integration_data_assimilation"; testing time: 57896629us
4: [0;39;49m[1;34;49m/var/jenkins/workspace/adamantine-nightly/tests/test_integration_da.cc(148): Entering test case "integration_3D_da_point_cloud_add_material"
4: [1;34;49m/var/jenkins/workspace/adamantine-nightly/tests/test_integration_da.cc(78): Leaving test case "integration_data_assimilation"; testing time: 58033920us
4: [0;39;49m[1;34;49m/var/jenkins/workspace/adamantine-nightly/tests/test_integration_da.cc(148): Entering test case "integration_3D_da_point_cloud_add_material"
4: [0;39;49mReading the experimental log file...
4: Done. Log entries found for 1 camera(s), with 1 frame(s).
4: Starting the main time stepping loop...
4: 10% completed
4: 20% completed
4: 30% completed
4: 40% completed
4: 50% completed
4: [0;39;49mRank: 4 | Old parameters for member 2:
4: [0;39;49mRank: 5 | Old parameters for member 2:
4: [0;39;49mRank: 3 | Old parameters for member 1:
4: [0;39;49mRank: 2 | Old parameters for member 1:
4: [0;39;49mRank: 1 | Old parameters for member 0:
4: Performing data assimilation at time 0.12...
4: Rank: 0 | Old parameters for member 0:
4: Rank: 4 | Number expt sites mapped to DOFs: 1
4: Rank: 5 | Number expt sites mapped to DOFs: 1
4: Rank: 3 | Number expt sites mapped to DOFs: 1
4: Rank: 2 | Number expt sites mapped to DOFs: 1
4: Rank: 1 | Number expt sites mapped to DOFs: 1
4: Rank: 0 | Number expt sites mapped to DOFs: 1
4: Getting the perturbed innovation...
4: Applying the Kalman gain...
4: Updating the ensemble members...
4: Done.
4: 60% completed
4: 70% completed
4: 80% completed
4: 90% completed
4: 100% completed
4: Reading the experimental log file...
4: Done. Log entries found for 1 camera(s), with 1 frame(s).
4: Reading the experimental log file...
4: Done. Log entries found for 1 camera(s), with 1 frame(s).
4: Reading the experimental log file...
4: Done. Log entries found for 1 camera(s), with 1 frame(s).
4: Reading the experimental log file...
4: Done. Log entries found for 1 camera(s), with 1 frame(s).
4: Reading the experimental log file...
4: Done. Log entries found for 1 camera(s), with 1 frame(s).
4: Reading the experimental log file...
4: Done. Log entries found for 1 camera(s), with 1 frame(s).
4: Starting the main time stepping loop...
4: Starting the main time stepping loop...
4: Starting the main time stepping loop...
4: Starting the main time stepping loop...
4: Starting the main time stepping loop...
4: Starting the main time stepping loop...
4: 10% completed
4: 10% completed
4: 10% completed
4: 10% completed
4: 10% completed
4: 10% completed
4: 20% completed
4: 20% completed
4: 20% completed
4: 20% completed
4: 20% completed
4: 20% completed
4: 30% completed
4: 30% completed
4: 30% completed
4: 30% completed
4: 30% completed
4: 30% completed
4: 40% completed
4: 40% completed
4: 40% completed
4: 40% completed
4: 40% completed
4: 40% completed
4: 50% completed
4: 50% completed
4: Performing data assimilation at time 0.12...
4: Rank: 0 | Old parameters for member 0:
4: Rank: 0 | Old parameters for member 1:
4: Rank: 0 | Old parameters for member 2:
4: Rank: 0 | Number expt sites mapped to DOFs: 1
4: Performing data assimilation at time 0.12...
4: Rank: 0 | Old parameters for member 0:
4: Rank: 0 | Old parameters for member 1:
4: Rank: 0 | Old parameters for member 2:
4: Rank: 0 | Number expt sites mapped to DOFs: 1
4: 50% completed
4: 50% completed
4: 50% completed
4: 50% completed
4: Performing data assimilation at time 0.12...
4: Rank: 0 | Old parameters for member 0:
4: Rank: 0 | Old parameters for member 1:
4: Rank: 0 | Old parameters for member 2:
4: Performing data assimilation at time 0.12...
4: Rank: 0 | Old parameters for member 0:
4: Performing data assimilation at time 0.12...
4: Rank: 0 | Old parameters for member 0:
4: Performing data assimilation at time 0.12...
4: Rank: 0 | Old parameters for member 0:
4: Rank: 0 | Old parameters for member 1:
4: Rank: 0 | Old parameters for member 2:
4: Rank: 0 | Old parameters for member 1:
4: Rank: 0 | Old parameters for member 2:
4: Rank: 0 | Old parameters for member 1:
4: Rank: 0 | Old parameters for member 2:
4: Rank: 0 | Number expt sites mapped to DOFs: 1
4: Rank: 0 | Number expt sites mapped to DOFs: 1
4: Rank: 0 | Number expt sites mapped to DOFs: 1
4: Rank: 0 | Number expt sites mapped to DOFs: 1
4: Getting the perturbed innovation...
4: Applying the Kalman gain...
4: Getting the perturbed innovation...
4: Applying the Kalman gain...
4: Getting the perturbed innovation...
4: Applying the Kalman gain...
4: Getting the perturbed innovation...
4: Applying the Kalman gain...
4: Getting the perturbed innovation...
4: Applying the Kalman gain...
4: Getting the perturbed innovation...
4: Applying the Kalman gain...
4: Updating the ensemble members...
4: Done.
4: 60% completed
4: Updating the ensemble members...
4: Done.
4: 60% completed
4: 70% completed
4: 70% completed
4: 80% completed
4: Updating the ensemble members...
4: Updating the ensemble members...
4: Updating the ensemble members...
4: Updating the ensemble members...
4: Done.
4: Done.
4: 60% completed
4: 60% completed
4: Done.
4: 60% completed
4: 80% completed
4: Done.
4: 60% completed
4: 90% completed
4: 90% completed
4: 70% completed
4: 70% completed
4: 70% completed
4: 70% completed
4: 80% completed
4: 80% completed
4: 80% completed
4: 80% completed
4: 90% completed
4: 90% completed
4: 90% completed
4: 90% completed
4: 100% completed
4: 100% completed
4: [1;34;49m/var/jenkins/workspace/adamantine-nightly/tests/test_integration_da.cc(148): Leaving test case "integration_3D_da_point_cloud_add_material"; testing time: 3024818us
4: [0;39;49m[1;34;49m/var/jenkins/workspace/adamantine-nightly/tests/test_integration_da.cc(231): Entering test case "integration_3D_da_ray_add_material"
4: [1;34;49m/var/jenkins/workspace/adamantine-nightly/tests/test_integration_da.cc(148): Leaving test case "integration_3D_da_point_cloud_add_material"; testing time: 2748569us
4: [0;39;49m[1;34;49m/var/jenkins/workspace/adamantine-nightly/tests/test_integration_da.cc(231): Entering test case "integration_3D_da_ray_add_material"
4: 100% completed
4: 100% completed
4: 100% completed
4: 100% completed
4: [1;34;49m/var/jenkins/workspace/adamantine-nightly/tests/test_integration_da.cc(148): Leaving test case "integration_3D_da_point_cloud_add_material"; testing time: 2787993us
4: [0;39;49m[1;34;49m/var/jenkins/workspace/adamantine-nightly/tests/test_integration_da.cc(231): Entering test case "integration_3D_da_ray_add_material"
4: [1;34;49m/var/jenkins/workspace/adamantine-nightly/tests/test_integration_da.cc(148): Leaving test case "integration_3D_da_point_cloud_add_material"; testing time: 3096559us
4: [0;39;49m[1;34;49m/var/jenkins/workspace/adamantine-nightly/tests/test_integration_da.cc(231): Entering test case "integration_3D_da_ray_add_material"
4: [1;34;49m/var/jenkins/workspace/adamantine-nightly/tests/test_integration_da.cc(148): Leaving test case "integration_3D_da_point_cloud_add_material"; testing time: 3168383us
4: [0;39;49m[1;34;49m/var/jenkins/workspace/adamantine-nightly/tests/test_integration_da.cc(231): Entering test case "integration_3D_da_ray_add_material"
4: [1;34;49m/var/jenkins/workspace/adamantine-nightly/tests/test_integration_da.cc(148): Leaving test case "integration_3D_da_point_cloud_add_material"; testing time: 2929323us
4: [0;39;49m[1;34;49m/var/jenkins/workspace/adamantine-nightly/tests/test_integration_da.cc(231): Entering test case "integration_3D_da_ray_add_material"
4: [0;39;49mReading the experimental log file...
4: Done. Log entries found for 1 camera(s), with 1 frame(s).
4: Starting the main time stepping loop...
4: 10% completed
4: 20% completed
4: 30% completed
4: 40% completed
4: 50% completed
4: [0;39;49mRank: 3 | Old parameters for member 1:
4: [0;39;49mRank: 1 | Old parameters for member 0:
4: [0;39;49mRank: 2 | Old parameters for member 1:
4: Performing data assimilation at time 0.12...
4: Rank: 0 | Old parameters for member 0:
4: [0;39;49mRank: 5 | Old parameters for member 2:
4: [0;39;49mRank: 4 | Old parameters for member 2:
4: Rank: 0 | Number expt sites mapped to DOFs: 1
4: Rank: 3 | Number expt sites mapped to DOFs: 1
4: Rank: 1 | Number expt sites mapped to DOFs: 1
4: Rank: 2 | Number expt sites mapped to DOFs: 1
4: Rank: 5 | Number expt sites mapped to DOFs: 1
4: Rank: 4 | Number expt sites mapped to DOFs: 1
4: Getting the perturbed innovation...
4: Applying the Kalman gain...
4: Updating the ensemble members...
4: Done.
4: 60% completed
4: 70% completed
4: 80% completed
4: 90% completed
4: 100% completed
4: Reading the experimental log file...
4: Done. Log entries found for 1 camera(s), with 1 frame(s).
4: Reading the experimental log file...
4: Done. Log entries found for 1 camera(s), with 1 frame(s).
4: Reading the experimental log file...
4: Done. Log entries found for 1 camera(s), with 1 frame(s).
4: Reading the experimental log file...
4: Done. Log entries found for 1 camera(s), with 1 frame(s).
4: Reading the experimental log file...
4: Done. Log entries found for 1 camera(s), with 1 frame(s).
4: Reading the experimental log file...
4: Done. Log entries found for 1 camera(s), with 1 frame(s).
4: Starting the main time stepping loop...
4: Starting the main time stepping loop...
4: Starting the main time stepping loop...
4: Starting the main time stepping loop...
4: Starting the main time stepping loop...
4: Starting the main time stepping loop...
4: 10% completed
4: 10% completed
4: 10% completed
4: 10% completed
4: 10% completed
4: 10% completed
4: 20% completed
4: 20% completed
4: 20% completed
4: 20% completed
4: 20% completed
4: 20% completed
4: 30% completed
4: 30% completed
4: 30% completed
4: 30% completed
4: 30% completed
4: 30% completed
4: 40% completed
4: 40% completed
4: 40% completed
4: 50% completed
4: 40% completed
4: 40% completed
4: 40% completed
4: Performing data assimilation at time 0.12...
4: Rank: 0 | Old parameters for member 0:
4: Rank: 0 | Old parameters for member 1:
4: Rank: 0 | Old parameters for member 2:
4: 50% completed
4: 50% completed
4: Rank: 0 | Number expt sites mapped to DOFs: 1
4: 50% completed
4: 50% completed
4: 50% completed
4: Performing data assimilation at time 0.12...
4: Rank: 0 | Old parameters for member 0:
4: Rank: 0 | Old parameters for member 1:
4: Rank: 0 | Old parameters for member 2:
4: Performing data assimilation at time 0.12...
4: Rank: 0 | Old parameters for member 0:
4: Rank: 0 | Old parameters for member 1:
4: Rank: 0 | Old parameters for member 2:
4: Rank: 0 | Number expt sites mapped to DOFs: 1
4: Rank: 0 | Number expt sites mapped to DOFs: 1
4: Performing data assimilation at time 0.12...
4: Rank: 0 | Old parameters for member 0:
4: Rank: 0 | Old parameters for member 1:
4: Rank: 0 | Old parameters for member 2:
4: Performing data assimilation at time 0.12...
4: Rank: 0 | Old parameters for member 0:
4: Rank: 0 | Old parameters for member 1:
4: Rank: 0 | Old parameters for member 2:
4: Performing data assimilation at time 0.12...
4: Rank: 0 | Old parameters for member 0:
4: Rank: 0 | Old parameters for member 1:
4: Rank: 0 | Old parameters for member 2:
4: Rank: 0 | Number expt sites mapped to DOFs: 1
4: Rank: 0 | Number expt sites mapped to DOFs: 1
4: Rank: 0 | Number expt sites mapped to DOFs: 1
4: Getting the perturbed innovation...
4: Applying the Kalman gain...
4: Getting the perturbed innovation...
4: Applying the Kalman gain...
4: Getting the perturbed innovation...
4: Applying the Kalman gain...
4: Getting the perturbed innovation...
4: Applying the Kalman gain...
4: Getting the perturbed innovation...
4: Getting the perturbed innovation...
4: Applying the Kalman gain...
4: Applying the Kalman gain...
4: Updating the ensemble members...
4: Done.
4: 60% completed
4: 70% completed
4: Updating the ensemble members...
4: Done.
4: 60% completed
4: Updating the ensemble members...
4: Done.
4: 60% completed
4: 80% completed
4: Updating the ensemble members...
4: Done.
4: 60% completed
4: 70% completed
4: Updating the ensemble members...
4: Updating the ensemble members...
4: Done.
4: Done.
4: 60% completed
4: 60% completed
4: 70% completed
4: 90% completed
4: 80% completed
4: 70% completed
4: 70% completed
4: 70% completed
4: 80% completed
4: 90% completed
4: 90% completed
4: 80% completed
4: 80% completed
4: 80% completed
4: 90% completed
4: 90% completed
4: 90% completed
4: 100% completed
4: [1;34;49m/var/jenkins/workspace/adamantine-nightly/tests/test_integration_da.cc(231): Leaving test case "integration_3D_da_ray_add_material"; testing time: 2469794us
4: [0;39;49m[1;34;49mLeaving test module "Integration_Data_Assimilation"; testing time: 63267087us
4: [0;39;49m
4: [1;32;49m*** No errors detected
4: [0;39;49m100% completed
4: 100% completed
4:
4: [1;32;49m*** No errors detected
4: [0;39;49m[1;34;49m/var/jenkins/workspace/adamantine-nightly/tests/test_integration_da.cc(231): Leaving test case "integration_3D_da_ray_add_material"; testing time: 2516289us
4: [0;39;49m[1;34;49mLeaving test module "Integration_Data_Assimilation"; testing time: 63329874us
4: [0;39;49m[1;34;49m/var/jenkins/workspace/adamantine-nightly/tests/test_integration_da.cc(231): Leaving test case "integration_3D_da_ray_add_material"; testing time: 2526049us
4: [0;39;49m[1;34;49mLeaving test module "Integration_Data_Assimilation"; testing time: 63348093us
4: [0;39;49m
4: [1;32;49m*** No errors detected
4: [0;39;49m100% completed
4: 100% completed
4: 100% completed
4: [1;34;49m/var/jenkins/workspace/adamantine-nightly/tests/test_integration_da.cc(231): Leaving test case "integration_3D_da_ray_add_material"; testing time: 2787762us
4: [0;39;49m[1;34;49mLeaving test module "Integration_Data_Assimilation"; testing time: 63387688us
4: [0;39;49m
4: [1;32;49m*** No errors detected
4: [0;39;49m
4: [1;32;49m*** No errors detected
4: [0;39;49m[1;34;49m/var/jenkins/workspace/adamantine-nightly/tests/test_integration_da.cc(231): Leaving test case "integration_3D_da_ray_add_material"; testing time: 2590520us
4: [0;39;49m[1;34;49mLeaving test module "Integration_Data_Assimilation"; testing time: 63416626us
4: [0;39;49m[1;34;49m/var/jenkins/workspace/adamantine-nightly/tests/test_integration_da.cc(231): Leaving test case "integration_3D_da_ray_add_material"; testing time: 2798263us
4: [0;39;49m[1;34;49mLeaving test module "Integration_Data_Assimilation"; testing time: 63390321us
4:
4: [1;32;49m*** No errors detected
4: [0;39;49m[0;39;49m
46/48 Test #4: test_integration_da_6 .................... Passed 65.25 sec
test 7
Start 7: test_closest_source_point_adaptation_3
7: Test command: /usr/bin/mpiexec "-n" "3" "/var/jenkins/workspace/adamantine-nightly/build/bin/test_closest_source_point_adaptation"
7: Working Directory: /var/jenkins/workspace/adamantine-nightly/build/tests
7: Test timeout computed to be: 7200
7: Running 1 test case...
7: [1;34;49mEntering test module "ClosestSourcePointAdaptation"
7: [0;39;49m[1;34;49m/var/jenkins/workspace/adamantine-nightly/tests/test_closest_source_point_adaptation.cc(123): Entering test case "closest_source_point_adaptation"
7: Running 1 test case...
7: [1;34;49mEntering test module "ClosestSourcePointAdaptation"
7: [0;39;49m[1;34;49m/var/jenkins/workspace/adamantine-nightly/tests/test_closest_source_point_adaptation.cc(123): Entering test case "closest_source_point_adaptation"
7: Running 1 test case...
7: [1;34;49mEntering test module "ClosestSourcePointAdaptation"
7: [0;39;49m[1;34;49m/var/jenkins/workspace/adamantine-nightly/tests/test_closest_source_point_adaptation.cc(123): Entering test case "closest_source_point_adaptation"
7: [0;39;49m[1;34;49m/var/jenkins/workspace/adamantine-nightly/tests/test_closest_source_point_adaptation.cc(123): Leaving test case "closest_source_point_adaptation"; testing time: 7098357us
7: [0;39;49m[1;34;49mLeaving test module "ClosestSourcePointAdaptation"; testing time: 7098406us
7: [0;39;49m
7: [1;32;49m*** No errors detected
7: [0;39;49m[0;39;49m[1;34;49m/var/jenkins/workspace/adamantine-nightly/tests/test_closest_source_point_adaptation.cc(123): Leaving test case "closest_source_point_adaptation"; testing time: 7088541us
7: [0;39;49m[1;34;49mLeaving test module "ClosestSourcePointAdaptation"; testing time: 7088603us
7: [0;39;49m
7: [1;32;49m*** No errors detected
7: [0;39;49m[0;39;49m[1;34;49m/var/jenkins/workspace/adamantine-nightly/tests/test_closest_source_point_adaptation.cc(123): Leaving test case "closest_source_point_adaptation"; testing time: 7093588us
7: [0;39;49m[1;34;49mLeaving test module "ClosestSourcePointAdaptation"; testing time: 7093654us
7: [0;39;49m
7: [1;32;49m*** No errors detected
7: [0;39;49m
47/48 Test #7: test_closest_source_point_adaptation_3 ... Passed 8.41 sec
test 8
Start 8: test_closest_source_point_adaptation_6
8: Test command: /usr/bin/mpiexec "-n" "6" "/var/jenkins/workspace/adamantine-nightly/build/bin/test_closest_source_point_adaptation"
8: Working Directory: /var/jenkins/workspace/adamantine-nightly/build/tests
8: Test timeout computed to be: 7200
8: Running 1 test case...
8: [1;34;49mEntering test module "ClosestSourcePointAdaptation"
8: [0;39;49m[1;34;49m/var/jenkins/workspace/adamantine-nightly/tests/test_closest_source_point_adaptation.cc(123): Entering test case "closest_source_point_adaptation"
8: Running 1 test case...
8: [1;34;49mEntering test module "ClosestSourcePointAdaptation"
8: [0;39;49m[1;34;49m/var/jenkins/workspace/adamantine-nightly/tests/test_closest_source_point_adaptation.cc(123): Entering test case "closest_source_point_adaptation"
8: Running 1 test case...
8: [1;34;49mEntering test module "ClosestSourcePointAdaptation"
8: [0;39;49m[1;34;49m/var/jenkins/workspace/adamantine-nightly/tests/test_closest_source_point_adaptation.cc(123): Entering test case "closest_source_point_adaptation"
8: Running 1 test case...
8: [1;34;49mEntering test module "ClosestSourcePointAdaptation"
8: [0;39;49m[1;34;49m/var/jenkins/workspace/adamantine-nightly/tests/test_closest_source_point_adaptation.cc(123): Entering test case "closest_source_point_adaptation"
8: Running 1 test case...
8: [1;34;49mEntering test module "ClosestSourcePointAdaptation"
8: [0;39;49m[1;34;49m/var/jenkins/workspace/adamantine-nightly/tests/test_closest_source_point_adaptation.cc(123): Entering test case "closest_source_point_adaptation"
8: Running 1 test case...
8: [1;34;49mEntering test module "ClosestSourcePointAdaptation"
8: [0;39;49m[1;34;49m/var/jenkins/workspace/adamantine-nightly/tests/test_closest_source_point_adaptation.cc(123): Entering test case "closest_source_point_adaptation"
8: [0;39;49m[1;34;49m/var/jenkins/workspace/adamantine-nightly/tests/test_closest_source_point_adaptation.cc(123): Leaving test case "closest_source_point_adaptation"; testing time: 4472357us
8: [0;39;49m[1;34;49mLeaving test module "ClosestSourcePointAdaptation"; testing time: 4472418us
8: [0;39;49m[0;39;49m[1;34;49m/var/jenkins/workspace/adamantine-nightly/tests/test_closest_source_point_adaptation.cc(123): Leaving test case "closest_source_point_adaptation"; testing time: 4483253us
8: [0;39;49m[1;34;49mLeaving test module "ClosestSourcePointAdaptation"; testing time: 4483306us
8: [0;39;49m[0;39;49m[1;34;49m/var/jenkins/workspace/adamantine-nightly/tests/test_closest_source_point_adaptation.cc(123): Leaving test case "closest_source_point_adaptation"; testing time: 4471450us
8: [0;39;49m[1;34;49mLeaving test module "ClosestSourcePointAdaptation"; testing time: 4471487us
8:
8: [1;32;49m*** No errors detected
8: [0;39;49m[0;39;49m[1;34;49m/var/jenkins/workspace/adamantine-nightly/tests/test_closest_source_point_adaptation.cc(123): Leaving test case "closest_source_point_adaptation"; testing time: 4485853us
8: [0;39;49m[1;34;49mLeaving test module "ClosestSourcePointAdaptation"; testing time: 4485894us
8: [0;39;49m[0;39;49m
8: [1;32;49m*** No errors detected
8: [0;39;49m
8: [1;32;49m*** No errors detected
8: [0;39;49m
8: [1;32;49m*** No errors detected
8: [0;39;49m[0;39;49m[1;34;49m/var/jenkins/workspace/adamantine-nightly/tests/test_closest_source_point_adaptation.cc(123): Leaving test case "closest_source_point_adaptation"; testing time: 4466296us
8: [0;39;49m[1;34;49mLeaving test module "ClosestSourcePointAdaptation"; testing time: 4466364us
8: [0;39;49m[0;39;49m[1;34;49m/var/jenkins/workspace/adamantine-nightly/tests/test_closest_source_point_adaptation.cc(123): Leaving test case "closest_source_point_adaptation"; testing time: 4477408us
8: [0;39;49m[1;34;49mLeaving test module "ClosestSourcePointAdaptation"; testing time: 4477480us
8: [0;39;49m
8: [1;32;49m
8: [1;32;49m*** No errors detected
8: [0;39;49m*** No errors detected
8: [0;39;49m
48/48 Test #8: test_closest_source_point_adaptation_6 ... Passed 6.38 sec
The following tests passed:
test_closest_source_point_adaptation_1
test_data_assimilator_1
test_experimental_data_1
test_geometry_1
test_heat_source_1
test_integration_da_2
test_closest_source_point_adaptation_2
test_material_property_1
test_material_property_device_1
test_integration_da_1
test_post_processor_1
test_quaternion_1
test_scan_path_1
test_mechanical_operator_1
test_thermal_operator_1
test_thermal_operator_device_1
test_timer_1
test_utils_1
test_validate_input_database_1
test_integration_2d_1
test_integration_2d_device_1
test_mechanical_physics_1
test_thermal_physics_device_1
test_integration_3d_amr_device_1
test_integration_3d_amr_1
test_integration_da_augmented_1
test_material_deposition_1
test_microstructure_1
test_thermal_physics_1
test_ensemble_management_1
test_integration_3d_device_1
test_integration_2d_2
test_integration_2d_device_2
test_integration_3d_amr_2
test_integration_3d_amr_device_2
test_integration_da_augmented_2
test_material_deposition_2
test_microstructure_2
test_thermal_physics_2
test_ensemble_management_2
test_integration_thermoelastic_2
test_integration_da_3
test_integration_da_6
test_closest_source_point_adaptation_3
test_closest_source_point_adaptation_6
94% tests passed, 3 tests failed out of 48
Total Test time (real) = 12795.27 sec
The following tests FAILED:
31 - test_integration_3d_1 (Timeout)
32 - test_integration_3d_2 (Timeout)
39 - test_integration_thermoelastic_1 (Timeout)
Errors while running CTest
Output from these tests are in: /var/jenkins/workspace/adamantine-nightly/build/Testing/Temporary/LastTest.log
Use "--rerun-failed --output-on-failure" to re-run the failed cases verbosely.
[Pipeline] }
[Pipeline] // dir
Post stage
[Pipeline] xunit
INFO: Processing CTest-Version 3.x (default)
[Pipeline] }
[Pipeline] // withEnv
[Pipeline] }
$ docker stop --time=1 0d121f69192242ea03d3812cc85c20feae9a56f13e3aa1c92266e1862add64e4
INFO: [CTest-Version 3.x (default)] - 1 test report file(s) were found with the pattern 'build/Testing/**/Test.xml' relative to '/var/jenkins/workspace/adamantine-nightly' for the testing framework 'CTest-Version 3.x (default)'.
$ docker rm -f --volumes 0d121f69192242ea03d3812cc85c20feae9a56f13e3aa1c92266e1862add64e4
[Pipeline] // withDockerContainer
[Pipeline] }
[Pipeline] // withEnv
[Pipeline] }
[Pipeline] // node
[Pipeline] }
[Pipeline] // stage
[Pipeline] }
Failed in branch CUDA
[Pipeline] // parallel
[Pipeline] }
[Pipeline] // stage
[Pipeline] }
[Pipeline] // timeout
[Pipeline] }
[Pipeline] // withEnv
[Pipeline] End of Pipeline
ERROR: script returned exit code 8
Finished: FAILURE