38: Rank: 0 | New parameters for member 1: 0.142225
38: 80% completed
38: Rank: 1 | New parameters for member 2: 0.107206
38: 90% completed
38: 100% completed
38: [1;34;49m/var/jenkins/workspace/adamantine-nightly/tests/test_integration_da_augmented.cc(19): Leaving test case "integration_3D_data_assimilation_augmented"; testing time: 38685492us
38: [1;34;49m/var/jenkins/workspace/adamantine-nightly/tests/test_integration_da_augmented.cc(19): Leaving test case "integration_3D_data_assimilation_augmented"; testing time: 38685807us
38: [0;39;49m[1;34;49mLeaving test module "Integration_Data_Assimilation_Augmented"; testing time: 38686153us
38: [0;39;49m
38: [1;32;49m*** No errors detected
38: [0;39;49m[0;39;49m[1;34;49mLeaving test module "Integration_Data_Assimilation_Augmented"; testing time: 38698361us
38: [0;39;49m
38: [1;32;49m*** No errors detected
38: [0;39;49m
38/48 Test #38: test_integration_da_augmented_2 .......... Passed 39.44 sec
test 40
Start 40: test_integration_thermoelastic_2
40: Test command: /usr/bin/mpiexec "-n" "2" "/var/jenkins/workspace/adamantine-nightly/build/bin/test_integration_thermoelastic"
40: Working Directory: /var/jenkins/workspace/adamantine-nightly/build/tests
40: Test timeout computed to be: 7200
40: Running 2 test cases...
40: [1;34;49mEntering test module "Integration_Thermoelastic"
40: [0;39;49m[1;34;49m/var/jenkins/workspace/adamantine-nightly/tests/test_integration_thermoelastic.cc(19): Entering test case "integration_thermoelastic"
40: Running 2 test cases...
40: [1;34;49mEntering test module "Integration_Thermoelastic"
40: [0;39;49m[1;34;49m/var/jenkins/workspace/adamantine-nightly/tests/test_integration_thermoelastic.cc(19): Entering test case "integration_thermoelastic"
32: 40% completed
32: n_time_step: 554 time: 5.53 n_dofs (thermal) after cell activation: 1218
32: n_time_step: 577 time: 5.76 n_dofs (thermal) after cell activation: 1219
32: n_time_step: 601 time: 6 n_dofs (thermal) after cell activation: 1220
32: 60% completed
32: n_time_step: 624 time: 6.23 n_dofs (thermal) after cell activation: 1221
32: n_time_step: 647 time: 6.46 n_dofs (thermal) after cell activation: 1222
31: 20% completed
34/48 Test #31: test_integration_3d_1 ....................***Timeout 7200.02 sec
32: n_time_step: 671 time: 6.7 n_dofs (thermal) after cell activation: 1223
32: n_time_step: 694 time: 6.93 n_dofs (thermal) after cell activation: 1224
32: 70% completed
32: n_time_step: 717 time: 7.16 n_dofs (thermal) after cell activation: 1226
40: [0;39;49m[0;39;49m10% completed
32: n_time_step: 740 time: 7.39 n_dofs (thermal) after cell activation: 1227
32: n_time_step: 763 time: 7.62 n_dofs (thermal) after cell activation: 1228
32: n_time_step: 787 time: 7.86 n_dofs (thermal) after cell activation: 1229
32: 80% completed
32: 50% completed
39: 50% completed
32: n_time_step: 810 time: 8.09 n_dofs (thermal) after cell activation: 1230
32: n_time_step: 833 time: 8.32 n_dofs (thermal) after cell activation: 1231
39/48 Test #32: test_integration_3d_2 ....................***Timeout 7200.02 sec
test 42
Start 42: test_material_deposition_2
42: Test command: /usr/bin/mpiexec "-n" "2" "/var/jenkins/workspace/adamantine-nightly/build/bin/test_material_deposition"
42: Working Directory: /var/jenkins/workspace/adamantine-nightly/build/tests
42: Test timeout computed to be: 7200
42: Running 11 test cases...
42: [1;34;49mEntering test module "MaterialDeposition"
42: [0;39;49m[1;34;49m/var/jenkins/workspace/adamantine-nightly/tests/test_material_deposition.cc(50): Entering test case "read_material_deposition_file_2d"
42: Running 11 test cases...
42: [1;34;49mEntering test module "MaterialDeposition"
42: [0;39;49m[1;34;49m/var/jenkins/workspace/adamantine-nightly/tests/test_material_deposition.cc(50): Entering test case "read_material_deposition_file_2d"
42: [0;39;49m[1;34;49m/var/jenkins/workspace/adamantine-nightly/tests/test_material_deposition.cc(50): Leaving test case "read_material_deposition_file_2d"; testing time: 293us
42: [0;39;49m[1;34;49m/var/jenkins/workspace/adamantine-nightly/tests/test_material_deposition.cc(92): Entering test case "read_material_deposition_file_3d"
42: [0;39;49m[1;34;49m/var/jenkins/workspace/adamantine-nightly/tests/test_material_deposition.cc(50): Leaving test case "read_material_deposition_file_2d"; testing time: 370us
42: [0;39;49m[1;34;49m/var/jenkins/workspace/adamantine-nightly/tests/test_material_deposition.cc(92): Leaving test case "read_material_deposition_file_3d"; testing time: 183us
42: [0;39;49m[1;33;49m/var/jenkins/workspace/adamantine-nightly/tests/test_material_deposition.cc(134): Test case "get_elements_to_activate_2d" is skipped because precondition failed: the test only works in serial
42: [0;39;49m[1;34;49m/var/jenkins/workspace/adamantine-nightly/tests/test_material_deposition.cc(92): Entering test case "read_material_deposition_file_3d"
42: [0;39;49m[1;33;49m/var/jenkins/workspace/adamantine-nightly/tests/test_material_deposition.cc(195): Test case "get_elements_to_activate_3d" is skipped because precondition failed: the test only works in serial
42: [0;39;49m[1;34;49m/var/jenkins/workspace/adamantine-nightly/tests/test_material_deposition.cc(262): Entering test case "material_deposition"
42: [0;39;49m[1;34;49m/var/jenkins/workspace/adamantine-nightly/tests/test_material_deposition.cc(92): Leaving test case "read_material_deposition_file_3d"; testing time: 189us
42: [0;39;49m[1;33;49m/var/jenkins/workspace/adamantine-nightly/tests/test_material_deposition.cc(134): Test case "get_elements_to_activate_2d" is skipped because precondition failed: the test only works in serial
42: [0;39;49m[1;33;49m/var/jenkins/workspace/adamantine-nightly/tests/test_material_deposition.cc(195): Test case "get_elements_to_activate_3d" is skipped because precondition failed: the test only works in serial
42: [0;39;49m[1;34;49m/var/jenkins/workspace/adamantine-nightly/tests/test_material_deposition.cc(262): Entering test case "material_deposition"
42: [0;39;49m[1;34;49m/var/jenkins/workspace/adamantine-nightly/tests/test_material_deposition.cc(262): Leaving test case "material_deposition"; testing time: 10765042us
42: [0;39;49m[1;34;49m/var/jenkins/workspace/adamantine-nightly/tests/test_material_deposition.cc(395): Entering test case "deposition_from_scan_path_2d"
42: [0;39;49m[1;34;49m/var/jenkins/workspace/adamantine-nightly/tests/test_material_deposition.cc(395): Leaving test case "deposition_from_scan_path_2d"; testing time: 251us
42: [0;39;49m[1;34;49m/var/jenkins/workspace/adamantine-nightly/tests/test_material_deposition.cc(445): Entering test case "deposition_from_scan_path_3d"
42: [0;39;49m[1;34;49m/var/jenkins/workspace/adamantine-nightly/tests/test_material_deposition.cc(262): Leaving test case "material_deposition"; testing time: 10765274us
42: [0;39;49m[1;34;49m/var/jenkins/workspace/adamantine-nightly/tests/test_material_deposition.cc(445): Leaving test case "deposition_from_scan_path_3d"; testing time: 184us
42: [0;39;49m[1;34;49m/var/jenkins/workspace/adamantine-nightly/tests/test_material_deposition.cc(499): Entering test case "deposition_from_L_scan_path_3d"
42: [0;39;49m[1;34;49m/var/jenkins/workspace/adamantine-nightly/tests/test_material_deposition.cc(499): Leaving test case "deposition_from_L_scan_path_3d"; testing time: 193us
42: [0;39;49m[1;34;49m/var/jenkins/workspace/adamantine-nightly/tests/test_material_deposition.cc(586): Entering test case "deposition_from_diagonal_scan_path_3d"
42: [0;39;49m[1;34;49m/var/jenkins/workspace/adamantine-nightly/tests/test_material_deposition.cc(586): Leaving test case "deposition_from_diagonal_scan_path_3d"; testing time: 163us
42: [0;39;49m[1;34;49m/var/jenkins/workspace/adamantine-nightly/tests/test_material_deposition.cc(640): Entering test case "merge_multiple_deposition_paths"
42: [0;39;49m[1;34;49m/var/jenkins/workspace/adamantine-nightly/tests/test_material_deposition.cc(640): Leaving test case "merge_multiple_deposition_paths"; testing time: 114us
42: [0;39;49m[1;34;49m/var/jenkins/workspace/adamantine-nightly/tests/test_material_deposition.cc(697): Entering test case "deposition_quaternion_straight_line"
42: [0;39;49m[1;34;49m/var/jenkins/workspace/adamantine-nightly/tests/test_material_deposition.cc(697): Leaving test case "deposition_quaternion_straight_line"; testing time: 503us
42: [0;39;49m[1;34;49mLeaving test module "MaterialDeposition"; testing time: 10768513us
42: [0;39;49m
42: [1;32;49m*** No errors detected
42: [0;39;49m[0;39;49m[1;34;49m/var/jenkins/workspace/adamantine-nightly/tests/test_material_deposition.cc(395): Entering test case "deposition_from_scan_path_2d"
42: [0;39;49m[1;34;49m/var/jenkins/workspace/adamantine-nightly/tests/test_material_deposition.cc(395): Leaving test case "deposition_from_scan_path_2d"; testing time: 317us
42: [0;39;49m[1;34;49m/var/jenkins/workspace/adamantine-nightly/tests/test_material_deposition.cc(445): Entering test case "deposition_from_scan_path_3d"
42: [0;39;49m[1;34;49m/var/jenkins/workspace/adamantine-nightly/tests/test_material_deposition.cc(445): Leaving test case "deposition_from_scan_path_3d"; testing time: 173us
42: [0;39;49m[1;34;49m/var/jenkins/workspace/adamantine-nightly/tests/test_material_deposition.cc(499): Entering test case "deposition_from_L_scan_path_3d"
42: [0;39;49m[1;34;49m/var/jenkins/workspace/adamantine-nightly/tests/test_material_deposition.cc(499): Leaving test case "deposition_from_L_scan_path_3d"; testing time: 204us
42: [0;39;49m[1;34;49m/var/jenkins/workspace/adamantine-nightly/tests/test_material_deposition.cc(586): Entering test case "deposition_from_diagonal_scan_path_3d"
42: [0;39;49m[1;34;49m/var/jenkins/workspace/adamantine-nightly/tests/test_material_deposition.cc(586): Leaving test case "deposition_from_diagonal_scan_path_3d"; testing time: 168us
42: [0;39;49m[1;34;49m/var/jenkins/workspace/adamantine-nightly/tests/test_material_deposition.cc(640): Entering test case "merge_multiple_deposition_paths"
42: [0;39;49m[1;34;49m/var/jenkins/workspace/adamantine-nightly/tests/test_material_deposition.cc(640): Leaving test case "merge_multiple_deposition_paths"; testing time: 110us
42: [0;39;49m[1;34;49m/var/jenkins/workspace/adamantine-nightly/tests/test_material_deposition.cc(697): Entering test case "deposition_quaternion_straight_line"
42: [0;39;49m[1;34;49m/var/jenkins/workspace/adamantine-nightly/tests/test_material_deposition.cc(697): Leaving test case "deposition_quaternion_straight_line"; testing time: 519us
42: [0;39;49m[1;34;49mLeaving test module "MaterialDeposition"; testing time: 10781220us
42: [0;39;49m
42: [1;32;49m*** No errors detected
42: [0;39;49m
40/48 Test #42: test_material_deposition_2 ............... Passed 11.54 sec
test 44
Start 44: test_microstructure_2
44: Test command: /usr/bin/mpiexec "-n" "2" "/var/jenkins/workspace/adamantine-nightly/build/bin/test_microstructure"
44: Working Directory: /var/jenkins/workspace/adamantine-nightly/build/tests
44: Test timeout computed to be: 7200
44: Running 1 test case...
44: [1;34;49mEntering test module "MicroStructure"
44: [0;39;49m[1;34;49m/var/jenkins/workspace/adamantine-nightly/tests/test_microstructure.cc(53): Entering test case "G_and_R"
44: Running 1 test case...
44: [1;34;49mEntering test module "MicroStructure"
44: [0;39;49m[1;34;49m/var/jenkins/workspace/adamantine-nightly/tests/test_microstructure.cc(53): Entering test case "G_and_R"
44: [0;39;49m[1;36;49mTest case G_and_R did not check any assertions[0;39;49m
44: [1;34;49m/var/jenkins/workspace/adamantine-nightly/tests/test_microstructure.cc(53): Leaving test case "G_and_R"; testing time: 214362us
44: [0;39;49m[1;34;49mLeaving test module "MicroStructure"; testing time: 214422us
44: [0;39;49m
44: [1;32;49m*** No errors detected
44: [0;39;49m[0;39;49m[1;34;49m/var/jenkins/workspace/adamantine-nightly/tests/test_microstructure.cc(53): Leaving test case "G_and_R"; testing time: 215760us
44: [0;39;49m[1;34;49mLeaving test module "MicroStructure"; testing time: 215828us
44:
44: [1;32;49m*** No errors detected
44: [0;39;49m[0;39;49m
41/48 Test #44: test_microstructure_2 .................... Passed 0.96 sec
test 46
Start 46: test_thermal_physics_2
46: Test command: /usr/bin/mpiexec "-n" "2" "/var/jenkins/workspace/adamantine-nightly/build/bin/test_thermal_physics"
46: Working Directory: /var/jenkins/workspace/adamantine-nightly/build/tests
46: Test timeout computed to be: 7200
46: Running 7 test cases...
46: [1;34;49mEntering test module "ThermalPhysics"
46: [0;39;49m[1;34;49m/var/jenkins/workspace/adamantine-nightly/tests/test_thermal_physics.cc(15): Entering test case "thermal_2d_explicit_host"
46: Running 7 test cases...
46: [1;34;49mEntering test module "ThermalPhysics"
46: [0;39;49m[1;34;49m/var/jenkins/workspace/adamantine-nightly/tests/test_thermal_physics.cc(15): Entering test case "thermal_2d_explicit_host"
46: [0;39;49m[1;34;49m/var/jenkins/workspace/adamantine-nightly/tests/test_thermal_physics.cc(15): Leaving test case "thermal_2d_explicit_host"; testing time: 163829us
46: [0;39;49m[1;34;49m/var/jenkins/workspace/adamantine-nightly/tests/test_thermal_physics.cc(28): Entering test case "thermal_2d_manufactured_solution_host"
46: [0;39;49m[1;34;49m/var/jenkins/workspace/adamantine-nightly/tests/test_thermal_physics.cc(15): Leaving test case "thermal_2d_explicit_host"; testing time: 163933us
46: [0;39;49m[1;34;49m/var/jenkins/workspace/adamantine-nightly/tests/test_thermal_physics.cc(28): Entering test case "thermal_2d_manufactured_solution_host"
46: [0;39;49m[1;34;49m/var/jenkins/workspace/adamantine-nightly/tests/test_thermal_physics.cc(28): Leaving test case "thermal_2d_manufactured_solution_host"; testing time: 202016us
46: [0;39;49m[1;34;49m/var/jenkins/workspace/adamantine-nightly/tests/test_thermal_physics.cc(33): Entering test case "initial_temperature_host"
46: [0;39;49m[1;34;49m/var/jenkins/workspace/adamantine-nightly/tests/test_thermal_physics.cc(28): Leaving test case "thermal_2d_manufactured_solution_host"; testing time: 201774us
46: [0;39;49m[1;34;49m/var/jenkins/workspace/adamantine-nightly/tests/test_thermal_physics.cc(33): Entering test case "initial_temperature_host"
46: [0;39;49m[1;34;49m/var/jenkins/workspace/adamantine-nightly/tests/test_thermal_physics.cc(33): Leaving test case "initial_temperature_host"; testing time: 174544us
46: [0;39;49m[1;34;49m/var/jenkins/workspace/adamantine-nightly/tests/test_thermal_physics.cc(38): Entering test case "energy_conservation_host"
46: [0;39;49m[1;34;49m/var/jenkins/workspace/adamantine-nightly/tests/test_thermal_physics.cc(33): Leaving test case "initial_temperature_host"; testing time: 174668us
46: [0;39;49m[1;34;49m/var/jenkins/workspace/adamantine-nightly/tests/test_thermal_physics.cc(38): Entering test case "energy_conservation_host"
46: [0;39;49m[1;34;49m/var/jenkins/workspace/adamantine-nightly/tests/test_thermal_physics.cc(38): Leaving test case "energy_conservation_host"; testing time: 4688680us
46: [0;39;49m[1;34;49m/var/jenkins/workspace/adamantine-nightly/tests/test_thermal_physics.cc(38): Leaving test case "energy_conservation_host"; testing time: 4688640us
46: [0;39;49m[1;34;49m/var/jenkins/workspace/adamantine-nightly/tests/test_thermal_physics.cc(43): Entering test case "radiation_bcs_host"
46: [0;39;49m[1;34;49m/var/jenkins/workspace/adamantine-nightly/tests/test_thermal_physics.cc(43): Entering test case "radiation_bcs_host"
46: [0;39;49m[1;34;49m/var/jenkins/workspace/adamantine-nightly/tests/test_thermal_physics.cc(43): Leaving test case "radiation_bcs_host"; testing time: 2750414us
46: [0;39;49m[1;34;49m/var/jenkins/workspace/adamantine-nightly/tests/test_thermal_physics.cc(43): Leaving test case "radiation_bcs_host"; testing time: 2762592us
46: [0;39;49m[1;34;49m/var/jenkins/workspace/adamantine-nightly/tests/test_thermal_physics.cc(48): Entering test case "convection_bcs_host"
46: [0;39;49m[1;34;49m/var/jenkins/workspace/adamantine-nightly/tests/test_thermal_physics.cc(48): Entering test case "convection_bcs_host"
40: 20% completed
46: [0;39;49m[1;34;49m/var/jenkins/workspace/adamantine-nightly/tests/test_thermal_physics.cc(48): Leaving test case "convection_bcs_host"; testing time: 45787905us
46: [0;39;49m[1;34;49m/var/jenkins/workspace/adamantine-nightly/tests/test_thermal_physics.cc(53): Entering test case "reference_temperature_host"
46: [0;39;49m[1;34;49m/var/jenkins/workspace/adamantine-nightly/tests/test_thermal_physics.cc(48): Leaving test case "convection_bcs_host"; testing time: 45800527us
46: [0;39;49m[1;34;49m/var/jenkins/workspace/adamantine-nightly/tests/test_thermal_physics.cc(53): Entering test case "reference_temperature_host"
46: [0;39;49m[1;34;49m/var/jenkins/workspace/adamantine-nightly/tests/test_thermal_physics.cc(53): Leaving test case "reference_temperature_host"; testing time: 131708us
46: [0;39;49m[1;34;49mLeaving test module "ThermalPhysics"; testing time: 53924956us
46: [0;39;49m
46: [1;32;49m*** No errors detected
46: [0;39;49m[0;39;49m[1;34;49m/var/jenkins/workspace/adamantine-nightly/tests/test_thermal_physics.cc(53): Leaving test case "reference_temperature_host"; testing time: 168177us
46: [0;39;49m[1;34;49mLeaving test module "ThermalPhysics"; testing time: 53961168us
46: [0;39;49m
46: [1;32;49m*** No errors detected
46: [0;39;49m
42/48 Test #46: test_thermal_physics_2 ................... Passed 54.68 sec
test 48
Start 48: test_ensemble_management_2
48: Test command: /usr/bin/mpiexec "-n" "2" "/var/jenkins/workspace/adamantine-nightly/build/bin/test_ensemble_management"
48: Working Directory: /var/jenkins/workspace/adamantine-nightly/build/tests
48: Test timeout computed to be: 7200
48: Running 1 test case...
48: [1;34;49mEntering test module "EnsembleManagement"
48: [0;39;49m[1;34;49m/var/jenkins/workspace/adamantine-nightly/tests/test_ensemble_management.cc(17): Entering test case "database_ensemble"
48: Running 1 test case...
48: [1;34;49mEntering test module "EnsembleManagement"
48: [0;39;49m[1;34;49m/var/jenkins/workspace/adamantine-nightly/tests/test_ensemble_management.cc(17): Entering test case "database_ensemble"
48: [0;39;49m[1;34;49m/var/jenkins/workspace/adamantine-nightly/tests/test_ensemble_management.cc(17): Leaving test case "database_ensemble"; testing time: 362us
48: [0;39;49m[1;34;49mLeaving test module "EnsembleManagement"; testing time: 387us
48: [0;39;49m
48: [1;32;49m*** No errors detected
48: [0;39;49m[0;39;49m[1;34;49m/var/jenkins/workspace/adamantine-nightly/tests/test_ensemble_management.cc(17): Leaving test case "database_ensemble"; testing time: 2749us
48: [0;39;49m[1;34;49mLeaving test module "EnsembleManagement"; testing time: 2789us
48: [0;39;49m
48: [1;32;49m*** No errors detected
48: [0;39;49m
43/48 Test #48: test_ensemble_management_2 ............... Passed 0.71 sec
35/48 Test #39: test_integration_thermoelastic_1 .........***Timeout 7200.11 sec
test 34
Start 34: test_integration_3d_amr_2
34: Test command: /usr/bin/mpiexec "-n" "2" "/var/jenkins/workspace/adamantine-nightly/build/bin/test_integration_3d_amr"
34: Working Directory: /var/jenkins/workspace/adamantine-nightly/build/tests
34: Test timeout computed to be: 7200
34: Running 2 test cases...
34: [1;34;49mEntering test module "Integration_3D_AMR"
34: [0;39;49m[1;34;49m/var/jenkins/workspace/adamantine-nightly/tests/test_integration_3d_amr.cc(19): Entering test case "integration_3D_amr"
34: Running 2 test cases...
34: [1;34;49mEntering test module "Integration_3D_AMR"
34: [0;39;49m[1;34;49m/var/jenkins/workspace/adamantine-nightly/tests/test_integration_3d_amr.cc(19): Entering test case "integration_3D_amr"
34: [0;39;49m10% completed
34: 20% completed
34: 30% completed
34: 40% completed
34: 50% completed
34: 60% completed
34: 70% completed
34: 80% completed
34: 90% completed
34: 100% completed
34: [0;39;49m[1;34;49m/var/jenkins/workspace/adamantine-nightly/tests/test_integration_3d_amr.cc(19): Leaving test case "integration_3D_amr"; testing time: 15076350us
34: [0;39;49m[1;34;49m/var/jenkins/workspace/adamantine-nightly/tests/test_integration_3d_amr.cc(60): Entering test case "integration_3D_amr_refine_coarsen"
34: [1;34;49m/var/jenkins/workspace/adamantine-nightly/tests/test_integration_3d_amr.cc(19): Leaving test case "integration_3D_amr"; testing time: 15012194us
34: [0;39;49m[1;34;49m/var/jenkins/workspace/adamantine-nightly/tests/test_integration_3d_amr.cc(60): Entering test case "integration_3D_amr_refine_coarsen"
40: 30% completed
34: [0;39;49m10% completed
34: 20% completed
34: 30% completed
34: 40% completed
34: 50% completed
34: 60% completed
34: 70% completed
34: 80% completed
34: 90% completed
34: 100% completed
34: [0;39;49m[1;34;49m/var/jenkins/workspace/adamantine-nightly/tests/test_integration_3d_amr.cc(60): Leaving test case "integration_3D_amr_refine_coarsen"; testing time: 141701451us
34: [0;39;49m[1;34;49mLeaving test module "Integration_3D_AMR"; testing time: 156778787us
34: [0;39;49m
34: [1;32;49m*** No errors detected
34: [0;39;49m[1;34;49m/var/jenkins/workspace/adamantine-nightly/tests/test_integration_3d_amr.cc(60): Leaving test case "integration_3D_amr_refine_coarsen"; testing time: 141701440us
34: [0;39;49m[1;34;49mLeaving test module "Integration_3D_AMR"; testing time: 156714814us
34: [0;39;49m
34: [1;32;49m*** No errors detected
34: [0;39;49m
36/48 Test #34: test_integration_3d_amr_2 ................ Passed 164.54 sec
test 36
Start 36: test_integration_3d_amr_device_2
36: Test command: /usr/bin/mpiexec "-n" "2" "/var/jenkins/workspace/adamantine-nightly/build/bin/test_integration_3d_amr_device"
36: Working Directory: /var/jenkins/workspace/adamantine-nightly/build/tests
36: Test timeout computed to be: 7200
32: 60% completed
36: Running 1 test case...
36: [1;34;49mEntering test module "Integration_3D_AMR"
36: [0;39;49m[1;34;49m/var/jenkins/workspace/adamantine-nightly/tests/test_integration_3d_amr_device.cc(19): Entering test case "integration_3D_amr_device"
36: Running 1 test case...
36: [1;34;49mEntering test module "Integration_3D_AMR"
36: [0;39;49m[1;34;49m/var/jenkins/workspace/adamantine-nightly/tests/test_integration_3d_amr_device.cc(19): Entering test case "integration_3D_amr_device"
40: 40% completed
36: [0;39;49m10% completed
36: 20% completed
36: 30% completed
36: 40% completed
36: 50% completed
36: 60% completed
36: 70% completed
36: 80% completed
36: 90% completed
36: 100% completed
36: [0;39;49m[1;34;49m/var/jenkins/workspace/adamantine-nightly/tests/test_integration_3d_amr_device.cc(19): Leaving test case "integration_3D_amr_device"; testing time: 123255589us
36: [0;39;49m[1;34;49mLeaving test module "Integration_3D_AMR"; testing time: 123256676us
36: [0;39;49m
36: [1;32;49m*** No errors detected
36: [0;39;49m[1;34;49m/var/jenkins/workspace/adamantine-nightly/tests/test_integration_3d_amr_device.cc(19): Leaving test case "integration_3D_amr_device"; testing time: 123183841us
36: [0;39;49m[1;34;49mLeaving test module "Integration_3D_AMR"; testing time: 123185116us
36: [0;39;49m
36: [1;32;49m*** No errors detected
36: [0;39;49m
37/48 Test #36: test_integration_3d_amr_device_2 ......... Passed 131.73 sec
test 38
Start 38: test_integration_da_augmented_2
38: Test command: /usr/bin/mpiexec "-n" "2" "/var/jenkins/workspace/adamantine-nightly/build/bin/test_integration_da_augmented"
38: Working Directory: /var/jenkins/workspace/adamantine-nightly/build/tests
38: Test timeout computed to be: 7200
40: 50% completed
38: Running 1 test case...
38: [1;34;49mEntering test module "Integration_Data_Assimilation_Augmented"
38: [0;39;49m[1;34;49m/var/jenkins/workspace/adamantine-nightly/tests/test_integration_da_augmented.cc(19): Entering test case "integration_3D_data_assimilation_augmented"
38: Running 1 test case...
38: [1;34;49mEntering test module "Integration_Data_Assimilation_Augmented"
38: [0;39;49m[1;34;49m/var/jenkins/workspace/adamantine-nightly/tests/test_integration_da_augmented.cc(19): Entering test case "integration_3D_data_assimilation_augmented"
38: [0;39;49mReading the experimental log file...
38: Done. Log entries found for 1 camera(s), with 2 frame(s).
38: Starting the main time stepping loop...
38: 10% completed
38: 20% completed
38: 30% completed
38: [0;39;49mRank: 1 | Old parameters for member 2: 0.446065
38: Rank: 1 | Number expt sites mapped to DOFs: 2
38: 40% completed
38: 50% completed
38: 60% completed
38: 70% completed
38: Performing data assimilation at time 0.04...
38: Rank: 0 | Old parameters for member 0: 0.413453
38: Rank: 0 | Old parameters for member 1: 0.385362
38: Rank: 0 | Number expt sites mapped to DOFs: 2
38: Getting the perturbed innovation...
38: Applying the Kalman gain...
38: Updating the ensemble members...
38: Rank: 1 | New parameters for member 2: 0.107206
38: Done.
38: Rank: 0 | New parameters for member 0: 0.121104
38: Rank: 0 | New parameters for member 1: 0.142225
38: 80% completed
38: 90% completed
38: 100% completed
38: [1;34;49m/var/jenkins/workspace/adamantine-nightly/tests/test_integration_da_augmented.cc(19): Leaving test case "integration_3D_data_assimilation_augmented"; testing time: 68603684us
38: [0;39;49m[1;34;49mLeaving test module "Integration_Data_Assimilation_Augmented"; testing time: 68604143us
38: [0;39;49m[1;34;49m/var/jenkins/workspace/adamantine-nightly/tests/test_integration_da_augmented.cc(19): Leaving test case "integration_3D_data_assimilation_augmented"; testing time: 68618125us
38: [0;39;49m[1;34;49mLeaving test module "Integration_Data_Assimilation_Augmented"; testing time: 68618476us
38: [0;39;49m
38: [1;32;49m*** No errors detected
38: [0;39;49m
38: [1;32;49m*** No errors detected
38: [0;39;49m
38/48 Test #38: test_integration_da_augmented_2 .......... Passed 76.44 sec
test 40
Start 40: test_integration_thermoelastic_2
40: Test command: /usr/bin/mpiexec "-n" "2" "/var/jenkins/workspace/adamantine-nightly/build/bin/test_integration_thermoelastic"
40: Working Directory: /var/jenkins/workspace/adamantine-nightly/build/tests
40: Test timeout computed to be: 7200
40: Running 2 test cases...
40: [1;34;49mEntering test module "Integration_Thermoelastic"
40: [0;39;49m[1;34;49m/var/jenkins/workspace/adamantine-nightly/tests/test_integration_thermoelastic.cc(19): Entering test case "integration_thermoelastic"
40: Running 2 test cases...
40: [1;34;49mEntering test module "Integration_Thermoelastic"
40: [0;39;49m[1;34;49m/var/jenkins/workspace/adamantine-nightly/tests/test_integration_thermoelastic.cc(19): Entering test case "integration_thermoelastic"
40: 60% completed
40: 70% completed
40: 80% completed
32: 70% completed
40: 90% completed
40: 100% completed
40: [1;34;49m/var/jenkins/workspace/adamantine-nightly/tests/test_integration_thermoelastic.cc(19): Leaving test case "integration_thermoelastic"; testing time: 1796728602us
40: [0;39;49m[1;34;49m/var/jenkins/workspace/adamantine-nightly/tests/test_integration_thermoelastic.cc(47): Entering test case "integration_thermoelastic_add_material"
40: [1;34;49m/var/jenkins/workspace/adamantine-nightly/tests/test_integration_thermoelastic.cc(19): Leaving test case "integration_thermoelastic"; testing time: 1796728321us
40: [0;39;49m[1;34;49m/var/jenkins/workspace/adamantine-nightly/tests/test_integration_thermoelastic.cc(47): Entering test case "integration_thermoelastic_add_material"
40: [0;39;49m[0;39;49m10% completed
40: [0;39;49m[0;39;49m10% completed
40: 20% completed
32: 80% completed
40: 30% completed
40: 40% completed
39/48 Test #32: test_integration_3d_2 ....................***Timeout 7200.11 sec
test 42
Start 42: test_material_deposition_2
42: Test command: /usr/bin/mpiexec "-n" "2" "/var/jenkins/workspace/adamantine-nightly/build/bin/test_material_deposition"
42: Working Directory: /var/jenkins/workspace/adamantine-nightly/build/tests
42: Test timeout computed to be: 7200
42: Running 11 test cases...
42: [1;34;49mEntering test module "MaterialDeposition"
42: [0;39;49m[1;34;49m/var/jenkins/workspace/adamantine-nightly/tests/test_material_deposition.cc(50): Entering test case "read_material_deposition_file_2d"
42: [0;39;49m[1;34;49m/var/jenkins/workspace/adamantine-nightly/tests/test_material_deposition.cc(50): Leaving test case "read_material_deposition_file_2d"; testing time: 6120us
42: [0;39;49m[1;34;49m/var/jenkins/workspace/adamantine-nightly/tests/test_material_deposition.cc(92): Entering test case "read_material_deposition_file_3d"
42: [0;39;49m[1;34;49m/var/jenkins/workspace/adamantine-nightly/tests/test_material_deposition.cc(92): Leaving test case "read_material_deposition_file_3d"; testing time: 11355us
42: [0;39;49m[1;33;49m/var/jenkins/workspace/adamantine-nightly/tests/test_material_deposition.cc(134): Test case "get_elements_to_activate_2d" is skipped because precondition failed: the test only works in serial
42: [0;39;49m[1;33;49m/var/jenkins/workspace/adamantine-nightly/tests/test_material_deposition.cc(195): Test case "get_elements_to_activate_3d" is skipped because precondition failed: the test only works in serial
42: [0;39;49m[1;34;49m/var/jenkins/workspace/adamantine-nightly/tests/test_material_deposition.cc(262): Entering test case "material_deposition"
42: Running 11 test cases...
42: [1;34;49mEntering test module "MaterialDeposition"
42: [0;39;49m[1;34;49m/var/jenkins/workspace/adamantine-nightly/tests/test_material_deposition.cc(50): Entering test case "read_material_deposition_file_2d"
42: [0;39;49m[1;34;49m/var/jenkins/workspace/adamantine-nightly/tests/test_material_deposition.cc(50): Leaving test case "read_material_deposition_file_2d"; testing time: 443us
42: [0;39;49m[1;34;49m/var/jenkins/workspace/adamantine-nightly/tests/test_material_deposition.cc(92): Entering test case "read_material_deposition_file_3d"
42: [0;39;49m[1;34;49m/var/jenkins/workspace/adamantine-nightly/tests/test_material_deposition.cc(92): Leaving test case "read_material_deposition_file_3d"; testing time: 268us
42: [0;39;49m[1;33;49m/var/jenkins/workspace/adamantine-nightly/tests/test_material_deposition.cc(134): Test case "get_elements_to_activate_2d" is skipped because precondition failed: the test only works in serial
42: [0;39;49m[1;33;49m/var/jenkins/workspace/adamantine-nightly/tests/test_material_deposition.cc(195): Test case "get_elements_to_activate_3d" is skipped because precondition failed: the test only works in serial
42: [0;39;49m[1;34;49m/var/jenkins/workspace/adamantine-nightly/tests/test_material_deposition.cc(262): Entering test case "material_deposition"
42: [0;39;49m[1;34;49m/var/jenkins/workspace/adamantine-nightly/tests/test_material_deposition.cc(262): Leaving test case "material_deposition"; testing time: 16770549us
42: [0;39;49m[1;34;49m/var/jenkins/workspace/adamantine-nightly/tests/test_material_deposition.cc(395): Entering test case "deposition_from_scan_path_2d"
42: [0;39;49m[1;34;49m/var/jenkins/workspace/adamantine-nightly/tests/test_material_deposition.cc(395): Leaving test case "deposition_from_scan_path_2d"; testing time: 12059us
42: [0;39;49m[1;34;49m/var/jenkins/workspace/adamantine-nightly/tests/test_material_deposition.cc(445): Entering test case "deposition_from_scan_path_3d"
42: [0;39;49m[1;34;49m/var/jenkins/workspace/adamantine-nightly/tests/test_material_deposition.cc(262): Leaving test case "material_deposition"; testing time: 16792196us
42: [0;39;49m[1;34;49m/var/jenkins/workspace/adamantine-nightly/tests/test_material_deposition.cc(395): Entering test case "deposition_from_scan_path_2d"
42: [0;39;49m[1;34;49m/var/jenkins/workspace/adamantine-nightly/tests/test_material_deposition.cc(445): Leaving test case "deposition_from_scan_path_3d"; testing time: 271us
42: [0;39;49m[1;34;49m/var/jenkins/workspace/adamantine-nightly/tests/test_material_deposition.cc(499): Entering test case "deposition_from_L_scan_path_3d"
42: [0;39;49m[1;34;49m/var/jenkins/workspace/adamantine-nightly/tests/test_material_deposition.cc(395): Leaving test case "deposition_from_scan_path_2d"; testing time: 336us
42: [0;39;49m[1;34;49m/var/jenkins/workspace/adamantine-nightly/tests/test_material_deposition.cc(445): Entering test case "deposition_from_scan_path_3d"
42: [0;39;49m[1;34;49m/var/jenkins/workspace/adamantine-nightly/tests/test_material_deposition.cc(445): Leaving test case "deposition_from_scan_path_3d"; testing time: 224us
42: [0;39;49m[1;34;49m/var/jenkins/workspace/adamantine-nightly/tests/test_material_deposition.cc(499): Entering test case "deposition_from_L_scan_path_3d"
42: [0;39;49m[1;34;49m/var/jenkins/workspace/adamantine-nightly/tests/test_material_deposition.cc(499): Leaving test case "deposition_from_L_scan_path_3d"; testing time: 10430us
42: [0;39;49m[1;34;49m/var/jenkins/workspace/adamantine-nightly/tests/test_material_deposition.cc(586): Entering test case "deposition_from_diagonal_scan_path_3d"
42: [0;39;49m[1;34;49m/var/jenkins/workspace/adamantine-nightly/tests/test_material_deposition.cc(499): Leaving test case "deposition_from_L_scan_path_3d"; testing time: 12247us
42: [0;39;49m[1;34;49m/var/jenkins/workspace/adamantine-nightly/tests/test_material_deposition.cc(586): Entering test case "deposition_from_diagonal_scan_path_3d"
42: [0;39;49m[1;34;49m/var/jenkins/workspace/adamantine-nightly/tests/test_material_deposition.cc(586): Leaving test case "deposition_from_diagonal_scan_path_3d"; testing time: 4804us
42: [0;39;49m[1;34;49m/var/jenkins/workspace/adamantine-nightly/tests/test_material_deposition.cc(640): Entering test case "merge_multiple_deposition_paths"
42: [0;39;49m[1;34;49m/var/jenkins/workspace/adamantine-nightly/tests/test_material_deposition.cc(640): Leaving test case "merge_multiple_deposition_paths"; testing time: 151us
42: [0;39;49m[1;34;49m/var/jenkins/workspace/adamantine-nightly/tests/test_material_deposition.cc(697): Entering test case "deposition_quaternion_straight_line"
42: [0;39;49m[1;34;49m/var/jenkins/workspace/adamantine-nightly/tests/test_material_deposition.cc(586): Leaving test case "deposition_from_diagonal_scan_path_3d"; testing time: 11759us
42: [0;39;49m[1;34;49m/var/jenkins/workspace/adamantine-nightly/tests/test_material_deposition.cc(640): Entering test case "merge_multiple_deposition_paths"
42: [0;39;49m[1;34;49m/var/jenkins/workspace/adamantine-nightly/tests/test_material_deposition.cc(640): Leaving test case "merge_multiple_deposition_paths"; testing time: 135us
42: [0;39;49m[1;34;49m/var/jenkins/workspace/adamantine-nightly/tests/test_material_deposition.cc(697): Entering test case "deposition_quaternion_straight_line"
42:
42: [1;32;49m*** No errors detected
42: [0;39;49m[0;39;49m[1;34;49m/var/jenkins/workspace/adamantine-nightly/tests/test_material_deposition.cc(697): Leaving test case "deposition_quaternion_straight_line"; testing time: 2167us
42: [0;39;49m[1;34;49mLeaving test module "MaterialDeposition"; testing time: 16836705us
42: [0;39;49m[0;39;49m[1;34;49m/var/jenkins/workspace/adamantine-nightly/tests/test_material_deposition.cc(697): Leaving test case "deposition_quaternion_straight_line"; testing time: 8407us
42: [0;39;49m[1;34;49mLeaving test module "MaterialDeposition"; testing time: 16811271us
42: [0;39;49m
42: [1;32;49m*** No errors detected
42: [0;39;49m
40/48 Test #42: test_material_deposition_2 ............... Passed 22.71 sec
test 44
Start 44: test_microstructure_2
44: Test command: /usr/bin/mpiexec "-n" "2" "/var/jenkins/workspace/adamantine-nightly/build/bin/test_microstructure"
44: Working Directory: /var/jenkins/workspace/adamantine-nightly/build/tests
44: Test timeout computed to be: 7200
44: Running 1 test case...
44: [1;34;49mEntering test module "MicroStructure"
44: [0;39;49m[1;34;49m/var/jenkins/workspace/adamantine-nightly/tests/test_microstructure.cc(53): Entering test case "G_and_R"
44: Running 1 test case...
44: [1;34;49mEntering test module "MicroStructure"
44: [0;39;49m[1;34;49m/var/jenkins/workspace/adamantine-nightly/tests/test_microstructure.cc(53): Entering test case "G_and_R"
44: [0;39;49m[1;36;49mTest case G_and_R did not check any assertions[0;39;49m
44: [1;34;49m/var/jenkins/workspace/adamantine-nightly/tests/test_microstructure.cc(53): Leaving test case "G_and_R"; testing time: 440090us
44: [0;39;49m[1;34;49mLeaving test module "MicroStructure"; testing time: 440142us
44: [0;39;49m
44: [1;32;49m*** No errors detected
44: [0;39;49m[0;39;49m[1;34;49m/var/jenkins/workspace/adamantine-nightly/tests/test_microstructure.cc(53): Leaving test case "G_and_R"; testing time: 450276us
44: [0;39;49m[1;34;49mLeaving test module "MicroStructure"; testing time: 450329us
44: [0;39;49m
44: [1;32;49m*** No errors detected
44: [0;39;49m
41/48 Test #44: test_microstructure_2 .................... Passed 7.10 sec
test 46
Start 46: test_thermal_physics_2
46: Test command: /usr/bin/mpiexec "-n" "2" "/var/jenkins/workspace/adamantine-nightly/build/bin/test_thermal_physics"
46: Working Directory: /var/jenkins/workspace/adamantine-nightly/build/tests
46: Test timeout computed to be: 7200
46: Running 7 test cases...
46: [1;34;49mEntering test module "ThermalPhysics"
46: [0;39;49m[1;34;49m/var/jenkins/workspace/adamantine-nightly/tests/test_thermal_physics.cc(15): Entering test case "thermal_2d_explicit_host"
46: Running 7 test cases...
46: [1;34;49mEntering test module "ThermalPhysics"
46: [0;39;49m[1;34;49m/var/jenkins/workspace/adamantine-nightly/tests/test_thermal_physics.cc(15): Entering test case "thermal_2d_explicit_host"
46: [0;39;49m[1;34;49m/var/jenkins/workspace/adamantine-nightly/tests/test_thermal_physics.cc(15): Leaving test case "thermal_2d_explicit_host"; testing time: 309225us
46: [0;39;49m[1;34;49m/var/jenkins/workspace/adamantine-nightly/tests/test_thermal_physics.cc(28): Entering test case "thermal_2d_manufactured_solution_host"
46: [0;39;49m[1;34;49m/var/jenkins/workspace/adamantine-nightly/tests/test_thermal_physics.cc(15): Leaving test case "thermal_2d_explicit_host"; testing time: 253744us
46: [0;39;49m[1;34;49m/var/jenkins/workspace/adamantine-nightly/tests/test_thermal_physics.cc(28): Entering test case "thermal_2d_manufactured_solution_host"
46: [0;39;49m[1;34;49m/var/jenkins/workspace/adamantine-nightly/tests/test_thermal_physics.cc(28): Leaving test case "thermal_2d_manufactured_solution_host"; testing time: 242701us
46: [0;39;49m[1;34;49m/var/jenkins/workspace/adamantine-nightly/tests/test_thermal_physics.cc(33): Entering test case "initial_temperature_host"
46: [0;39;49m[1;34;49m/var/jenkins/workspace/adamantine-nightly/tests/test_thermal_physics.cc(28): Leaving test case "thermal_2d_manufactured_solution_host"; testing time: 242529us
46: [0;39;49m[1;34;49m/var/jenkins/workspace/adamantine-nightly/tests/test_thermal_physics.cc(33): Entering test case "initial_temperature_host"
46: [0;39;49m[1;34;49m/var/jenkins/workspace/adamantine-nightly/tests/test_thermal_physics.cc(33): Leaving test case "initial_temperature_host"; testing time: 217439us
46: [0;39;49m[1;34;49m/var/jenkins/workspace/adamantine-nightly/tests/test_thermal_physics.cc(38): Entering test case "energy_conservation_host"
46: [0;39;49m[1;34;49m/var/jenkins/workspace/adamantine-nightly/tests/test_thermal_physics.cc(33): Leaving test case "initial_temperature_host"; testing time: 217395us
46: [0;39;49m[1;34;49m/var/jenkins/workspace/adamantine-nightly/tests/test_thermal_physics.cc(38): Entering test case "energy_conservation_host"
46: [0;39;49m[1;34;49m/var/jenkins/workspace/adamantine-nightly/tests/test_thermal_physics.cc(38): Leaving test case "energy_conservation_host"; testing time: 9401378us
46: [0;39;49m[1;34;49m/var/jenkins/workspace/adamantine-nightly/tests/test_thermal_physics.cc(43): Entering test case "radiation_bcs_host"
46: [0;39;49m[1;34;49m/var/jenkins/workspace/adamantine-nightly/tests/test_thermal_physics.cc(38): Leaving test case "energy_conservation_host"; testing time: 9401504us
46: [0;39;49m[1;34;49m/var/jenkins/workspace/adamantine-nightly/tests/test_thermal_physics.cc(43): Entering test case "radiation_bcs_host"
46: [0;39;49m[1;34;49m/var/jenkins/workspace/adamantine-nightly/tests/test_thermal_physics.cc(43): Leaving test case "radiation_bcs_host"; testing time: 4745710us
46: [0;39;49m[1;34;49m/var/jenkins/workspace/adamantine-nightly/tests/test_thermal_physics.cc(48): Entering test case "convection_bcs_host"
46: [0;39;49m[1;34;49m/var/jenkins/workspace/adamantine-nightly/tests/test_thermal_physics.cc(43): Leaving test case "radiation_bcs_host"; testing time: 4745684us
46: [0;39;49m[1;34;49m/var/jenkins/workspace/adamantine-nightly/tests/test_thermal_physics.cc(48): Entering test case "convection_bcs_host"
40: 50% completed
46: [0;39;49m[1;34;49m/var/jenkins/workspace/adamantine-nightly/tests/test_thermal_physics.cc(48): Leaving test case "convection_bcs_host"; testing time: 78573109us
46: [0;39;49m[1;34;49m/var/jenkins/workspace/adamantine-nightly/tests/test_thermal_physics.cc(53): Entering test case "reference_temperature_host"
46: [0;39;49m[1;34;49m/var/jenkins/workspace/adamantine-nightly/tests/test_thermal_physics.cc(48): Leaving test case "convection_bcs_host"; testing time: 78573244us
46: [0;39;49m[1;34;49m/var/jenkins/workspace/adamantine-nightly/tests/test_thermal_physics.cc(53): Entering test case "reference_temperature_host"
46:
46: [1;32;49m*** No errors detected
46: [0;39;49m[0;39;49m[1;34;49m/var/jenkins/workspace/adamantine-nightly/tests/test_thermal_physics.cc(53): Leaving test case "reference_temperature_host"; testing time: 182832us
46: [0;39;49m[1;34;49mLeaving test module "ThermalPhysics"; testing time: 93618615us
46: [0;39;49m[0;39;49m[1;34;49m/var/jenkins/workspace/adamantine-nightly/tests/test_thermal_physics.cc(53): Leaving test case "reference_temperature_host"; testing time: 222265us
46: [0;39;49m[1;34;49mLeaving test module "ThermalPhysics"; testing time: 93713644us
46: [0;39;49m
46: [1;32;49m*** No errors detected
46: [0;39;49m
42/48 Test #46: test_thermal_physics_2 ................... Passed 100.16 sec
test 48
Start 48: test_ensemble_management_2
48: Test command: /usr/bin/mpiexec "-n" "2" "/var/jenkins/workspace/adamantine-nightly/build/bin/test_ensemble_management"
48: Working Directory: /var/jenkins/workspace/adamantine-nightly/build/tests
48: Test timeout computed to be: 7200
48: Running 1 test case...
48: [1;34;49mEntering test module "EnsembleManagement"
48: [0;39;49m[1;34;49m/var/jenkins/workspace/adamantine-nightly/tests/test_ensemble_management.cc(17): Entering test case "database_ensemble"
48:
48: [1;32;49m*** No errors detected
48: [0;39;49m[0;39;49m[1;34;49m/var/jenkins/workspace/adamantine-nightly/tests/test_ensemble_management.cc(17): Leaving test case "database_ensemble"; testing time: 458us
48: [0;39;49m[1;34;49mLeaving test module "EnsembleManagement"; testing time: 504us
48: [0;39;49mRunning 1 test case...
48: [1;34;49mEntering test module "EnsembleManagement"
48: [0;39;49m[1;34;49m/var/jenkins/workspace/adamantine-nightly/tests/test_ensemble_management.cc(17): Entering test case "database_ensemble"
48: [0;39;49m[1;34;49m/var/jenkins/workspace/adamantine-nightly/tests/test_ensemble_management.cc(17): Leaving test case "database_ensemble"; testing time: 81574us
48: [0;39;49m[1;34;49mLeaving test module "EnsembleManagement"; testing time: 81607us
48: [0;39;49m
48: [1;32;49m*** No errors detected
48: [0;39;49m
43/48 Test #48: test_ensemble_management_2 ............... Passed 6.64 sec
40: 60% completed
40: 20% completed
40: 70% completed
40: 80% completed
40: 30% completed
40: 90% completed
40: 100% completed
40: [1;34;49m/var/jenkins/workspace/adamantine-nightly/tests/test_integration_thermoelastic.cc(47): Leaving test case "integration_thermoelastic_add_material"; testing time: 831745752us
40: [0;39;49m[1;34;49mLeaving test module "Integration_Thermoelastic"; testing time: 2628475834us
40: [0;39;49m
40: [1;32;49m*** No errors detected
40: [0;39;49m[1;34;49m/var/jenkins/workspace/adamantine-nightly/tests/test_integration_thermoelastic.cc(47): Leaving test case "integration_thermoelastic_add_material"; testing time: 831745600us
40: [0;39;49m[1;34;49mLeaving test module "Integration_Thermoelastic"; testing time: 2628475663us
40: [0;39;49m
40: [1;32;49m*** No errors detected
40: [0;39;49m
44/48 Test #40: test_integration_thermoelastic_2 ......... Passed 2629.21 sec
test 3
Start 3: test_integration_da_3
3: Test command: /usr/bin/mpiexec "-n" "3" "/var/jenkins/workspace/adamantine-nightly/build/bin/test_integration_da"
3: Working Directory: /var/jenkins/workspace/adamantine-nightly/build/tests
3: Test timeout computed to be: 7200
3: Running 3 test cases...
3: Running 3 test cases...
3: [1;34;49mEntering test module "Integration_Data_Assimilation"
3: [1;34;49mEntering test module "Integration_Data_Assimilation"
3: [0;39;49m[1;34;49m/var/jenkins/workspace/adamantine-nightly/tests/test_integration_da.cc(78): Entering test case "integration_data_assimilation"
3: [0;39;49m[1;34;49m/var/jenkins/workspace/adamantine-nightly/tests/test_integration_da.cc(78): Entering test case "integration_data_assimilation"
3: Running 3 test cases...
3: [1;34;49mEntering test module "Integration_Data_Assimilation"
3: [0;39;49m[1;34;49m/var/jenkins/workspace/adamantine-nightly/tests/test_integration_da.cc(78): Entering test case "integration_data_assimilation"
3: [0;39;49mReading the experimental log file...
3: Done. Log entries found for 1 camera(s), with 2 frame(s).
3: Starting the main time stepping loop...
3: 10% completed
3: 20% completed
3: 30% completed
3: 40% completed
3: [0;39;49mRank: 2 | Old parameters for member 2:
3: Rank: 2 | Number expt sites mapped to DOFs: 1
3: [0;39;49mRank: 1 | Old parameters for member 1:
3: Performing data assimilation at time 0.0211...
3: Rank: 0 | Old parameters for member 0:
3: Rank: 1 | Number expt sites mapped to DOFs: 1
3: Rank: 0 | Number expt sites mapped to DOFs: 1
3: Getting the perturbed innovation...
3: Applying the Kalman gain...
3: Updating the ensemble members...
3: Done.
3: 50% completed
3: 60% completed
3: Rank: 2 | Old parameters for member 2:
3: Rank: 2 | Number expt sites mapped to DOFs: 1
3: Rank: 1 | Old parameters for member 1:
3: Performing data assimilation at time 0.0316...
3: Rank: 0 | Old parameters for member 0:
3: Rank: 1 | Number expt sites mapped to DOFs: 1
3: Rank: 0 | Number expt sites mapped to DOFs: 1
3: Getting the perturbed innovation...
3: Applying the Kalman gain...
3: Updating the ensemble members...
3: Done.
3: 70% completed
3: 80% completed
3: 90% completed
3: 100% completed
3: Reading the experimental log file...
3: Done. Log entries found for 1 camera(s), with 2 frame(s).
3: Reading the experimental log file...
3: Done. Log entries found for 1 camera(s), with 2 frame(s).
3: Reading the experimental log file...
3: Done. Log entries found for 1 camera(s), with 2 frame(s).
3: Starting the main time stepping loop...
3: Starting the main time stepping loop...
3: Starting the main time stepping loop...
3: 10% completed
3: 10% completed
3: 10% completed
3: 20% completed
3: 20% completed
3: 20% completed
3: 30% completed
3: 30% completed
3: 30% completed
3: 40% completed
3: 40% completed
3: 40% completed
3: Performing data assimilation at time 0.0211...
3: Rank: 0 | Old parameters for member 0:
3: Rank: 0 | Old parameters for member 1:
3: Rank: 0 | Old parameters for member 2:
3: Rank: 0 | Number expt sites mapped to DOFs: 1
3: Performing data assimilation at time 0.0211...
3: Rank: 0 | Old parameters for member 0:
3: Rank: 0 | Old parameters for member 1:
3: Rank: 0 | Old parameters for member 2:
3: Rank: 0 | Number expt sites mapped to DOFs: 1
3: Performing data assimilation at time 0.0211...
3: Rank: 0 | Old parameters for member 0:
3: Rank: 0 | Old parameters for member 1:
3: Rank: 0 | Old parameters for member 2:
3: Rank: 0 | Number expt sites mapped to DOFs: 1
3: Getting the perturbed innovation...
3: Applying the Kalman gain...
3: Getting the perturbed innovation...
3: Applying the Kalman gain...
3: Getting the perturbed innovation...
3: Applying the Kalman gain...
3: Updating the ensemble members...
3: Done.
3: Updating the ensemble members...
3: Done.
3: Updating the ensemble members...
3: Done.
3: 50% completed
3: 50% completed
3: 50% completed
3: 60% completed
3: 60% completed
3: 60% completed
3: Performing data assimilation at time 0.0316...
3: Rank: 0 | Old parameters for member 0:
3: Rank: 0 | Old parameters for member 1:
3: Rank: 0 | Old parameters for member 2:
3: Rank: 0 | Number expt sites mapped to DOFs: 1
3: Performing data assimilation at time 0.0316...
3: Rank: 0 | Old parameters for member 0:
3: Rank: 0 | Old parameters for member 1:
3: Rank: 0 | Old parameters for member 2:
3: Rank: 0 | Number expt sites mapped to DOFs: 1
3: Performing data assimilation at time 0.0316...
3: Rank: 0 | Old parameters for member 0:
3: Rank: 0 | Old parameters for member 1:
3: Rank: 0 | Old parameters for member 2:
3: Rank: 0 | Number expt sites mapped to DOFs: 1
3: Getting the perturbed innovation...
3: Applying the Kalman gain...
3: Getting the perturbed innovation...
3: Applying the Kalman gain...
3: Getting the perturbed innovation...
3: Applying the Kalman gain...
3: Updating the ensemble members...
3: Done.
3: Updating the ensemble members...
3: Done.
3: Updating the ensemble members...
3: Done.
3: 70% completed
3: 70% completed
3: 70% completed
3: 80% completed
3: 80% completed
3: 80% completed
3: 90% completed
3: 90% completed
3: 90% completed
3: 100% completed
3: 100% completed
3: [1;34;49m/var/jenkins/workspace/adamantine-nightly/tests/test_integration_da.cc(78): Leaving test case "integration_data_assimilation"; testing time: 39609490us
3: [0;39;49m[1;34;49m/var/jenkins/workspace/adamantine-nightly/tests/test_integration_da.cc(148): Entering test case "integration_3D_da_point_cloud_add_material"
3: 100% completed
3: [1;34;49m/var/jenkins/workspace/adamantine-nightly/tests/test_integration_da.cc(78): Leaving test case "integration_data_assimilation"; testing time: 39766689us
3: [0;39;49m[1;34;49m/var/jenkins/workspace/adamantine-nightly/tests/test_integration_da.cc(148): Entering test case "integration_3D_da_point_cloud_add_material"
3: [1;34;49m/var/jenkins/workspace/adamantine-nightly/tests/test_integration_da.cc(78): Leaving test case "integration_data_assimilation"; testing time: 39938591us
3: [0;39;49m[1;34;49m/var/jenkins/workspace/adamantine-nightly/tests/test_integration_da.cc(148): Entering test case "integration_3D_da_point_cloud_add_material"
3: [0;39;49mReading the experimental log file...
3: Done. Log entries found for 1 camera(s), with 1 frame(s).
3: Starting the main time stepping loop...
3: 10% completed
3: 20% completed
3: 30% completed
3: 40% completed
3: 50% completed
3: Performing data assimilation at time 0.12...
3: Rank: 0 | Old parameters for member 0:
3: [0;39;49mRank: 2 | Old parameters for member 2:
3: [0;39;49mRank: 1 | Old parameters for member 1:
3: Rank: 0 | Number expt sites mapped to DOFs: 1
3: Rank: 2 | Number expt sites mapped to DOFs: 1
3: Rank: 1 | Number expt sites mapped to DOFs: 1
3: Getting the perturbed innovation...
3: Applying the Kalman gain...
3: Updating the ensemble members...
3: Done.
3: 60% completed
3: 70% completed
3: 80% completed
3: 90% completed
3: 100% completed
3: Reading the experimental log file...
3: Done. Log entries found for 1 camera(s), with 1 frame(s).
3: Reading the experimental log file...
3: Done. Log entries found for 1 camera(s), with 1 frame(s).
3: Reading the experimental log file...
3: Done. Log entries found for 1 camera(s), with 1 frame(s).
3: Starting the main time stepping loop...
3: Starting the main time stepping loop...
3: Starting the main time stepping loop...
3: 10% completed
3: 10% completed
3: 10% completed
3: 20% completed
3: 20% completed
3: 20% completed
3: 30% completed
3: 30% completed
3: 30% completed
3: 40% completed
3: 40% completed
3: 40% completed
3: 50% completed
3: 50% completed
3: 50% completed
3: Performing data assimilation at time 0.12...
3: Rank: 0 | Old parameters for member 0:
3: Rank: 0 | Old parameters for member 1:
3: Rank: 0 | Old parameters for member 2:
3: Rank: 0 | Number expt sites mapped to DOFs: 1
3: Performing data assimilation at time 0.12...
3: Rank: 0 | Old parameters for member 0:
3: Rank: 0 | Old parameters for member 1:
3: Performing data assimilation at time 0.12...
3: Rank: 0 | Old parameters for member 0:
3: Rank: 0 | Old parameters for member 1:
3: Rank: 0 | Old parameters for member 2:
3: Rank: 0 | Old parameters for member 2:
3: Rank: 0 | Number expt sites mapped to DOFs: 1
3: Rank: 0 | Number expt sites mapped to DOFs: 1
3: Getting the perturbed innovation...
3: Applying the Kalman gain...
3: Getting the perturbed innovation...
3: Applying the Kalman gain...
3: Getting the perturbed innovation...
3: Applying the Kalman gain...
3: Updating the ensemble members...
3: Done.
3: 60% completed
3: Updating the ensemble members...
3: Updating the ensemble members...
3: Done.
3: 60% completed
3: Done.
3: 60% completed
3: 70% completed
3: 70% completed
3: 70% completed
3: 80% completed
3: 80% completed
3: 80% completed
3: 90% completed
3: 90% completed
3: 90% completed
3: 100% completed
3: 100% completed
3: 100% completed
3: [1;34;49m/var/jenkins/workspace/adamantine-nightly/tests/test_integration_da.cc(148): Leaving test case "integration_3D_da_point_cloud_add_material"; testing time: 2011256us
3: [0;39;49m[1;34;49m/var/jenkins/workspace/adamantine-nightly/tests/test_integration_da.cc(231): Entering test case "integration_3D_da_ray_add_material"
3: [1;34;49m/var/jenkins/workspace/adamantine-nightly/tests/test_integration_da.cc(148): Leaving test case "integration_3D_da_point_cloud_add_material"; testing time: 1888140us
3: [1;34;49m/var/jenkins/workspace/adamantine-nightly/tests/test_integration_da.cc(148): Leaving test case "integration_3D_da_point_cloud_add_material"; testing time: 1715946us
3: [0;39;49m[1;34;49m/var/jenkins/workspace/adamantine-nightly/tests/test_integration_da.cc(231): Entering test case "integration_3D_da_ray_add_material"
3: [0;39;49m[1;34;49m/var/jenkins/workspace/adamantine-nightly/tests/test_integration_da.cc(231): Entering test case "integration_3D_da_ray_add_material"
3: [0;39;49mReading the experimental log file...
3: Done. Log entries found for 1 camera(s), with 1 frame(s).
3: Starting the main time stepping loop...
3: 10% completed
3: 20% completed
3: 30% completed
3: 40% completed
3: 50% completed
3: [0;39;49mRank: 2 | Old parameters for member 2:
3: Rank: 2 | Number expt sites mapped to DOFs: 1
3: Performing data assimilation at time 0.12...
3: [0;39;49mRank: 1 | Old parameters for member 1:
3: Rank: 0 | Old parameters for member 0:
3: Rank: 1 | Number expt sites mapped to DOFs: 1
3: Rank: 0 | Number expt sites mapped to DOFs: 1
3: Getting the perturbed innovation...
3: Applying the Kalman gain...
3: Updating the ensemble members...
3: Done.
3: 60% completed
3: 70% completed
3: 80% completed
3: 90% completed
3: 100% completed
3: Reading the experimental log file...
3: Done. Log entries found for 1 camera(s), with 1 frame(s).
3: Reading the experimental log file...
3: Reading the experimental log file...
3: Done. Log entries found for 1 camera(s), with 1 frame(s).
3: Done. Log entries found for 1 camera(s), with 1 frame(s).
3: Starting the main time stepping loop...
3: Starting the main time stepping loop...
3: Starting the main time stepping loop...
3: 10% completed
3: 10% completed
3: 10% completed
3: 20% completed
3: 20% completed
3: 20% completed
3: 30% completed
3: 30% completed
3: 30% completed
3: 40% completed
3: 40% completed
3: 40% completed
3: 50% completed
3: 50% completed
3: 50% completed
3: Performing data assimilation at time 0.12...
3: Rank: 0 | Old parameters for member 0:
3: Rank: 0 | Old parameters for member 1:
3: Rank: 0 | Old parameters for member 2:
3: Rank: 0 | Number expt sites mapped to DOFs: 1
3: Performing data assimilation at time 0.12...
3: Rank: 0 | Old parameters for member 0:
3: Rank: 0 | Old parameters for member 1:
3: Rank: 0 | Old parameters for member 2:
3: Performing data assimilation at time 0.12...
3: Rank: 0 | Old parameters for member 0:
3: Rank: 0 | Old parameters for member 1:
3: Rank: 0 | Old parameters for member 2:
3: Rank: 0 | Number expt sites mapped to DOFs: 1
3: Rank: 0 | Number expt sites mapped to DOFs: 1
3: Getting the perturbed innovation...
3: Applying the Kalman gain...
3: Getting the perturbed innovation...
3: Applying the Kalman gain...
3: Getting the perturbed innovation...
3: Applying the Kalman gain...
3: Updating the ensemble members...
3: Done.
3: 60% completed
3: Updating the ensemble members...
3: Done.
3: 60% completed
3: Updating the ensemble members...
3: 70% completed
3: Done.
3: 60% completed
3: 70% completed
3: 80% completed
3: 70% completed
3: 80% completed
3: 90% completed
3: 80% completed
3: 90% completed
3: 90% completed
3: 100% completed
3: 100% completed
3: [1;34;49m/var/jenkins/workspace/adamantine-nightly/tests/test_integration_da.cc(231): Leaving test case "integration_3D_da_ray_add_material"; testing time: 1706018us
3: [0;39;49m[1;34;49mLeaving test module "Integration_Data_Assimilation"; testing time: 43361067us
3: [0;39;49m
3: [1;32;49m*** No errors detected
3: [0;39;49m100% completed
3: [1;34;49m/var/jenkins/workspace/adamantine-nightly/tests/test_integration_da.cc(231): Leaving test case "integration_3D_da_ray_add_material"; testing time: 1729436us
3: [0;39;49m[1;34;49mLeaving test module "Integration_Data_Assimilation"; testing time: 43384227us
3: [0;39;49m
3: [1;32;49m*** No errors detected
3: [0;39;49m[1;34;49m/var/jenkins/workspace/adamantine-nightly/tests/test_integration_da.cc(231): Leaving test case "integration_3D_da_ray_add_material"; testing time: 1780521us
3: [0;39;49m[1;34;49mLeaving test module "Integration_Data_Assimilation"; testing time: 43401444us
3: [0;39;49m
3: [1;32;49m*** No errors detected
3: [0;39;49m
45/48 Test #3: test_integration_da_3 .................... Passed 44.05 sec
test 4
Start 4: test_integration_da_6
4: Test command: /usr/bin/mpiexec "-n" "6" "/var/jenkins/workspace/adamantine-nightly/build/bin/test_integration_da"
4: Working Directory: /var/jenkins/workspace/adamantine-nightly/build/tests
4: Test timeout computed to be: 7200
4: Running 3 test cases...
4: Running 3 test cases...
4: [1;34;49mEntering test module "Integration_Data_Assimilation"
4: Running 3 test cases...
4: [1;34;49mEntering test module "Integration_Data_Assimilation"
4: [0;39;49m[1;34;49m/var/jenkins/workspace/adamantine-nightly/tests/test_integration_da.cc(78): Entering test case "integration_data_assimilation"
4: [1;34;49mEntering test module "Integration_Data_Assimilation"
4: [0;39;49m[1;34;49m/var/jenkins/workspace/adamantine-nightly/tests/test_integration_da.cc(78): Entering test case "integration_data_assimilation"
4: [0;39;49m[1;34;49m/var/jenkins/workspace/adamantine-nightly/tests/test_integration_da.cc(78): Entering test case "integration_data_assimilation"
4: Running 3 test cases...
4: Running 3 test cases...
4: Running 3 test cases...
4: [1;34;49mEntering test module "Integration_Data_Assimilation"
4: [1;34;49mEntering test module "Integration_Data_Assimilation"
4: [0;39;49m[1;34;49m/var/jenkins/workspace/adamantine-nightly/tests/test_integration_da.cc(78): Entering test case "integration_data_assimilation"
4: [1;34;49mEntering test module "Integration_Data_Assimilation"
4: [0;39;49m[1;34;49m/var/jenkins/workspace/adamantine-nightly/tests/test_integration_da.cc(78): Entering test case "integration_data_assimilation"
4: [0;39;49m[1;34;49m/var/jenkins/workspace/adamantine-nightly/tests/test_integration_da.cc(78): Entering test case "integration_data_assimilation"
4: [0;39;49mReading the experimental log file...
4: Done. Log entries found for 1 camera(s), with 2 frame(s).
4: Starting the main time stepping loop...
4: 10% completed
4: 20% completed
4: 30% completed
4: 40% completed
4: [0;39;49mRank: 4 | Old parameters for member 2:
4: Performing data assimilation at time 0.0211...
4: Rank: 0 | Old parameters for member 0:
4: [0;39;49mRank: 1 | Old parameters for member 0:
4: [0;39;49mRank: 5 | Old parameters for member 2:
4: Rank: 4 | Number expt sites mapped to DOFs: 1
4: Rank: 5 | Number expt sites mapped to DOFs: 1
4: Rank: 1 | Number expt sites mapped to DOFs: 1
4: Rank: 0 | Number expt sites mapped to DOFs: 1
4: [0;39;49mRank: 2 | Old parameters for member 1:
4: [0;39;49mRank: 3 | Old parameters for member 1:
4: Rank: 2 | Number expt sites mapped to DOFs: 1
4: Rank: 3 | Number expt sites mapped to DOFs: 1
4: Getting the perturbed innovation...
4: Applying the Kalman gain...
4: Updating the ensemble members...
4: Done.
4: 50% completed
4: 60% completed
4: Rank: 5 | Old parameters for member 2:
4: Rank: 4 | Old parameters for member 2:
4: Rank: 1 | Old parameters for member 0:
4: Performing data assimilation at time 0.0316...
4: Rank: 0 | Old parameters for member 0:
4: Rank: 5 | Number expt sites mapped to DOFs: 1
4: Rank: 4 | Number expt sites mapped to DOFs: 1
4: Rank: 1 | Number expt sites mapped to DOFs: 1
4: Rank: 0 | Number expt sites mapped to DOFs: 1
4: Rank: 3 | Old parameters for member 1:
4: Rank: 2 | Old parameters for member 1:
4: Rank: 3 | Number expt sites mapped to DOFs: 1
4: Rank: 2 | Number expt sites mapped to DOFs: 1
4: Getting the perturbed innovation...
4: Applying the Kalman gain...
4: Updating the ensemble members...
4: Done.
4: 70% completed
4: 80% completed
4: 90% completed
4: 100% completed
4: Reading the experimental log file...
4: Done. Log entries found for 1 camera(s), with 2 frame(s).
4: Reading the experimental log file...
4: Done. Log entries found for 1 camera(s), with 2 frame(s).
4: Reading the experimental log file...
4: Done. Log entries found for 1 camera(s), with 2 frame(s).
4: Reading the experimental log file...
4: Done. Log entries found for 1 camera(s), with 2 frame(s).
4: Reading the experimental log file...
4: Done. Log entries found for 1 camera(s), with 2 frame(s).
4: Reading the experimental log file...
4: Done. Log entries found for 1 camera(s), with 2 frame(s).
4: Starting the main time stepping loop...
4: Starting the main time stepping loop...
4: Starting the main time stepping loop...
4: Starting the main time stepping loop...
4: Starting the main time stepping loop...
4: Starting the main time stepping loop...
4: 10% completed
4: 10% completed
4: 10% completed
4: 10% completed
4: 10% completed
4: 10% completed
4: 20% completed
4: 20% completed
4: 20% completed
4: 20% completed
4: 20% completed
4: 20% completed
4: 30% completed
4: 30% completed
4: 30% completed
4: 30% completed
4: 30% completed
4: 30% completed
4: 40% completed
4: 40% completed
4: 40% completed
4: 40% completed
4: 40% completed
4: 40% completed
4: Performing data assimilation at time 0.0211...
4: Rank: 0 | Old parameters for member 0:
4: Rank: 0 | Old parameters for member 1:
4: Rank: 0 | Old parameters for member 2:
4: Rank: 0 | Number expt sites mapped to DOFs: 1
4: Performing data assimilation at time 0.0211...
4: Performing data assimilation at time 0.0211...
4: Rank: 0 | Old parameters for member 0:
4: Rank: 0 | Old parameters for member 1:
4: Rank: 0 | Old parameters for member 2:
4: Rank: 0 | Old parameters for member 0:
4: Rank: 0 | Old parameters for member 1:
4: Rank: 0 | Old parameters for member 2:
4: Performing data assimilation at time 0.0211...
4: Rank: 0 | Old parameters for member 0:
4: Rank: 0 | Old parameters for member 1:
4: Rank: 0 | Old parameters for member 2:
4: Rank: 0 | Number expt sites mapped to DOFs: 1
4: Rank: 0 | Number expt sites mapped to DOFs: 1
4: Rank: 0 | Number expt sites mapped to DOFs: 1
4: Performing data assimilation at time 0.0211...
4: Rank: 0 | Old parameters for member 0:
4: Rank: 0 | Old parameters for member 1:
4: Rank: 0 | Old parameters for member 2:
4: Rank: 0 | Number expt sites mapped to DOFs: 1
4: Performing data assimilation at time 0.0211...
4: Rank: 0 | Old parameters for member 0:
4: Rank: 0 | Old parameters for member 1:
4: Rank: 0 | Old parameters for member 2:
4: Rank: 0 | Number expt sites mapped to DOFs: 1
4: Getting the perturbed innovation...
4: Applying the Kalman gain...
4: Getting the perturbed innovation...
4: Applying the Kalman gain...
4: Getting the perturbed innovation...
4: Applying the Kalman gain...
4: Getting the perturbed innovation...
4: Applying the Kalman gain...
4: Getting the perturbed innovation...
4: Applying the Kalman gain...
4: Getting the perturbed innovation...
4: Applying the Kalman gain...
4: Updating the ensemble members...
4: Done.
4: Updating the ensemble members...
4: Updating the ensemble members...
4: Done.
4: Done.
4: Updating the ensemble members...
4: Done.
4: Updating the ensemble members...
4: Done.
4: Updating the ensemble members...
4: Done.
4: 50% completed
4: 50% completed
4: 50% completed
4: 50% completed
4: 50% completed
4: 50% completed
4: 60% completed
4: 60% completed
4: 60% completed
4: 60% completed
4: 60% completed
4: 60% completed
4: Performing data assimilation at time 0.0316...
4: Rank: 0 | Old parameters for member 0:
4: Rank: 0 | Old parameters for member 1:
4: Rank: 0 | Old parameters for member 2:
4: Rank: 0 | Number expt sites mapped to DOFs: 1
4: Performing data assimilation at time 0.0316...
4: Rank: 0 | Old parameters for member 0:
4: Rank: 0 | Old parameters for member 1:
4: Rank: 0 | Old parameters for member 2:
4: Performing data assimilation at time 0.0316...
4: Rank: 0 | Old parameters for member 0:
4: Rank: 0 | Old parameters for member 1:
4: Rank: 0 | Old parameters for member 2:
4: Rank: 0 | Number expt sites mapped to DOFs: 1
4: Rank: 0 | Number expt sites mapped to DOFs: 1
4: Performing data assimilation at time 0.0316...
4: Rank: 0 | Old parameters for member 0:
4: Rank: 0 | Old parameters for member 1:
4: Rank: 0 | Old parameters for member 2:
4: Rank: 0 | Number expt sites mapped to DOFs: 1
4: Performing data assimilation at time 0.0316...
4: Rank: 0 | Old parameters for member 0:
4: Rank: 0 | Old parameters for member 1:
4: Rank: 0 | Old parameters for member 2:
4: Performing data assimilation at time 0.0316...
4: Rank: 0 | Old parameters for member 0:
4: Rank: 0 | Old parameters for member 1:
4: Rank: 0 | Old parameters for member 2:
4: Rank: 0 | Number expt sites mapped to DOFs: 1
4: Rank: 0 | Number expt sites mapped to DOFs: 1
4: Getting the perturbed innovation...
4: Applying the Kalman gain...
4: Getting the perturbed innovation...
4: Applying the Kalman gain...
4: Getting the perturbed innovation...
4: Applying the Kalman gain...
4: Getting the perturbed innovation...
4: Applying the Kalman gain...
4: Getting the perturbed innovation...
4: Applying the Kalman gain...
4: Getting the perturbed innovation...
4: Applying the Kalman gain...
4: Updating the ensemble members...
4: Done.
4: Updating the ensemble members...
4: Updating the ensemble members...
4: Done.
4: Done.
4: Updating the ensemble members...
4: Done.
4: Updating the ensemble members...
4: Done.
4: Updating the ensemble members...
4: Done.
4: 70% completed
4: 70% completed
4: 70% completed
4: 70% completed
4: 70% completed
4: 70% completed
4: 80% completed
4: 80% completed
4: 80% completed
4: 80% completed
4: 80% completed
4: 80% completed
4: 90% completed
4: 90% completed
4: 90% completed
4: 90% completed
4: 90% completed
4: 90% completed
4: 100% completed
4: 100% completed
4: 100% completed
4: [1;34;49m/var/jenkins/workspace/adamantine-nightly/tests/test_integration_da.cc(78): Leaving test case "integration_data_assimilation"; testing time: 36701635us
4: [0;39;49m[1;34;49m/var/jenkins/workspace/adamantine-nightly/tests/test_integration_da.cc(148): Entering test case "integration_3D_da_point_cloud_add_material"
4: 100% completed
4: 100% completed
4: [1;34;49m/var/jenkins/workspace/adamantine-nightly/tests/test_integration_da.cc(78): Leaving test case "integration_data_assimilation"; testing time: 36839422us
4: [0;39;49m[1;34;49m/var/jenkins/workspace/adamantine-nightly/tests/test_integration_da.cc(148): Entering test case "integration_3D_da_point_cloud_add_material"
4: [1;34;49m/var/jenkins/workspace/adamantine-nightly/tests/test_integration_da.cc(78): Leaving test case "integration_data_assimilation"; testing time: 36841135us
4: [0;39;49m[1;34;49m/var/jenkins/workspace/adamantine-nightly/tests/test_integration_da.cc(148): Entering test case "integration_3D_da_point_cloud_add_material"
4: [1;34;49m/var/jenkins/workspace/adamantine-nightly/tests/test_integration_da.cc(78): Leaving test case "integration_data_assimilation"; testing time: 36898223us
4: [0;39;49m[1;34;49m/var/jenkins/workspace/adamantine-nightly/tests/test_integration_da.cc(148): Entering test case "integration_3D_da_point_cloud_add_material"
4: 100% completed
4: [1;34;49m/var/jenkins/workspace/adamantine-nightly/tests/test_integration_da.cc(78): Leaving test case "integration_data_assimilation"; testing time: 36974734us
4: [0;39;49m[1;34;49m/var/jenkins/workspace/adamantine-nightly/tests/test_integration_da.cc(148): Entering test case "integration_3D_da_point_cloud_add_material"
4: [1;34;49m/var/jenkins/workspace/adamantine-nightly/tests/test_integration_da.cc(78): Leaving test case "integration_data_assimilation"; testing time: 37147809us
4: [0;39;49m[1;34;49m/var/jenkins/workspace/adamantine-nightly/tests/test_integration_da.cc(148): Entering test case "integration_3D_da_point_cloud_add_material"
4: [0;39;49mReading the experimental log file...
4: Done. Log entries found for 1 camera(s), with 1 frame(s).
4: Starting the main time stepping loop...
4: 10% completed
4: 20% completed
4: 30% completed
4: 40% completed
4: 50% completed
4: [0;39;49mRank: 4 | Old parameters for member 2:
4: [0;39;49mRank: 5 | Old parameters for member 2:
4: [0;39;49mRank: 2 | Old parameters for member 1:
4: [0;39;49mRank: 3 | Old parameters for member 1:
4: Rank: 5 | Number expt sites mapped to DOFs: 1
4: Rank: 4 | Number expt sites mapped to DOFs: 1
4: [0;39;49mRank: 1 | Old parameters for member 0:
4: Performing data assimilation at time 0.12...
4: Rank: 0 | Old parameters for member 0:
4: Rank: 3 | Number expt sites mapped to DOFs: 1
4: Rank: 2 | Number expt sites mapped to DOFs: 1
4: Rank: 0 | Number expt sites mapped to DOFs: 1
4: Rank: 1 | Number expt sites mapped to DOFs: 1
4: Getting the perturbed innovation...
4: Applying the Kalman gain...
4: Updating the ensemble members...
4: Done.
4: 60% completed
4: 70% completed
4: 80% completed
4: 90% completed
4: 100% completed
4: Reading the experimental log file...
4: Done. Log entries found for 1 camera(s), with 1 frame(s).
4: Reading the experimental log file...
4: Done. Log entries found for 1 camera(s), with 1 frame(s).
4: Reading the experimental log file...
4: Done. Log entries found for 1 camera(s), with 1 frame(s).
4: Reading the experimental log file...
4: Done. Log entries found for 1 camera(s), with 1 frame(s).
4: Reading the experimental log file...
4: Done. Log entries found for 1 camera(s), with 1 frame(s).
4: Reading the experimental log file...
4: Done. Log entries found for 1 camera(s), with 1 frame(s).
4: Starting the main time stepping loop...
4: Starting the main time stepping loop...
4: Starting the main time stepping loop...
4: Starting the main time stepping loop...
4: Starting the main time stepping loop...
4: Starting the main time stepping loop...
4: 10% completed
4: 10% completed
4: 10% completed
4: 10% completed
4: 10% completed
4: 10% completed
4: 20% completed
4: 20% completed
4: 20% completed
4: 20% completed
4: 20% completed
4: 20% completed
4: 30% completed
4: 30% completed
4: 30% completed
4: 30% completed
4: 40% completed
4: 30% completed
4: 30% completed
4: 40% completed
4: 40% completed
4: 40% completed
4: 50% completed
4: 40% completed
4: 40% completed
4: 50% completed
4: 50% completed
4: 50% completed
4: Performing data assimilation at time 0.12...
4: Rank: 0 | Old parameters for member 0:
4: Rank: 0 | Old parameters for member 1:
4: Rank: 0 | Old parameters for member 2:
4: Rank: 0 | Number expt sites mapped to DOFs: 1
4: Performing data assimilation at time 0.12...
4: Rank: 0 | Old parameters for member 0:
4: Rank: 0 | Old parameters for member 1:
4: Rank: 0 | Old parameters for member 2:
4: Rank: 0 | Number expt sites mapped to DOFs: 1
4: 50% completed
4: 50% completed
4: Performing data assimilation at time 0.12...
4: Rank: 0 | Old parameters for member 0:
4: Rank: 0 | Old parameters for member 1:
4: Rank: 0 | Old parameters for member 2:
4: Performing data assimilation at time 0.12...
4: Rank: 0 | Old parameters for member 0:
4: Rank: 0 | Old parameters for member 1:
4: Rank: 0 | Old parameters for member 2:
4: Rank: 0 | Number expt sites mapped to DOFs: 1
4: Rank: 0 | Number expt sites mapped to DOFs: 1
4: Performing data assimilation at time 0.12...
4: Rank: 0 | Old parameters for member 0:
4: Rank: 0 | Old parameters for member 1:
4: Rank: 0 | Old parameters for member 2:
4: Performing data assimilation at time 0.12...
4: Rank: 0 | Old parameters for member 0:
4: Rank: 0 | Old parameters for member 1:
4: Rank: 0 | Old parameters for member 2:
4: Rank: 0 | Number expt sites mapped to DOFs: 1
4: Rank: 0 | Number expt sites mapped to DOFs: 1
4: Getting the perturbed innovation...
4: Applying the Kalman gain...
4: Getting the perturbed innovation...
4: Applying the Kalman gain...
4: Getting the perturbed innovation...
4: Applying the Kalman gain...
4: Getting the perturbed innovation...
4: Applying the Kalman gain...
4: Getting the perturbed innovation...
4: Applying the Kalman gain...
4: Getting the perturbed innovation...
4: Applying the Kalman gain...
4: Updating the ensemble members...
4: Done.
4: 60% completed
4: Updating the ensemble members...
4: Done.
4: 60% completed
4: 70% completed
4: Updating the ensemble members...
4: Done.
4: 60% completed
4: Updating the ensemble members...
4: Done.
4: 60% completed
4: 70% completed
4: Updating the ensemble members...
4: Done.
4: 60% completed
4: Updating the ensemble members...
4: Done.
4: 60% completed
4: 80% completed
4: 70% completed
4: 70% completed
4: 80% completed
4: 70% completed
4: 70% completed
4: 90% completed
4: 80% completed
4: 80% completed
4: 90% completed
4: 90% completed
4: 80% completed
4: 80% completed
4: 90% completed
4: 90% completed
4: 90% completed
4: 100% completed
4: 100% completed
4: 100% completed
4: 100% completed
4: [1;34;49m/var/jenkins/workspace/adamantine-nightly/tests/test_integration_da.cc(148): Leaving test case "integration_3D_da_point_cloud_add_material"; testing time: 1936145us
4: [0;39;49m[1;34;49m/var/jenkins/workspace/adamantine-nightly/tests/test_integration_da.cc(231): Entering test case "integration_3D_da_ray_add_material"
4: [1;34;49m/var/jenkins/workspace/adamantine-nightly/tests/test_integration_da.cc(148): Leaving test case "integration_3D_da_point_cloud_add_material"; testing time: 2002672us
4: [0;39;49m[1;34;49m/var/jenkins/workspace/adamantine-nightly/tests/test_integration_da.cc(231): Entering test case "integration_3D_da_ray_add_material"
4: [1;34;49m/var/jenkins/workspace/adamantine-nightly/tests/test_integration_da.cc(148): Leaving test case "integration_3D_da_point_cloud_add_material"; testing time: 2023022us
4: [0;39;49m[1;34;49m/var/jenkins/workspace/adamantine-nightly/tests/test_integration_da.cc(231): Entering test case "integration_3D_da_ray_add_material"
4: [1;34;49m/var/jenkins/workspace/adamantine-nightly/tests/test_integration_da.cc(148): Leaving test case "integration_3D_da_point_cloud_add_material"; testing time: 2168512us
4: [0;39;49m[1;34;49m/var/jenkins/workspace/adamantine-nightly/tests/test_integration_da.cc(231): Entering test case "integration_3D_da_ray_add_material"
4: 100% completed
4: 100% completed
4: [1;34;49m/var/jenkins/workspace/adamantine-nightly/tests/test_integration_da.cc(148): Leaving test case "integration_3D_da_point_cloud_add_material"; testing time: 1935507us
4: [0;39;49m[1;34;49m/var/jenkins/workspace/adamantine-nightly/tests/test_integration_da.cc(231): Entering test case "integration_3D_da_ray_add_material"
4: [1;34;49m/var/jenkins/workspace/adamantine-nightly/tests/test_integration_da.cc(148): Leaving test case "integration_3D_da_point_cloud_add_material"; testing time: 1762349us
4: [0;39;49m[1;34;49m/var/jenkins/workspace/adamantine-nightly/tests/test_integration_da.cc(231): Entering test case "integration_3D_da_ray_add_material"
4: [0;39;49mReading the experimental log file...
4: Done. Log entries found for 1 camera(s), with 1 frame(s).
4: Starting the main time stepping loop...
4: 10% completed
4: 20% completed
4: 30% completed
4: 40% completed
4: 50% completed
4: [0;39;49mRank: 4 | Old parameters for member 2:
4: [0;39;49mRank: 5 | Old parameters for member 2:
4: [0;39;49mRank: 1 | Old parameters for member 0:
4: Performing data assimilation at time 0.12...
4: Rank: 0 | Old parameters for member 0:
4: Rank: 4 | Number expt sites mapped to DOFs: 1
4: Rank: 5 | Number expt sites mapped to DOFs: 1
4: [0;39;49mRank: 2 | Old parameters for member 1:
4: [0;39;49mRank: 3 | Old parameters for member 1:
4: Rank: 1 | Number expt sites mapped to DOFs: 1
4: Rank: 0 | Number expt sites mapped to DOFs: 1
4: Rank: 2 | Number expt sites mapped to DOFs: 1
4: Rank: 3 | Number expt sites mapped to DOFs: 1
4: Getting the perturbed innovation...
4: Applying the Kalman gain...
4: Updating the ensemble members...
4: Done.
4: 60% completed
4: 70% completed
4: 80% completed
4: 90% completed
4: 100% completed
4: Reading the experimental log file...
4: Done. Log entries found for 1 camera(s), with 1 frame(s).
4: Reading the experimental log file...
4: Done. Log entries found for 1 camera(s), with 1 frame(s).
4: Reading the experimental log file...
4: Done. Log entries found for 1 camera(s), with 1 frame(s).
4: Reading the experimental log file...
4: Done. Log entries found for 1 camera(s), with 1 frame(s).
4: Reading the experimental log file...
4: Done. Log entries found for 1 camera(s), with 1 frame(s).
4: Reading the experimental log file...
4: Done. Log entries found for 1 camera(s), with 1 frame(s).
4: Starting the main time stepping loop...
4: Starting the main time stepping loop...
4: Starting the main time stepping loop...
4: Starting the main time stepping loop...
4: Starting the main time stepping loop...
4: Starting the main time stepping loop...
4: 10% completed
4: 10% completed
4: 10% completed
4: 10% completed
4: 10% completed
4: 10% completed
4: 20% completed
4: 20% completed
4: 20% completed
4: 20% completed
4: 20% completed
4: 20% completed
4: 30% completed
4: 30% completed
4: 30% completed
4: 30% completed
4: 30% completed
4: 30% completed
4: 40% completed
4: 40% completed
4: 40% completed
4: 40% completed
4: 40% completed
4: 40% completed
4: 50% completed
4: 50% completed
4: 50% completed
4: 50% completed
4: Performing data assimilation at time 0.12...
4: Rank: 0 | Old parameters for member 0:
4: Rank: 0 | Old parameters for member 1:
4: Rank: 0 | Old parameters for member 2:
4: Rank: 0 | Number expt sites mapped to DOFs: 1
4: 50% completed
4: 50% completed
4: Performing data assimilation at time 0.12...
4: Rank: 0 | Old parameters for member 0:
4: Rank: 0 | Old parameters for member 1:
4: Rank: 0 | Old parameters for member 2:
4: Rank: 0 | Number expt sites mapped to DOFs: 1
4: Performing data assimilation at time 0.12...
4: Rank: 0 | Old parameters for member 0:
4: Rank: 0 | Old parameters for member 1:
4: Rank: 0 | Old parameters for member 2:
4: Performing data assimilation at time 0.12...
4: Rank: 0 | Old parameters for member 0:
4: Rank: 0 | Old parameters for member 1:
4: Rank: 0 | Old parameters for member 2:
4: Rank: 0 | Number expt sites mapped to DOFs: 1
4: Rank: 0 | Number expt sites mapped to DOFs: 1
4: Performing data assimilation at time 0.12...
4: Rank: 0 | Old parameters for member 0:
4: Rank: 0 | Old parameters for member 1:
4: Rank: 0 | Old parameters for member 2:
4: Performing data assimilation at time 0.12...
4: Rank: 0 | Old parameters for member 0:
4: Rank: 0 | Old parameters for member 1:
4: Rank: 0 | Old parameters for member 2:
4: Rank: 0 | Number expt sites mapped to DOFs: 1
4: Rank: 0 | Number expt sites mapped to DOFs: 1
4: Getting the perturbed innovation...
4: Applying the Kalman gain...
4: Getting the perturbed innovation...
4: Applying the Kalman gain...
4: Getting the perturbed innovation...
4: Applying the Kalman gain...
4: Getting the perturbed innovation...
4: Applying the Kalman gain...
4: Getting the perturbed innovation...
4: Applying the Kalman gain...
4: Getting the perturbed innovation...
4: Applying the Kalman gain...
4: Updating the ensemble members...
4: Done.
4: 60% completed
4: Updating the ensemble members...
4: Done.
4: 60% completed
4: Updating the ensemble members...
4: Done.
4: 60% completed
4: Updating the ensemble members...
4: Done.
4: 60% completed
4: 70% completed
4: 70% completed
4: Updating the ensemble members...
4: Done.
4: 60% completed
4: Updating the ensemble members...
4: Done.
4: 60% completed
4: 70% completed
4: 70% completed
4: 80% completed
4: 80% completed
4: 70% completed
4: 70% completed
4: 80% completed
4: 80% completed
4: 80% completed
4: 90% completed
4: 90% completed
4: 80% completed
4: 90% completed
4: 90% completed
4: 90% completed
4: 90% completed
4: 100% completed
4: 100% completed
4: 100% completed
4: 100% completed
4: 100% completed
4: 100% completed
4: [1;34;49m/var/jenkins/workspace/adamantine-nightly/tests/test_integration_da.cc(231): Leaving test case "integration_3D_da_ray_add_material"; testing time: 1795759us
4: [0;39;49m[1;34;49mLeaving test module "Integration_Data_Assimilation"; testing time: 40658468us
4: [0;39;49m
4: [1;32;49m*** No errors detected
4: [0;39;49m[1;34;49m/var/jenkins/workspace/adamantine-nightly/tests/test_integration_da.cc(231): Leaving test case "integration_3D_da_ray_add_material"; testing time: 1747949us
4: [0;39;49m[1;34;49mLeaving test module "Integration_Data_Assimilation"; testing time: 40658491us
4: [0;39;49m
4: [1;32;49m*** No errors detected
4: [0;39;49m[1;34;49m/var/jenkins/workspace/adamantine-nightly/tests/test_integration_da.cc(231): Leaving test case "integration_3D_da_ray_add_material"; testing time: 1834136us
4: [0;39;49m[1;34;49mLeaving test module "Integration_Data_Assimilation"; testing time: 40668704us
4: [0;39;49m
4: [1;32;49m*** No errors detected
4: [0;39;49m[1;34;49m/var/jenkins/workspace/adamantine-nightly/tests/test_integration_da.cc(231): Leaving test case "integration_3D_da_ray_add_material"; testing time: 1774768us
4: [0;39;49m[1;34;49mLeaving test module "Integration_Data_Assimilation"; testing time: 40685293us
4: [0;39;49m
4: [1;32;49m*** No errors detected
4: [0;39;49m[1;34;49m/var/jenkins/workspace/adamantine-nightly/tests/test_integration_da.cc(231): Leaving test case "integration_3D_da_ray_add_material"; testing time: 1816813us
4: [0;39;49m[1;34;49mLeaving test module "Integration_Data_Assimilation"; testing time: 40687248us
4: [0;39;49m
4: [1;32;49m*** No errors detected
4: [0;39;49m[1;34;49m/var/jenkins/workspace/adamantine-nightly/tests/test_integration_da.cc(231): Leaving test case "integration_3D_da_ray_add_material"; testing time: 1845315us
4: [0;39;49m[1;34;49mLeaving test module "Integration_Data_Assimilation"; testing time: 40689376us
4: [0;39;49m
4: [1;32;49m*** No errors detected
4: [0;39;49m
46/48 Test #4: test_integration_da_6 .................... Passed 41.39 sec
test 7
Start 7: test_closest_source_point_adaptation_3
7: Test command: /usr/bin/mpiexec "-n" "3" "/var/jenkins/workspace/adamantine-nightly/build/bin/test_closest_source_point_adaptation"
7: Working Directory: /var/jenkins/workspace/adamantine-nightly/build/tests
7: Test timeout computed to be: 7200
7: Running 1 test case...
7: Running 1 test case...
7: [1;34;49mEntering test module "ClosestSourcePointAdaptation"
7: [0;39;49m[1;34;49m/var/jenkins/workspace/adamantine-nightly/tests/test_closest_source_point_adaptation.cc(123): Entering test case "closest_source_point_adaptation"
7: [1;34;49mEntering test module "ClosestSourcePointAdaptation"
7: [0;39;49m[1;34;49m/var/jenkins/workspace/adamantine-nightly/tests/test_closest_source_point_adaptation.cc(123): Entering test case "closest_source_point_adaptation"
7: Running 1 test case...
7: [1;34;49mEntering test module "ClosestSourcePointAdaptation"
7: [0;39;49m[1;34;49m/var/jenkins/workspace/adamantine-nightly/tests/test_closest_source_point_adaptation.cc(123): Entering test case "closest_source_point_adaptation"
7: [0;39;49m[1;34;49m/var/jenkins/workspace/adamantine-nightly/tests/test_closest_source_point_adaptation.cc(123): Leaving test case "closest_source_point_adaptation"; testing time: 5741183us
7: [0;39;49m[1;34;49mLeaving test module "ClosestSourcePointAdaptation"; testing time: 5741245us
7: [0;39;49m
7: [1;32;49m*** No errors detected
7: [0;39;49m[0;39;49m[1;34;49m/var/jenkins/workspace/adamantine-nightly/tests/test_closest_source_point_adaptation.cc(123): Leaving test case "closest_source_point_adaptation"; testing time: 5741322us
7: [0;39;49m[1;34;49mLeaving test module "ClosestSourcePointAdaptation"; testing time: 5741404us
7: [0;39;49m
7: [1;32;49m*** No errors detected
7: [0;39;49m[0;39;49m[1;34;49m/var/jenkins/workspace/adamantine-nightly/tests/test_closest_source_point_adaptation.cc(123): Leaving test case "closest_source_point_adaptation"; testing time: 5741339us
7: [0;39;49m[1;34;49mLeaving test module "ClosestSourcePointAdaptation"; testing time: 5741412us
7: [0;39;49m
7: [1;32;49m*** No errors detected
7: [0;39;49m
47/48 Test #7: test_closest_source_point_adaptation_3 ... Passed 6.35 sec
test 8
Start 8: test_closest_source_point_adaptation_6
8: Test command: /usr/bin/mpiexec "-n" "6" "/var/jenkins/workspace/adamantine-nightly/build/bin/test_closest_source_point_adaptation"
8: Working Directory: /var/jenkins/workspace/adamantine-nightly/build/tests
8: Test timeout computed to be: 7200
8: Running 1 test case...
8: Running 1 test case...
8: Running 1 test case...
8: Running 1 test case...
8: Running 1 test case...
8: [1;34;49mEntering test module "ClosestSourcePointAdaptation"
8: [1;34;49mEntering test module "ClosestSourcePointAdaptation"
8: [0;39;49m[1;34;49m/var/jenkins/workspace/adamantine-nightly/tests/test_closest_source_point_adaptation.cc(123): Entering test case "closest_source_point_adaptation"
8: [0;39;49m[1;34;49m/var/jenkins/workspace/adamantine-nightly/tests/test_closest_source_point_adaptation.cc(123): Entering test case "closest_source_point_adaptation"
8: [1;34;49mEntering test module "ClosestSourcePointAdaptation"
8: [1;34;49mEntering test module "ClosestSourcePointAdaptation"
8: [0;39;49m[1;34;49m/var/jenkins/workspace/adamantine-nightly/tests/test_closest_source_point_adaptation.cc(123): Entering test case "closest_source_point_adaptation"
8: [0;39;49m[1;34;49m/var/jenkins/workspace/adamantine-nightly/tests/test_closest_source_point_adaptation.cc(123): Entering test case "closest_source_point_adaptation"
8: [1;34;49mEntering test module "ClosestSourcePointAdaptation"
8: [0;39;49m[1;34;49m/var/jenkins/workspace/adamantine-nightly/tests/test_closest_source_point_adaptation.cc(123): Entering test case "closest_source_point_adaptation"
8: Running 1 test case...
8: [1;34;49mEntering test module "ClosestSourcePointAdaptation"
8: [0;39;49m[1;34;49m/var/jenkins/workspace/adamantine-nightly/tests/test_closest_source_point_adaptation.cc(123): Entering test case "closest_source_point_adaptation"
8: [0;39;49m[1;34;49m/var/jenkins/workspace/adamantine-nightly/tests/test_closest_source_point_adaptation.cc(123): Leaving test case "closest_source_point_adaptation"; testing time: 3617601us
8: [0;39;49m[1;34;49mLeaving test module "ClosestSourcePointAdaptation"; testing time: 3617687us
8: [0;39;49m
8: [1;32;49m*** No errors detected
8: [0;39;49m[0;39;49m[1;34;49m/var/jenkins/workspace/adamantine-nightly/tests/test_closest_source_point_adaptation.cc(123): Leaving test case "closest_source_point_adaptation"; testing time: 3617924us
8: [0;39;49m[1;34;49mLeaving test module "ClosestSourcePointAdaptation"; testing time: 3618067us
8: [0;39;49m[1;34;49m/var/jenkins/workspace/adamantine-nightly/tests/test_closest_source_point_adaptation.cc(123): Leaving test case "closest_source_point_adaptation"; testing time: 3618266us
8: [0;39;49m[1;34;49mLeaving test module "ClosestSourcePointAdaptation"; testing time: 3618322us
8: [0;39;49m
8: [1;32;49m*** No errors detected
8: [0;39;49m
8: [1;32;49m*** No errors detected
8: [0;39;49m[0;39;49m[0;39;49m[1;34;49m/var/jenkins/workspace/adamantine-nightly/tests/test_closest_source_point_adaptation.cc(123): Leaving test case "closest_source_point_adaptation"; testing time: 3618246us
8: [0;39;49m[1;34;49mLeaving test module "ClosestSourcePointAdaptation"; testing time: 3618303us
8: [0;39;49m
8: [1;32;49m*** No errors detected
8: [0;39;49m[0;39;49m[1;34;49m/var/jenkins/workspace/adamantine-nightly/tests/test_closest_source_point_adaptation.cc(123): Leaving test case "closest_source_point_adaptation"; testing time: 3618497us
8: [0;39;49m[1;34;49mLeaving test module "ClosestSourcePointAdaptation"; testing time: 3618563us
8: [0;39;49m
8: [1;32;49m*** No errors detected
8: [0;39;49m[0;39;49m[1;34;49m/var/jenkins/workspace/adamantine-nightly/tests/test_closest_source_point_adaptation.cc(123): Leaving test case "closest_source_point_adaptation"; testing time: 3618545us
8: [0;39;49m[1;34;49mLeaving test module "ClosestSourcePointAdaptation"; testing time: 3618628us
8: [0;39;49m
8: [1;32;49m*** No errors detected
8: [0;39;49m
48/48 Test #8: test_closest_source_point_adaptation_6 ... Passed 4.31 sec
The following tests passed:
test_closest_source_point_adaptation_1
test_data_assimilator_1
test_experimental_data_1
test_geometry_1
test_heat_source_1
test_integration_da_2
test_closest_source_point_adaptation_2
test_material_property_device_1
test_material_property_1
test_integration_da_1
test_post_processor_1
test_quaternion_1
test_scan_path_1
test_thermal_operator_1
test_thermal_operator_device_1
test_mechanical_operator_1
test_timer_1
test_utils_1
test_validate_input_database_1
test_integration_2d_1
test_integration_2d_device_1
test_thermal_physics_device_1
test_mechanical_physics_1
test_integration_3d_amr_1
test_integration_3d_amr_device_1
test_integration_da_augmented_1
test_material_deposition_1
test_microstructure_1
test_thermal_physics_1
test_ensemble_management_1
test_integration_3d_device_1
test_integration_2d_2
test_integration_2d_device_2
test_integration_3d_amr_2
test_integration_3d_amr_device_2
test_integration_da_augmented_2
test_material_deposition_2
test_microstructure_2
test_thermal_physics_2
test_ensemble_management_2
test_integration_thermoelastic_2
test_integration_da_3
test_integration_da_6
test_closest_source_point_adaptation_3
test_closest_source_point_adaptation_6
94% tests passed, 3 tests failed out of 48
Total Test time (real) = 10889.87 sec
The following tests FAILED:
31 - test_integration_3d_1 (Timeout)
32 - test_integration_3d_2 (Timeout)
39 - test_integration_thermoelastic_1 (Timeout)
Errors while running CTest
Output from these tests are in: /var/jenkins/workspace/adamantine-nightly/build/Testing/Temporary/LastTest.log
Use "--rerun-failed --output-on-failure" to re-run the failed cases verbosely.
[Pipeline] }
[Pipeline] // dir
Post stage
[Pipeline] xunit
INFO: Processing CTest-Version 3.x (default)
[Pipeline] }
[Pipeline] // withEnv
[Pipeline] }
$ docker stop --time=1 1006aae64f9fb8a0568a406d64af0e7b728485487c19fbff2bc0f90b94050798
INFO: [CTest-Version 3.x (default)] - 1 test report file(s) were found with the pattern 'build/Testing/**/Test.xml' relative to '/var/jenkins/workspace/adamantine-nightly' for the testing framework 'CTest-Version 3.x (default)'.
$ docker rm -f --volumes 1006aae64f9fb8a0568a406d64af0e7b728485487c19fbff2bc0f90b94050798
[Pipeline] // withDockerContainer
[Pipeline] }
[Pipeline] // withEnv
[Pipeline] }
[Pipeline] // node
[Pipeline] }
[Pipeline] // stage
[Pipeline] }
Failed in branch CPU
40: 40% completed
40: 50% completed
40: 60% completed
40: 70% completed
40: 80% completed
40: 90% completed
40: 100% completed
40: [1;34;49m/var/jenkins/workspace/adamantine-nightly/tests/test_integration_thermoelastic.cc(19): Leaving test case "integration_thermoelastic"; testing time: 2688745291us
40: [0;39;49m[1;34;49m/var/jenkins/workspace/adamantine-nightly/tests/test_integration_thermoelastic.cc(47): Entering test case "integration_thermoelastic_add_material"
40: [1;34;49m/var/jenkins/workspace/adamantine-nightly/tests/test_integration_thermoelastic.cc(19): Leaving test case "integration_thermoelastic"; testing time: 2688757118us
40: [0;39;49m[1;34;49m/var/jenkins/workspace/adamantine-nightly/tests/test_integration_thermoelastic.cc(47): Entering test case "integration_thermoelastic_add_material"
40: [0;39;49m[0;39;49m10% completed
40: 20% completed
40: 30% completed
40: 40% completed
40: 50% completed
40: 60% completed
40: 70% completed
40: 80% completed
40: 90% completed
40: 100% completed
40:
40: [1;32;49m*** No errors detected
40: [0;39;49m[1;34;49m/var/jenkins/workspace/adamantine-nightly/tests/test_integration_thermoelastic.cc(47): Leaving test case "integration_thermoelastic_add_material"; testing time: 1365356799us
40: [0;39;49m[1;34;49mLeaving test module "Integration_Thermoelastic"; testing time: 4054104803us
40: [0;39;49m[1;34;49m/var/jenkins/workspace/adamantine-nightly/tests/test_integration_thermoelastic.cc(47): Leaving test case "integration_thermoelastic_add_material"; testing time: 1365356530us
40: [0;39;49m[1;34;49mLeaving test module "Integration_Thermoelastic"; testing time: 4054116902us
40: [0;39;49m
40: [1;32;49m*** No errors detected
40: [0;39;49m
44/48 Test #40: test_integration_thermoelastic_2 ......... Passed 4062.10 sec
test 3
Start 3: test_integration_da_3
3: Test command: /usr/bin/mpiexec "-n" "3" "/var/jenkins/workspace/adamantine-nightly/build/bin/test_integration_da"
3: Working Directory: /var/jenkins/workspace/adamantine-nightly/build/tests
3: Test timeout computed to be: 7200
3: Running 3 test cases...
3: [1;34;49mEntering test module "Integration_Data_Assimilation"
3: [0;39;49m[1;34;49m/var/jenkins/workspace/adamantine-nightly/tests/test_integration_da.cc(78): Entering test case "integration_data_assimilation"
3: Running 3 test cases...
3: [1;34;49mEntering test module "Integration_Data_Assimilation"
3: [0;39;49m[1;34;49m/var/jenkins/workspace/adamantine-nightly/tests/test_integration_da.cc(78): Entering test case "integration_data_assimilation"
3: Running 3 test cases...
3: [1;34;49mEntering test module "Integration_Data_Assimilation"
3: [0;39;49m[1;34;49m/var/jenkins/workspace/adamantine-nightly/tests/test_integration_da.cc(78): Entering test case "integration_data_assimilation"
3: [0;39;49mReading the experimental log file...
3: Done. Log entries found for 1 camera(s), with 2 frame(s).
3: Starting the main time stepping loop...
3: 10% completed
3: 20% completed
3: 30% completed
3: 40% completed
3: Performing data assimilation at time 0.0211...
3: Rank: 0 | Old parameters for member 0:
3: [0;39;49mRank: 1 | Old parameters for member 1:
3: [0;39;49mRank: 2 | Old parameters for member 2:
3: Rank: 1 | Number expt sites mapped to DOFs: 1
3: Rank: 2 | Number expt sites mapped to DOFs: 1
3: Rank: 0 | Number expt sites mapped to DOFs: 1
3: Getting the perturbed innovation...
3: Applying the Kalman gain...
3: Updating the ensemble members...
3: Done.
3: 50% completed
3: 60% completed
3: Rank: 2 | Old parameters for member 2:
3: Rank: 1 | Old parameters for member 1:
3: Performing data assimilation at time 0.0316...
3: Rank: 0 | Old parameters for member 0:
3: Rank: 1 | Number expt sites mapped to DOFs: 1
3: Rank: 2 | Number expt sites mapped to DOFs: 1
3: Rank: 0 | Number expt sites mapped to DOFs: 1
3: Getting the perturbed innovation...
3: Applying the Kalman gain...
3: Updating the ensemble members...
3: Done.
3: 70% completed
3: 80% completed
3: 90% completed
3: 100% completed
3: Reading the experimental log file...
3: Done. Log entries found for 1 camera(s), with 2 frame(s).
3: Reading the experimental log file...
3: Done. Log entries found for 1 camera(s), with 2 frame(s).
3: Reading the experimental log file...
3: Done. Log entries found for 1 camera(s), with 2 frame(s).
3: Starting the main time stepping loop...
3: Starting the main time stepping loop...
3: Starting the main time stepping loop...
3: 10% completed
3: 10% completed
3: 10% completed
3: 20% completed
3: 20% completed
3: 20% completed
3: 30% completed
3: 30% completed
3: 30% completed
3: 40% completed
3: 40% completed
3: 40% completed
3: Performing data assimilation at time 0.0211...
3: Rank: 0 | Old parameters for member 0:
3: Rank: 0 | Old parameters for member 1:
3: Rank: 0 | Old parameters for member 2:
3: Performing data assimilation at time 0.0211...
3: Rank: 0 | Old parameters for member 0:
3: Rank: 0 | Old parameters for member 1:
3: Rank: 0 | Old parameters for member 2:
3: Rank: 0 | Number expt sites mapped to DOFs: 1
3: Rank: 0 | Number expt sites mapped to DOFs: 1
3: Performing data assimilation at time 0.0211...
3: Rank: 0 | Old parameters for member 0:
3: Rank: 0 | Old parameters for member 1:
3: Rank: 0 | Old parameters for member 2:
3: Rank: 0 | Number expt sites mapped to DOFs: 1
3: Getting the perturbed innovation...
3: Applying the Kalman gain...
3: Getting the perturbed innovation...
3: Applying the Kalman gain...
3: Getting the perturbed innovation...
3: Applying the Kalman gain...
3: Updating the ensemble members...
3: Done.
3: Updating the ensemble members...
3: Done.
3: Updating the ensemble members...
3: Done.
3: 50% completed
3: 50% completed
3: 50% completed
3: 60% completed
3: 60% completed
3: 60% completed
3: Performing data assimilation at time 0.0316...
3: Rank: 0 | Old parameters for member 0:
3: Rank: 0 | Old parameters for member 1:
3: Rank: 0 | Old parameters for member 2:
3: Rank: 0 | Number expt sites mapped to DOFs: 1
3: Performing data assimilation at time 0.0316...
3: Rank: 0 | Old parameters for member 0:
3: Rank: 0 | Old parameters for member 1:
3: Rank: 0 | Old parameters for member 2:
3: Rank: 0 | Number expt sites mapped to DOFs: 1
3: Performing data assimilation at time 0.0316...
3: Rank: 0 | Old parameters for member 0:
3: Rank: 0 | Old parameters for member 1:
3: Rank: 0 | Old parameters for member 2:
3: Rank: 0 | Number expt sites mapped to DOFs: 1
3: Getting the perturbed innovation...
3: Applying the Kalman gain...
3: Getting the perturbed innovation...
3: Applying the Kalman gain...
3: Getting the perturbed innovation...
3: Applying the Kalman gain...
3: Updating the ensemble members...
3: Done.
3: Updating the ensemble members...
3: Done.
3: Updating the ensemble members...
3: Done.
3: 70% completed
3: 70% completed
3: 70% completed
3: 80% completed
3: 80% completed
3: 80% completed
3: 90% completed
3: 90% completed
3: 90% completed
3: 100% completed
3: 100% completed
3: [1;34;49m/var/jenkins/workspace/adamantine-nightly/tests/test_integration_da.cc(78): Leaving test case "integration_data_assimilation"; testing time: 63107549us
3: [0;39;49m[1;34;49m/var/jenkins/workspace/adamantine-nightly/tests/test_integration_da.cc(148): Entering test case "integration_3D_da_point_cloud_add_material"
3: [1;34;49m/var/jenkins/workspace/adamantine-nightly/tests/test_integration_da.cc(78): Leaving test case "integration_data_assimilation"; testing time: 63154166us
3: [0;39;49m[1;34;49m/var/jenkins/workspace/adamantine-nightly/tests/test_integration_da.cc(148): Entering test case "integration_3D_da_point_cloud_add_material"
3: 100% completed
3: [1;34;49m/var/jenkins/workspace/adamantine-nightly/tests/test_integration_da.cc(78): Leaving test case "integration_data_assimilation"; testing time: 63801575us
3: [0;39;49m[1;34;49m/var/jenkins/workspace/adamantine-nightly/tests/test_integration_da.cc(148): Entering test case "integration_3D_da_point_cloud_add_material"
3: [0;39;49mReading the experimental log file...
3: Done. Log entries found for 1 camera(s), with 1 frame(s).
3: Starting the main time stepping loop...
3: 10% completed
3: 20% completed
3: 30% completed
3: 40% completed
3: 50% completed
3: [0;39;49mRank: 2 | Old parameters for member 2:
3: Performing data assimilation at time 0.12...
3: Rank: 0 | Old parameters for member 0:
3: Rank: 2 | Number expt sites mapped to DOFs: 1
3: [0;39;49mRank: 1 | Old parameters for member 1:
3: Rank: 0 | Number expt sites mapped to DOFs: 1
3: Rank: 1 | Number expt sites mapped to DOFs: 1
3: Getting the perturbed innovation...
3: Applying the Kalman gain...
3: Updating the ensemble members...
3: Done.
3: 60% completed
3: 70% completed
3: 80% completed
3: 90% completed
3: 100% completed
3: Reading the experimental log file...
3: Done. Log entries found for 1 camera(s), with 1 frame(s).
3: Reading the experimental log file...
3: Done. Log entries found for 1 camera(s), with 1 frame(s).
3: Reading the experimental log file...
3: Done. Log entries found for 1 camera(s), with 1 frame(s).
3: Starting the main time stepping loop...
3: Starting the main time stepping loop...
3: Starting the main time stepping loop...
3: 10% completed
3: 10% completed
3: 10% completed
3: 20% completed
3: 20% completed
3: 20% completed
3: 30% completed
3: 30% completed
3: 30% completed
3: 40% completed
3: 40% completed
3: 40% completed
3: 50% completed
3: 50% completed
3: 50% completed
3: Performing data assimilation at time 0.12...
3: Rank: 0 | Old parameters for member 0:
3: Rank: 0 | Old parameters for member 1:
3: Rank: 0 | Old parameters for member 2:
3: Performing data assimilation at time 0.12...
3: Rank: 0 | Old parameters for member 0:
3: Rank: 0 | Old parameters for member 1:
3: Rank: 0 | Old parameters for member 2:
3: Performing data assimilation at time 0.12...
3: Rank: 0 | Old parameters for member 0:
3: Rank: 0 | Old parameters for member 1:
3: Rank: 0 | Old parameters for member 2:
3: Rank: 0 | Number expt sites mapped to DOFs: 1
3: Rank: 0 | Number expt sites mapped to DOFs: 1
3: Rank: 0 | Number expt sites mapped to DOFs: 1
3: Getting the perturbed innovation...
3: Applying the Kalman gain...
3: Getting the perturbed innovation...
3: Applying the Kalman gain...
3: Getting the perturbed innovation...
3: Applying the Kalman gain...
3: Updating the ensemble members...
3: Updating the ensemble members...
3: Updating the ensemble members...
3: Done.
3: 60% completed
3: Done.
3: 60% completed
3: Done.
3: 60% completed
3: 70% completed
3: 70% completed
3: 70% completed
3: 80% completed
3: 80% completed
3: 80% completed
3: 90% completed
3: 90% completed
3: 90% completed
3: 100% completed
3: 100% completed
3: 100% completed
3: [1;34;49m/var/jenkins/workspace/adamantine-nightly/tests/test_integration_da.cc(148): Leaving test case "integration_3D_da_point_cloud_add_material"; testing time: 3144076us
3: [0;39;49m[1;34;49m/var/jenkins/workspace/adamantine-nightly/tests/test_integration_da.cc(231): Entering test case "integration_3D_da_ray_add_material"
3: [1;34;49m/var/jenkins/workspace/adamantine-nightly/tests/test_integration_da.cc(148): Leaving test case "integration_3D_da_point_cloud_add_material"; testing time: 3107944us
3: [0;39;49m[1;34;49m/var/jenkins/workspace/adamantine-nightly/tests/test_integration_da.cc(231): Entering test case "integration_3D_da_ray_add_material"
3: [1;34;49m/var/jenkins/workspace/adamantine-nightly/tests/test_integration_da.cc(148): Leaving test case "integration_3D_da_point_cloud_add_material"; testing time: 2467251us
3: [0;39;49m[1;34;49m/var/jenkins/workspace/adamantine-nightly/tests/test_integration_da.cc(231): Entering test case "integration_3D_da_ray_add_material"
3: [0;39;49mReading the experimental log file...
3: Done. Log entries found for 1 camera(s), with 1 frame(s).
3: Starting the main time stepping loop...
3: 10% completed
3: 20% completed
3: 30% completed
3: 40% completed
3: 50% completed
3: [0;39;49mRank: 1 | Old parameters for member 1:
3: Performing data assimilation at time 0.12...
3: Rank: 0 | Old parameters for member 0:
3: [0;39;49mRank: 2 | Old parameters for member 2:
3: Rank: 1 | Number expt sites mapped to DOFs: 1
3: Rank: 0 | Number expt sites mapped to DOFs: 1
3: Rank: 2 | Number expt sites mapped to DOFs: 1
3: Getting the perturbed innovation...
3: Applying the Kalman gain...
3: Updating the ensemble members...
3: Done.
3: 60% completed
3: 70% completed
3: 80% completed
3: 90% completed
3: 100% completed
3: Reading the experimental log file...
3: Done. Log entries found for 1 camera(s), with 1 frame(s).
3: Reading the experimental log file...
3: Done. Log entries found for 1 camera(s), with 1 frame(s).
3: Reading the experimental log file...
3: Done. Log entries found for 1 camera(s), with 1 frame(s).
3: Starting the main time stepping loop...
3: Starting the main time stepping loop...
3: Starting the main time stepping loop...
3: 10% completed
3: 10% completed
3: 10% completed
3: 20% completed
3: 20% completed
3: 20% completed
3: 30% completed
3: 30% completed
3: 30% completed
3: 40% completed
3: 40% completed
3: 40% completed
3: 50% completed
3: 50% completed
3: 50% completed
3: Performing data assimilation at time 0.12...
3: Rank: 0 | Old parameters for member 0:
3: Rank: 0 | Old parameters for member 1:
3: Rank: 0 | Old parameters for member 2:
3: Performing data assimilation at time 0.12...
3: Rank: 0 | Old parameters for member 0:
3: Rank: 0 | Old parameters for member 1:
3: Rank: 0 | Old parameters for member 2:
3: Performing data assimilation at time 0.12...
3: Rank: 0 | Old parameters for member 0:
3: Rank: 0 | Old parameters for member 1:
3: Rank: 0 | Old parameters for member 2:
3: Rank: 0 | Number expt sites mapped to DOFs: 1
3: Rank: 0 | Number expt sites mapped to DOFs: 1
3: Rank: 0 | Number expt sites mapped to DOFs: 1
3: Getting the perturbed innovation...
3: Applying the Kalman gain...
3: Getting the perturbed innovation...
3: Applying the Kalman gain...
3: Getting the perturbed innovation...
3: Applying the Kalman gain...
3: Updating the ensemble members...
3: Updating the ensemble members...
3: Done.
3: 60% completed
3: Done.
3: 60% completed
3: Updating the ensemble members...
3: Done.
3: 60% completed
3: 70% completed
3: 70% completed
3: 70% completed
3: 80% completed
3: 80% completed
3: 80% completed
3: 90% completed
3: 90% completed
3: 90% completed
3: 100% completed
3: 100% completed
3: 100% completed
3: [1;34;49m/var/jenkins/workspace/adamantine-nightly/tests/test_integration_da.cc(231): Leaving test case "integration_3D_da_ray_add_material"; testing time: 2462974us
3: [0;39;49m[1;34;49mLeaving test module "Integration_Data_Assimilation"; testing time: 68714735us
3: [0;39;49m
3: [1;32;49m*** No errors detected
3: [0;39;49m[1;34;49m/var/jenkins/workspace/adamantine-nightly/tests/test_integration_da.cc(231): Leaving test case "integration_3D_da_ray_add_material"; testing time: 2461714us
3: [0;39;49m[1;34;49mLeaving test module "Integration_Data_Assimilation"; testing time: 68723952us
3: [0;39;49m
3: [1;32;49m*** No errors detected
3: [0;39;49m[1;34;49m/var/jenkins/workspace/adamantine-nightly/tests/test_integration_da.cc(231): Leaving test case "integration_3D_da_ray_add_material"; testing time: 2469853us
3: [0;39;49m[1;34;49mLeaving test module "Integration_Data_Assimilation"; testing time: 68738834us
3: [0;39;49m
3: [1;32;49m*** No errors detected
3: [0;39;49m
45/48 Test #3: test_integration_da_3 .................... Passed 70.12 sec
test 4
Start 4: test_integration_da_6
4: Test command: /usr/bin/mpiexec "-n" "6" "/var/jenkins/workspace/adamantine-nightly/build/bin/test_integration_da"
4: Working Directory: /var/jenkins/workspace/adamantine-nightly/build/tests
4: Test timeout computed to be: 7200
4: Running 3 test cases...
4: [1;34;49mEntering test module "Integration_Data_Assimilation"
4: [0;39;49m[1;34;49m/var/jenkins/workspace/adamantine-nightly/tests/test_integration_da.cc(78): Entering test case "integration_data_assimilation"
4: Running 3 test cases...
4: [1;34;49mEntering test module "Integration_Data_Assimilation"
4: [0;39;49m[1;34;49m/var/jenkins/workspace/adamantine-nightly/tests/test_integration_da.cc(78): Entering test case "integration_data_assimilation"
4: Running 3 test cases...
4: [1;34;49mEntering test module "Integration_Data_Assimilation"
4: [0;39;49m[1;34;49m/var/jenkins/workspace/adamantine-nightly/tests/test_integration_da.cc(78): Entering test case "integration_data_assimilation"
4: Running 3 test cases...
4: [1;34;49mEntering test module "Integration_Data_Assimilation"
4: [0;39;49m[1;34;49m/var/jenkins/workspace/adamantine-nightly/tests/test_integration_da.cc(78): Entering test case "integration_data_assimilation"
4: Running 3 test cases...
4: [1;34;49mEntering test module "Integration_Data_Assimilation"
4: [0;39;49m[1;34;49m/var/jenkins/workspace/adamantine-nightly/tests/test_integration_da.cc(78): Entering test case "integration_data_assimilation"
4: Running 3 test cases...
4: [1;34;49mEntering test module "Integration_Data_Assimilation"
4: [0;39;49m[1;34;49m/var/jenkins/workspace/adamantine-nightly/tests/test_integration_da.cc(78): Entering test case "integration_data_assimilation"
4: [0;39;49mReading the experimental log file...
4: Done. Log entries found for 1 camera(s), with 2 frame(s).
4: Starting the main time stepping loop...
4: 10% completed
4: 20% completed
4: 30% completed
4: 40% completed
4: [0;39;49mRank: 1 | Old parameters for member 0:
4: Performing data assimilation at time 0.0211...
4: Rank: 0 | Old parameters for member 0:
4: [0;39;49mRank: 4 | Old parameters for member 2:
4: [0;39;49mRank: 5 | Old parameters for member 2:
4: Rank: 4 | Number expt sites mapped to DOFs: 1
4: Rank: 5 | Number expt sites mapped to DOFs: 1
4: Rank: 1 | Number expt sites mapped to DOFs: 1
4: Rank: 0 | Number expt sites mapped to DOFs: 1
4: [0;39;49mRank: 3 | Old parameters for member 1:
4: [0;39;49mRank: 2 | Old parameters for member 1:
4: Rank: 3 | Number expt sites mapped to DOFs: 1
4: Rank: 2 | Number expt sites mapped to DOFs: 1
4: Getting the perturbed innovation...
4: Applying the Kalman gain...
4: Updating the ensemble members...
4: Done.
4: 50% completed
4: 60% completed
4: Rank: 3 | Old parameters for member 1:
4: Rank: 2 | Old parameters for member 1:
4: Rank: 1 | Old parameters for member 0:
4: Performing data assimilation at time 0.0316...
4: Rank: 0 | Old parameters for member 0:
4: Rank: 4 | Old parameters for member 2:
4: Rank: 5 | Old parameters for member 2:
4: Rank: 0 | Number expt sites mapped to DOFs: 1
4: Rank: 1 | Number expt sites mapped to DOFs: 1
4: Rank: 3 | Number expt sites mapped to DOFs: 1
4: Rank: 2 | Number expt sites mapped to DOFs: 1
4: Rank: 5 | Number expt sites mapped to DOFs: 1
4: Rank: 4 | Number expt sites mapped to DOFs: 1
4: Getting the perturbed innovation...
4: Applying the Kalman gain...
4: Updating the ensemble members...
4: Done.
4: 70% completed
4: 80% completed
4: 90% completed
4: 100% completed
4: Reading the experimental log file...
4: Done. Log entries found for 1 camera(s), with 2 frame(s).
4: Reading the experimental log file...
4: Done. Log entries found for 1 camera(s), with 2 frame(s).
4: Reading the experimental log file...
4: Done. Log entries found for 1 camera(s), with 2 frame(s).
4: Reading the experimental log file...
4: Done. Log entries found for 1 camera(s), with 2 frame(s).
4: Reading the experimental log file...
4: Done. Log entries found for 1 camera(s), with 2 frame(s).
4: Reading the experimental log file...
4: Done. Log entries found for 1 camera(s), with 2 frame(s).
4: Starting the main time stepping loop...
4: Starting the main time stepping loop...
4: Starting the main time stepping loop...
4: Starting the main time stepping loop...
4: Starting the main time stepping loop...
4: Starting the main time stepping loop...
4: 10% completed
4: 10% completed
4: 10% completed
4: 10% completed
4: 10% completed
4: 10% completed
4: 20% completed
4: 20% completed
4: 20% completed
4: 20% completed
4: 20% completed
4: 20% completed
4: 30% completed
4: 30% completed
4: 30% completed
4: 30% completed
4: 30% completed
4: 30% completed
4: 40% completed
4: 40% completed
4: 40% completed
4: 40% completed
4: 40% completed
4: 40% completed
4: Performing data assimilation at time 0.0211...
4: Rank: 0 | Old parameters for member 0:
4: Rank: 0 | Old parameters for member 1:
4: Rank: 0 | Old parameters for member 2:
4: Performing data assimilation at time 0.0211...
4: Rank: 0 | Old parameters for member 0:
4: Rank: 0 | Old parameters for member 1:
4: Rank: 0 | Old parameters for member 2:
4: Rank: 0 | Number expt sites mapped to DOFs: 1
4: Rank: 0 | Number expt sites mapped to DOFs: 1
4: Performing data assimilation at time 0.0211...
4: Rank: 0 | Old parameters for member 0:
4: Rank: 0 | Old parameters for member 1:
4: Rank: 0 | Old parameters for member 2:
4: Rank: 0 | Number expt sites mapped to DOFs: 1
4: Performing data assimilation at time 0.0211...
4: Rank: 0 | Old parameters for member 0:
4: Rank: 0 | Old parameters for member 1:
4: Rank: 0 | Old parameters for member 2:
4: Performing data assimilation at time 0.0211...
4: Rank: 0 | Old parameters for member 0:
4: Rank: 0 | Old parameters for member 1:
4: Rank: 0 | Old parameters for member 2:
4: Rank: 0 | Number expt sites mapped to DOFs: 1
4: Performing data assimilation at time 0.0211...
4: Rank: 0 | Old parameters for member 0:
4: Rank: 0 | Old parameters for member 1:
4: Rank: 0 | Old parameters for member 2:
4: Rank: 0 | Number expt sites mapped to DOFs: 1
4: Rank: 0 | Number expt sites mapped to DOFs: 1
4: Getting the perturbed innovation...
4: Applying the Kalman gain...
4: Getting the perturbed innovation...
4: Applying the Kalman gain...
4: Getting the perturbed innovation...
4: Applying the Kalman gain...
4: Getting the perturbed innovation...
4: Applying the Kalman gain...
4: Getting the perturbed innovation...
4: Applying the Kalman gain...
4: Getting the perturbed innovation...
4: Applying the Kalman gain...
4: Updating the ensemble members...
4: Done.
4: Updating the ensemble members...
4: Done.
4: Updating the ensemble members...
4: Done.
4: Updating the ensemble members...
4: Done.
4: Updating the ensemble members...
4: Done.
4: Updating the ensemble members...
4: Done.
4: 50% completed
4: 50% completed
4: 50% completed
4: 50% completed
4: 50% completed
4: 50% completed
4: 60% completed
4: 60% completed
4: 60% completed
4: 60% completed
4: 60% completed
4: 60% completed
4: Performing data assimilation at time 0.0316...
4: Rank: 0 | Old parameters for member 0:
4: Rank: 0 | Old parameters for member 1:
4: Rank: 0 | Old parameters for member 2:
4: Rank: 0 | Number expt sites mapped to DOFs: 1
4: Performing data assimilation at time 0.0316...
4: Rank: 0 | Old parameters for member 0:
4: Rank: 0 | Old parameters for member 1:
4: Rank: 0 | Old parameters for member 2:
4: Rank: 0 | Number expt sites mapped to DOFs: 1
4: Performing data assimilation at time 0.0316...
4: Rank: 0 | Old parameters for member 0:
4: Rank: 0 | Old parameters for member 1:
4: Rank: 0 | Old parameters for member 2:
4: Performing data assimilation at time 0.0316...
4: Rank: 0 | Old parameters for member 0:
4: Rank: 0 | Old parameters for member 1:
4: Rank: 0 | Old parameters for member 2:
4: Rank: 0 | Number expt sites mapped to DOFs: 1
4: Performing data assimilation at time 0.0316...
4: Rank: 0 | Old parameters for member 0:
4: Rank: 0 | Old parameters for member 1:
4: Rank: 0 | Old parameters for member 2:
4: Rank: 0 | Number expt sites mapped to DOFs: 1
4: Rank: 0 | Number expt sites mapped to DOFs: 1
4: Performing data assimilation at time 0.0316...
4: Rank: 0 | Old parameters for member 0:
4: Rank: 0 | Old parameters for member 1:
4: Rank: 0 | Old parameters for member 2:
4: Rank: 0 | Number expt sites mapped to DOFs: 1
4: Getting the perturbed innovation...
4: Applying the Kalman gain...
4: Getting the perturbed innovation...
4: Applying the Kalman gain...
4: Getting the perturbed innovation...
4: Applying the Kalman gain...
4: Getting the perturbed innovation...
4: Applying the Kalman gain...
4: Getting the perturbed innovation...
4: Applying the Kalman gain...
4: Getting the perturbed innovation...
4: Applying the Kalman gain...
4: Updating the ensemble members...
4: Done.
4: Updating the ensemble members...
4: Done.
4: Updating the ensemble members...
4: Done.
4: Updating the ensemble members...
4: Done.
4: Updating the ensemble members...
4: Done.
4: Updating the ensemble members...
4: Done.
4: 70% completed
4: 70% completed
4: 70% completed
4: 70% completed
4: 70% completed
4: 70% completed
4: 80% completed
4: 80% completed
4: 80% completed
4: 80% completed
4: 80% completed
4: 80% completed
4: 90% completed
4: 90% completed
4: 90% completed
4: 90% completed
4: 90% completed
4: 90% completed
4: 100% completed
4: 100% completed
4: 100% completed
4: [1;34;49m/var/jenkins/workspace/adamantine-nightly/tests/test_integration_da.cc(78): Leaving test case "integration_data_assimilation"; testing time: 57683492us
4: [0;39;49m[1;34;49m/var/jenkins/workspace/adamantine-nightly/tests/test_integration_da.cc(148): Entering test case "integration_3D_da_point_cloud_add_material"
4: [1;34;49m/var/jenkins/workspace/adamantine-nightly/tests/test_integration_da.cc(78): Leaving test case "integration_data_assimilation"; testing time: 57707332us
4: [0;39;49m[1;34;49m/var/jenkins/workspace/adamantine-nightly/tests/test_integration_da.cc(148): Entering test case "integration_3D_da_point_cloud_add_material"
4: 100% completed
4: 100% completed
4: 100% completed
4: [1;34;49m/var/jenkins/workspace/adamantine-nightly/tests/test_integration_da.cc(78): Leaving test case "integration_data_assimilation"; testing time: 57865099us
4: [0;39;49m[1;34;49m/var/jenkins/workspace/adamantine-nightly/tests/test_integration_da.cc(148): Entering test case "integration_3D_da_point_cloud_add_material"
4: [1;34;49m/var/jenkins/workspace/adamantine-nightly/tests/test_integration_da.cc(78): Leaving test case "integration_data_assimilation"; testing time: 58066720us
4: [0;39;49m[1;34;49m/var/jenkins/workspace/adamantine-nightly/tests/test_integration_da.cc(148): Entering test case "integration_3D_da_point_cloud_add_material"
4: [1;34;49m/var/jenkins/workspace/adamantine-nightly/tests/test_integration_da.cc(78): Leaving test case "integration_data_assimilation"; testing time: 58072109us
4: [0;39;49m[1;34;49m/var/jenkins/workspace/adamantine-nightly/tests/test_integration_da.cc(148): Entering test case "integration_3D_da_point_cloud_add_material"
4: [1;34;49m/var/jenkins/workspace/adamantine-nightly/tests/test_integration_da.cc(78): Leaving test case "integration_data_assimilation"; testing time: 58078409us
4: [0;39;49m[1;34;49m/var/jenkins/workspace/adamantine-nightly/tests/test_integration_da.cc(148): Entering test case "integration_3D_da_point_cloud_add_material"
4: [0;39;49mReading the experimental log file...
4: Done. Log entries found for 1 camera(s), with 1 frame(s).
4: Starting the main time stepping loop...
4: 10% completed
4: 20% completed
4: 30% completed
4: 40% completed
4: 50% completed
4: [0;39;49mRank: 2 | Old parameters for member 1:
4: [0;39;49mRank: 3 | Old parameters for member 1:
4: Rank: 3 | Number expt sites mapped to DOFs: 1
4: Rank: 2 | Number expt sites mapped to DOFs: 1
4: [0;39;49mRank: 5 | Old parameters for member 2:
4: [0;39;49mRank: 4 | Old parameters for member 2:
4: Performing data assimilation at time 0.12...
4: Rank: 0 | Old parameters for member 0:
4: [0;39;49mRank: 1 | Old parameters for member 0:
4: Rank: 5 | Number expt sites mapped to DOFs: 1
4: Rank: 4 | Number expt sites mapped to DOFs: 1
4: Rank: 0 | Number expt sites mapped to DOFs: 1
4: Rank: 1 | Number expt sites mapped to DOFs: 1
4: Getting the perturbed innovation...
4: Applying the Kalman gain...
4: Updating the ensemble members...
4: Done.
4: 60% completed
4: 70% completed
4: 80% completed
4: 90% completed
4: 100% completed
4: Reading the experimental log file...
4: Done. Log entries found for 1 camera(s), with 1 frame(s).
4: Reading the experimental log file...
4: Done. Log entries found for 1 camera(s), with 1 frame(s).
4: Reading the experimental log file...
4: Done. Log entries found for 1 camera(s), with 1 frame(s).
4: Reading the experimental log file...
4: Done. Log entries found for 1 camera(s), with 1 frame(s).
4: Reading the experimental log file...
4: Done. Log entries found for 1 camera(s), with 1 frame(s).
4: Reading the experimental log file...
4: Done. Log entries found for 1 camera(s), with 1 frame(s).
4: Starting the main time stepping loop...
4: Starting the main time stepping loop...
4: Starting the main time stepping loop...
4: Starting the main time stepping loop...
4: Starting the main time stepping loop...
4: Starting the main time stepping loop...
4: 10% completed
4: 10% completed
4: 10% completed
4: 10% completed
4: 10% completed
4: 10% completed
4: 20% completed
4: 20% completed
4: 20% completed
4: 20% completed
4: 20% completed
4: 20% completed
4: 30% completed
4: 30% completed
4: 30% completed
4: 30% completed
4: 30% completed
4: 30% completed
4: 40% completed
4: 40% completed
4: 40% completed
4: 40% completed
4: 40% completed
4: 40% completed
4: 50% completed
4: 50% completed
4: 50% completed
4: 50% completed
4: 50% completed
4: 50% completed
4: Performing data assimilation at time 0.12...
4: Rank: 0 | Old parameters for member 0:
4: Rank: 0 | Old parameters for member 1:
4: Rank: 0 | Old parameters for member 2:
4: Rank: 0 | Number expt sites mapped to DOFs: 1
4: Performing data assimilation at time 0.12...
4: Rank: 0 | Old parameters for member 0:
4: Rank: 0 | Old parameters for member 1:
4: Rank: 0 | Old parameters for member 2:
4: Performing data assimilation at time 0.12...
4: Rank: 0 | Old parameters for member 0:
4: Rank: 0 | Old parameters for member 1:
4: Rank: 0 | Old parameters for member 2:
4: Performing data assimilation at time 0.12...
4: Rank: 0 | Old parameters for member 0:
4: Rank: 0 | Old parameters for member 1:
4: Rank: 0 | Old parameters for member 2:
4: Performing data assimilation at time 0.12...
4: Rank: 0 | Old parameters for member 0:
4: Rank: 0 | Old parameters for member 1:
4: Rank: 0 | Old parameters for member 2:
4: Performing data assimilation at time 0.12...
4: Rank: 0 | Old parameters for member 0:
4: Rank: 0 | Old parameters for member 1:
4: Rank: 0 | Old parameters for member 2:
4: Rank: 0 | Number expt sites mapped to DOFs: 1
4: Rank: 0 | Number expt sites mapped to DOFs: 1
4: Rank: 0 | Number expt sites mapped to DOFs: 1
4: Rank: 0 | Number expt sites mapped to DOFs: 1
4: Rank: 0 | Number expt sites mapped to DOFs: 1
4: Getting the perturbed innovation...
4: Applying the Kalman gain...
4: Getting the perturbed innovation...
4: Applying the Kalman gain...
4: Getting the perturbed innovation...
4: Applying the Kalman gain...
4: Getting the perturbed innovation...
4: Applying the Kalman gain...
4: Getting the perturbed innovation...
4: Applying the Kalman gain...
4: Getting the perturbed innovation...
4: Applying the Kalman gain...
4: Updating the ensemble members...
4: Done.
4: 60% completed
4: Updating the ensemble members...
4: Done.
4: 60% completed
4: 70% completed
4: Updating the ensemble members...
4: Updating the ensemble members...
4: Updating the ensemble members...
4: Done.
4: 60% completed
4: Done.
4: 60% completed
4: Done.
4: 60% completed
4: Updating the ensemble members...
4: Done.
4: 60% completed
4: 70% completed
4: 80% completed
4: 70% completed
4: 70% completed
4: 70% completed
4: 70% completed
4: 80% completed
4: 90% completed
4: 80% completed
4: 80% completed
4: 80% completed
4: 80% completed
4: 90% completed
4: 90% completed
4: 90% completed
4: 90% completed
4: 90% completed
4: 100% completed
4: 100% completed
4: [1;34;49m/var/jenkins/workspace/adamantine-nightly/tests/test_integration_da.cc(148): Leaving test case "integration_3D_da_point_cloud_add_material"; testing time: 2345054us
4: [0;39;49m[1;34;49m/var/jenkins/workspace/adamantine-nightly/tests/test_integration_da.cc(231): Entering test case "integration_3D_da_ray_add_material"
4: 100% completed
4: [1;34;49m/var/jenkins/workspace/adamantine-nightly/tests/test_integration_da.cc(148): Leaving test case "integration_3D_da_point_cloud_add_material"; testing time: 2606396us
4: [0;39;49m[1;34;49m/var/jenkins/workspace/adamantine-nightly/tests/test_integration_da.cc(231): Entering test case "integration_3D_da_ray_add_material"
4: 100% completed
4: 100% completed
4: 100% completed
4: [1;34;49m/var/jenkins/workspace/adamantine-nightly/tests/test_integration_da.cc(148): Leaving test case "integration_3D_da_point_cloud_add_material"; testing time: 2863682us
4: [0;39;49m[1;34;49m/var/jenkins/workspace/adamantine-nightly/tests/test_integration_da.cc(231): Entering test case "integration_3D_da_ray_add_material"
4: [1;34;49m/var/jenkins/workspace/adamantine-nightly/tests/test_integration_da.cc(148): Leaving test case "integration_3D_da_point_cloud_add_material"; testing time: 2818036us
4: [0;39;49m[1;34;49m/var/jenkins/workspace/adamantine-nightly/tests/test_integration_da.cc(231): Entering test case "integration_3D_da_ray_add_material"
4: [1;34;49m/var/jenkins/workspace/adamantine-nightly/tests/test_integration_da.cc(148): Leaving test case "integration_3D_da_point_cloud_add_material"; testing time: 2445142us
4: [0;39;49m[1;34;49m/var/jenkins/workspace/adamantine-nightly/tests/test_integration_da.cc(231): Entering test case "integration_3D_da_ray_add_material"
4: [1;34;49m/var/jenkins/workspace/adamantine-nightly/tests/test_integration_da.cc(148): Leaving test case "integration_3D_da_point_cloud_add_material"; testing time: 2457614us
4: [0;39;49m[1;34;49m/var/jenkins/workspace/adamantine-nightly/tests/test_integration_da.cc(231): Entering test case "integration_3D_da_ray_add_material"
4: [0;39;49mReading the experimental log file...
4: Done. Log entries found for 1 camera(s), with 1 frame(s).
4: Starting the main time stepping loop...
4: 10% completed
4: 20% completed
4: 30% completed
4: 40% completed
4: 50% completed
4: [0;39;49mRank: 1 | Old parameters for member 0:
4: Performing data assimilation at time 0.12...
4: Rank: 0 | Old parameters for member 0:
4: [0;39;49mRank: 3 | Old parameters for member 1:
4: [0;39;49mRank: 2 | Old parameters for member 1:
4: [0;39;49mRank: 5 | Old parameters for member 2:
4: [0;39;49mRank: 4 | Old parameters for member 2:
4: Rank: 1 | Number expt sites mapped to DOFs: 1
4: Rank: 0 | Number expt sites mapped to DOFs: 1
4: Rank: 3 | Number expt sites mapped to DOFs: 1
4: Rank: 2 | Number expt sites mapped to DOFs: 1
4: Rank: 4 | Number expt sites mapped to DOFs: 1
4: Rank: 5 | Number expt sites mapped to DOFs: 1
4: Getting the perturbed innovation...
4: Applying the Kalman gain...
4: Updating the ensemble members...
4: Done.
4: 60% completed
4: 70% completed
4: 80% completed
4: 90% completed
4: 100% completed
4: Reading the experimental log file...
4: Done. Log entries found for 1 camera(s), with 1 frame(s).
4: Reading the experimental log file...
4: Done. Log entries found for 1 camera(s), with 1 frame(s).
4: Reading the experimental log file...
4: Done. Log entries found for 1 camera(s), with 1 frame(s).
4: Reading the experimental log file...
4: Done. Log entries found for 1 camera(s), with 1 frame(s).
4: Reading the experimental log file...
4: Done. Log entries found for 1 camera(s), with 1 frame(s).
4: Reading the experimental log file...
4: Done. Log entries found for 1 camera(s), with 1 frame(s).
4: Starting the main time stepping loop...
4: Starting the main time stepping loop...
4: Starting the main time stepping loop...
4: Starting the main time stepping loop...
4: Starting the main time stepping loop...
4: Starting the main time stepping loop...
4: 10% completed
4: 10% completed
4: 10% completed
4: 10% completed
4: 10% completed
4: 10% completed
4: 20% completed
4: 20% completed
4: 20% completed
4: 20% completed
4: 20% completed
4: 20% completed
4: 30% completed
4: 30% completed
4: 30% completed
4: 30% completed
4: 30% completed
4: 30% completed
4: 40% completed
4: 40% completed
4: 40% completed
4: 40% completed
4: 40% completed
4: 40% completed
4: 50% completed
4: 50% completed
4: 50% completed
4: Performing data assimilation at time 0.12...
4: Rank: 0 | Old parameters for member 0:
4: Rank: 0 | Old parameters for member 1:
4: Rank: 0 | Old parameters for member 2:
4: 50% completed
4: 50% completed
4: 50% completed
4: Rank: 0 | Number expt sites mapped to DOFs: 1
4: Performing data assimilation at time 0.12...
4: Rank: 0 | Old parameters for member 0:
4: Rank: 0 | Old parameters for member 1:
4: Rank: 0 | Old parameters for member 2:
4: Performing data assimilation at time 0.12...
4: Rank: 0 | Old parameters for member 0:
4: Rank: 0 | Old parameters for member 1:
4: Rank: 0 | Old parameters for member 2:
4: Rank: 0 | Number expt sites mapped to DOFs: 1
4: Rank: 0 | Number expt sites mapped to DOFs: 1
4: Performing data assimilation at time 0.12...
4: Rank: 0 | Old parameters for member 0:
4: Rank: 0 | Old parameters for member 1:
4: Rank: 0 | Old parameters for member 2:
4: Performing data assimilation at time 0.12...
4: Rank: 0 | Old parameters for member 0:
4: Rank: 0 | Old parameters for member 1:
4: Rank: 0 | Old parameters for member 2:
4: Performing data assimilation at time 0.12...
4: Rank: 0 | Old parameters for member 0:
4: Rank: 0 | Old parameters for member 1:
4: Rank: 0 | Old parameters for member 2:
4: Rank: 0 | Number expt sites mapped to DOFs: 1
4: Rank: 0 | Number expt sites mapped to DOFs: 1
4: Rank: 0 | Number expt sites mapped to DOFs: 1
4: Getting the perturbed innovation...
4: Applying the Kalman gain...
4: Getting the perturbed innovation...
4: Applying the Kalman gain...
4: Getting the perturbed innovation...
4: Applying the Kalman gain...
4: Getting the perturbed innovation...
4: Applying the Kalman gain...
4: Getting the perturbed innovation...
4: Applying the Kalman gain...
4: Getting the perturbed innovation...
4: Applying the Kalman gain...
4: Updating the ensemble members...
4: Done.
4: 60% completed
4: Updating the ensemble members...
4: Done.
4: 60% completed
4: Updating the ensemble members...
4: Done.
4: 60% completed
4: 70% completed
4: Updating the ensemble members...
4: Done.
4: 60% completed
4: 70% completed
4: 70% completed
4: Updating the ensemble members...
4: Done.
4: 60% completed
4: Updating the ensemble members...
4: Done.
4: 60% completed
4: 80% completed
4: 70% completed
4: 80% completed
4: 80% completed
4: 70% completed
4: 70% completed
4: 90% completed
4: 80% completed
4: 90% completed
4: 90% completed
4: 80% completed
4: 80% completed
4: 90% completed
4: 90% completed
4: 90% completed
4: 100% completed
4: 100% completed
4: 100% completed
4: 100% completed
4: [1;34;49m/var/jenkins/workspace/adamantine-nightly/tests/test_integration_da.cc(231): Leaving test case "integration_3D_da_ray_add_material"; testing time: 2415974us
4: [0;39;49m[1;34;49mLeaving test module "Integration_Data_Assimilation"; testing time: 62940463us
4: [0;39;49m
4: [1;32;49m*** No errors detected
4: [0;39;49m100% completed
4: [1;34;49m/var/jenkins/workspace/adamantine-nightly/tests/test_integration_da.cc(231): Leaving test case "integration_3D_da_ray_add_material"; testing time: 2498526us
4: [0;39;49m[1;34;49mLeaving test module "Integration_Data_Assimilation"; testing time: 62970170us
4: [0;39;49m
4: [1;32;49m*** No errors detected
4: [0;39;49m100% completed
4: [1;34;49m/var/jenkins/workspace/adamantine-nightly/tests/test_integration_da.cc(231): Leaving test case "integration_3D_da_ray_add_material"; testing time: 2463202us
4: [0;39;49m[1;34;49mLeaving test module "Integration_Data_Assimilation"; testing time: 62980580us
4: [0;39;49m
4: [1;32;49m*** No errors detected
4: [0;39;49m[1;34;49m/var/jenkins/workspace/adamantine-nightly/tests/test_integration_da.cc(231): Leaving test case "integration_3D_da_ray_add_material"; testing time: 2561115us
4: [0;39;49m[1;34;49mLeaving test module "Integration_Data_Assimilation"; testing time: 62984756us
4: [0;39;49m
4: [1;32;49m*** No errors detected
4: [0;39;49m
4: [1;32;49m[1;34;49m/var/jenkins/workspace/adamantine-nightly/tests/test_integration_da.cc(231): Leaving test case "integration_3D_da_ray_add_material"; testing time: 2482668us
4: [0;39;49m[1;34;49mLeaving test module "Integration_Data_Assimilation"; testing time: 63029974us
4: [0;39;49m*** No errors detected
4: [0;39;49m
4: [1;32;49m*** No errors detected
4: [0;39;49m[1;34;49m/var/jenkins/workspace/adamantine-nightly/tests/test_integration_da.cc(231): Leaving test case "integration_3D_da_ray_add_material"; testing time: 2488408us
4: [0;39;49m[1;34;49mLeaving test module "Integration_Data_Assimilation"; testing time: 63013906us
4: [0;39;49m
46/48 Test #4: test_integration_da_6 .................... Passed 64.89 sec
test 7
Start 7: test_closest_source_point_adaptation_3
7: Test command: /usr/bin/mpiexec "-n" "3" "/var/jenkins/workspace/adamantine-nightly/build/bin/test_closest_source_point_adaptation"
7: Working Directory: /var/jenkins/workspace/adamantine-nightly/build/tests
7: Test timeout computed to be: 7200
7: Running 1 test case...
7: [1;34;49mEntering test module "ClosestSourcePointAdaptation"
7: [0;39;49m[1;34;49m/var/jenkins/workspace/adamantine-nightly/tests/test_closest_source_point_adaptation.cc(123): Entering test case "closest_source_point_adaptation"
7: Running 1 test case...
7: [1;34;49mEntering test module "ClosestSourcePointAdaptation"
7: [0;39;49m[1;34;49m/var/jenkins/workspace/adamantine-nightly/tests/test_closest_source_point_adaptation.cc(123): Entering test case "closest_source_point_adaptation"
7: Running 1 test case...
7: [1;34;49mEntering test module "ClosestSourcePointAdaptation"
7: [0;39;49m[1;34;49m/var/jenkins/workspace/adamantine-nightly/tests/test_closest_source_point_adaptation.cc(123): Entering test case "closest_source_point_adaptation"
7: [0;39;49m[1;34;49m/var/jenkins/workspace/adamantine-nightly/tests/test_closest_source_point_adaptation.cc(123): Leaving test case "closest_source_point_adaptation"; testing time: 7120880us
7: [0;39;49m[1;34;49mLeaving test module "ClosestSourcePointAdaptation"; testing time: 7120947us
7: [0;39;49m[0;39;49m[1;34;49m/var/jenkins/workspace/adamantine-nightly/tests/test_closest_source_point_adaptation.cc(123): Leaving test case "closest_source_point_adaptation"; testing time: 7137226us
7: [0;39;49m[1;34;49mLeaving test module "ClosestSourcePointAdaptation"; testing time: 7137272us
7: [0;39;49m
7: [1;32;49m*** No errors detected
7: [0;39;49m
7: [1;32;49m*** No errors detected
7: [0;39;49m[0;39;49m[1;34;49m/var/jenkins/workspace/adamantine-nightly/tests/test_closest_source_point_adaptation.cc(123): Leaving test case "closest_source_point_adaptation"; testing time: 7146340us
7: [0;39;49m[1;34;49mLeaving test module "ClosestSourcePointAdaptation"; testing time: 7146391us
7: [0;39;49m
7: [1;32;49m*** No errors detected
7: [0;39;49m
47/48 Test #7: test_closest_source_point_adaptation_3 ... Passed 8.45 sec
test 8
Start 8: test_closest_source_point_adaptation_6
8: Test command: /usr/bin/mpiexec "-n" "6" "/var/jenkins/workspace/adamantine-nightly/build/bin/test_closest_source_point_adaptation"
8: Working Directory: /var/jenkins/workspace/adamantine-nightly/build/tests
8: Test timeout computed to be: 7200
8: Running 1 test case...
8: [1;34;49mEntering test module "ClosestSourcePointAdaptation"
8: [0;39;49m[1;34;49m/var/jenkins/workspace/adamantine-nightly/tests/test_closest_source_point_adaptation.cc(123): Entering test case "closest_source_point_adaptation"
8: Running 1 test case...
8: [1;34;49mEntering test module "ClosestSourcePointAdaptation"
8: [0;39;49m[1;34;49m/var/jenkins/workspace/adamantine-nightly/tests/test_closest_source_point_adaptation.cc(123): Entering test case "closest_source_point_adaptation"
8: Running 1 test case...
8: [1;34;49mEntering test module "ClosestSourcePointAdaptation"
8: [0;39;49m[1;34;49m/var/jenkins/workspace/adamantine-nightly/tests/test_closest_source_point_adaptation.cc(123): Entering test case "closest_source_point_adaptation"
8: Running 1 test case...
8: [1;34;49mEntering test module "ClosestSourcePointAdaptation"
8: [0;39;49m[1;34;49m/var/jenkins/workspace/adamantine-nightly/tests/test_closest_source_point_adaptation.cc(123): Entering test case "closest_source_point_adaptation"
8: Running 1 test case...
8: [1;34;49mEntering test module "ClosestSourcePointAdaptation"
8: [0;39;49m[1;34;49m/var/jenkins/workspace/adamantine-nightly/tests/test_closest_source_point_adaptation.cc(123): Entering test case "closest_source_point_adaptation"
8: Running 1 test case...
8: [1;34;49mEntering test module "ClosestSourcePointAdaptation"
8: [0;39;49m[1;34;49m/var/jenkins/workspace/adamantine-nightly/tests/test_closest_source_point_adaptation.cc(123): Entering test case "closest_source_point_adaptation"
8:
8: [1;32;49m*** No errors detected
8: [0;39;49m[0;39;49m[1;34;49m/var/jenkins/workspace/adamantine-nightly/tests/test_closest_source_point_adaptation.cc(123): Leaving test case "closest_source_point_adaptation"; testing time: 4467562us
8: [0;39;49m[1;34;49mLeaving test module "ClosestSourcePointAdaptation"; testing time: 4467618us
8: [0;39;49m
8: [1;32;49m*** No errors detected
8: [0;39;49m
8: [1;32;49m*** No errors detected
8: [0;39;49m[0;39;49m[1;34;49m/var/jenkins/workspace/adamantine-nightly/tests/test_closest_source_point_adaptation.cc(123): Leaving test case "closest_source_point_adaptation"; testing time: 4477839us
8: [0;39;49m[1;34;49mLeaving test module "ClosestSourcePointAdaptation"; testing time: 4477907us
8: [0;39;49m[0;39;49m[1;34;49m/var/jenkins/workspace/adamantine-nightly/tests/test_closest_source_point_adaptation.cc(123): Leaving test case "closest_source_point_adaptation"; testing time: 4457647us
8: [0;39;49m[1;34;49mLeaving test module "ClosestSourcePointAdaptation"; testing time: 4457693us
8: [0;39;49m[0;39;49m[1;34;49m/var/jenkins/workspace/adamantine-nightly/tests/test_closest_source_point_adaptation.cc(123): Leaving test case "closest_source_point_adaptation"; testing time: 4469551us
8: [0;39;49m[1;34;49mLeaving test module "ClosestSourcePointAdaptation"; testing time: 4469590us
8: [0;39;49m
8: [1;32;49m*** No errors detected
8: [0;39;49m[0;39;49m[1;34;49m/var/jenkins/workspace/adamantine-nightly/tests/test_closest_source_point_adaptation.cc(123): Leaving test case "closest_source_point_adaptation"; testing time: 4474523us
8: [0;39;49m[1;34;49mLeaving test module "ClosestSourcePointAdaptation"; testing time: 4474585us
8: [0;39;49m
8: [1;32;49m*** No errors detected
8: [0;39;49m[0;39;49m[1;34;49m/var/jenkins/workspace/adamantine-nightly/tests/test_closest_source_point_adaptation.cc(123): Leaving test case "closest_source_point_adaptation"; testing time: 4469800us
8: [0;39;49m[1;34;49mLeaving test module "ClosestSourcePointAdaptation"; testing time: 4469854us
8: [0;39;49m
8: [1;32;49m*** No errors detected
8: [0;39;49m
48/48 Test #8: test_closest_source_point_adaptation_6 ... Passed 6.35 sec
The following tests passed:
test_closest_source_point_adaptation_1
test_data_assimilator_1
test_experimental_data_1
test_geometry_1
test_heat_source_1
test_integration_da_2
test_closest_source_point_adaptation_2
test_material_property_1
test_material_property_device_1
test_integration_da_1
test_post_processor_1
test_quaternion_1
test_scan_path_1
test_mechanical_operator_1
test_thermal_operator_device_1
test_thermal_operator_1
test_timer_1
test_utils_1
test_validate_input_database_1
test_integration_2d_1
test_integration_2d_device_1
test_mechanical_physics_1
test_thermal_physics_device_1
test_integration_3d_amr_device_1
test_integration_3d_amr_1
test_integration_da_augmented_1
test_material_deposition_1
test_microstructure_1
test_thermal_physics_1
test_ensemble_management_1
test_integration_3d_device_1
test_integration_2d_2
test_integration_2d_device_2
test_integration_3d_amr_2
test_integration_3d_amr_device_2
test_integration_da_augmented_2
test_material_deposition_2
test_microstructure_2
test_thermal_physics_2
test_ensemble_management_2
test_integration_thermoelastic_2
test_integration_da_3
test_integration_da_6
test_closest_source_point_adaptation_3
test_closest_source_point_adaptation_6
94% tests passed, 3 tests failed out of 48
Total Test time (real) = 12806.21 sec
The following tests FAILED:
31 - test_integration_3d_1 (Timeout)
32 - test_integration_3d_2 (Timeout)
39 - test_integration_thermoelastic_1 (Timeout)
Errors while running CTest
Output from these tests are in: /var/jenkins/workspace/adamantine-nightly/build/Testing/Temporary/LastTest.log
Use "--rerun-failed --output-on-failure" to re-run the failed cases verbosely.
[Pipeline] }
[Pipeline] // dir
Post stage
[Pipeline] xunit
INFO: Processing CTest-Version 3.x (default)
[Pipeline] }
[Pipeline] // withEnv
[Pipeline] }
$ docker stop --time=1 33e2f82eeae5fce58191525d9c601c0204d89e5ed50631e5a1d5f4383906fd62
INFO: [CTest-Version 3.x (default)] - 1 test report file(s) were found with the pattern 'build/Testing/**/Test.xml' relative to '/var/jenkins/workspace/adamantine-nightly' for the testing framework 'CTest-Version 3.x (default)'.
$ docker rm -f --volumes 33e2f82eeae5fce58191525d9c601c0204d89e5ed50631e5a1d5f4383906fd62
[Pipeline] // withDockerContainer
[Pipeline] }
[Pipeline] // withEnv
[Pipeline] }
[Pipeline] // node
[Pipeline] }
[Pipeline] // stage
[Pipeline] }
Failed in branch CUDA
[Pipeline] // parallel
[Pipeline] }
[Pipeline] // stage
[Pipeline] }
[Pipeline] // timeout
[Pipeline] }
[Pipeline] // withEnv
[Pipeline] End of Pipeline
ERROR: script returned exit code 8
Finished: FAILURE