38: Rank: 1 | New parameters for member 2: 0.107206
38: Done.
38: Rank: 0 | New parameters for member 0: 0.121104
38: Rank: 0 | New parameters for member 1: 0.142225
38: 80% completed
38: 90% completed
32: n_time_step: 554 time: 5.53 n_dofs (thermal) after cell activation: 1218
38: 100% completed
38: [1;34;49m/var/jenkins/workspace/adamantine-nightly/tests/test_integration_da_augmented.cc(19): Leaving test case "integration_3D_data_assimilation_augmented"; testing time: 38935385us
38: [1;34;49m/var/jenkins/workspace/adamantine-nightly/tests/test_integration_da_augmented.cc(19): Leaving test case "integration_3D_data_assimilation_augmented"; testing time: 38935100us
38: [0;39;49m[1;34;49mLeaving test module "Integration_Data_Assimilation_Augmented"; testing time: 38935475us
38: [0;39;49m
38: [1;32;49m*** No errors detected
38: [0;39;49m[0;39;49m[1;34;49mLeaving test module "Integration_Data_Assimilation_Augmented"; testing time: 38948160us
38: [0;39;49m
38: [1;32;49m*** No errors detected
38: [0;39;49m
38/48 Test #38: test_integration_da_augmented_2 .......... Passed 39.70 sec
test 40
Start 40: test_integration_thermoelastic_2
40: Test command: /usr/bin/mpiexec "-n" "2" "/var/jenkins/workspace/adamantine-nightly/build/bin/test_integration_thermoelastic"
40: Working Directory: /var/jenkins/workspace/adamantine-nightly/build/tests
40: Test timeout computed to be: 7200
40: Running 2 test cases...
40: [1;34;49mEntering test module "Integration_Thermoelastic"
40: [0;39;49m[1;34;49m/var/jenkins/workspace/adamantine-nightly/tests/test_integration_thermoelastic.cc(19): Entering test case "integration_thermoelastic"
40: Running 2 test cases...
40: [1;34;49mEntering test module "Integration_Thermoelastic"
40: [0;39;49m[1;34;49m/var/jenkins/workspace/adamantine-nightly/tests/test_integration_thermoelastic.cc(19): Entering test case "integration_thermoelastic"
32: n_time_step: 577 time: 5.76 n_dofs (thermal) after cell activation: 1219
32: n_time_step: 601 time: 6 n_dofs (thermal) after cell activation: 1220
32: 60% completed
32: n_time_step: 624 time: 6.23 n_dofs (thermal) after cell activation: 1221
31: 20% completed
34/48 Test #31: test_integration_3d_1 ....................***Timeout 7200.05 sec
32: n_time_step: 647 time: 6.46 n_dofs (thermal) after cell activation: 1222
32: n_time_step: 671 time: 6.7 n_dofs (thermal) after cell activation: 1223
32: n_time_step: 694 time: 6.93 n_dofs (thermal) after cell activation: 1224
32: 70% completed
32: n_time_step: 717 time: 7.16 n_dofs (thermal) after cell activation: 1226
32: n_time_step: 740 time: 7.39 n_dofs (thermal) after cell activation: 1227
40: [0;39;49m[0;39;49m10% completed
39: 50% completed
32: 50% completed
32: n_time_step: 763 time: 7.62 n_dofs (thermal) after cell activation: 1228
32: n_time_step: 787 time: 7.86 n_dofs (thermal) after cell activation: 1229
32: 80% completed
32: n_time_step: 810 time: 8.09 n_dofs (thermal) after cell activation: 1230
32: n_time_step: 833 time: 8.32 n_dofs (thermal) after cell activation: 1231
39/48 Test #32: test_integration_3d_2 ....................***Timeout 7200.05 sec
test 42
Start 42: test_material_deposition_2
42: Test command: /usr/bin/mpiexec "-n" "2" "/var/jenkins/workspace/adamantine-nightly/build/bin/test_material_deposition"
42: Working Directory: /var/jenkins/workspace/adamantine-nightly/build/tests
42: Test timeout computed to be: 7200
42: Running 11 test cases...
42: [1;34;49mEntering test module "MaterialDeposition"
42: [0;39;49m[1;34;49m/var/jenkins/workspace/adamantine-nightly/tests/test_material_deposition.cc(50): Entering test case "read_material_deposition_file_2d"
42: Running 11 test cases...
42: [1;34;49mEntering test module "MaterialDeposition"
42: [0;39;49m[1;34;49m/var/jenkins/workspace/adamantine-nightly/tests/test_material_deposition.cc(50): Entering test case "read_material_deposition_file_2d"
42: [0;39;49m[1;34;49m/var/jenkins/workspace/adamantine-nightly/tests/test_material_deposition.cc(50): Leaving test case "read_material_deposition_file_2d"; testing time: 296us
42: [0;39;49m[1;34;49m/var/jenkins/workspace/adamantine-nightly/tests/test_material_deposition.cc(92): Entering test case "read_material_deposition_file_3d"
42: [0;39;49m[1;34;49m/var/jenkins/workspace/adamantine-nightly/tests/test_material_deposition.cc(50): Leaving test case "read_material_deposition_file_2d"; testing time: 364us
42: [0;39;49m[1;34;49m/var/jenkins/workspace/adamantine-nightly/tests/test_material_deposition.cc(92): Entering test case "read_material_deposition_file_3d"
42: [0;39;49m[1;34;49m/var/jenkins/workspace/adamantine-nightly/tests/test_material_deposition.cc(92): Leaving test case "read_material_deposition_file_3d"; testing time: 175us
42: [0;39;49m[1;33;49m/var/jenkins/workspace/adamantine-nightly/tests/test_material_deposition.cc(134): Test case "get_elements_to_activate_2d" is skipped because precondition failed: the test only works in serial
42: [0;39;49m[1;33;49m/var/jenkins/workspace/adamantine-nightly/tests/test_material_deposition.cc(195): Test case "get_elements_to_activate_3d" is skipped because precondition failed: the test only works in serial
42: [0;39;49m[1;34;49m/var/jenkins/workspace/adamantine-nightly/tests/test_material_deposition.cc(262): Entering test case "material_deposition"
42: [0;39;49m[1;34;49m/var/jenkins/workspace/adamantine-nightly/tests/test_material_deposition.cc(92): Leaving test case "read_material_deposition_file_3d"; testing time: 194us
42: [0;39;49m[1;33;49m/var/jenkins/workspace/adamantine-nightly/tests/test_material_deposition.cc(134): Test case "get_elements_to_activate_2d" is skipped because precondition failed: the test only works in serial
42: [0;39;49m[1;33;49m/var/jenkins/workspace/adamantine-nightly/tests/test_material_deposition.cc(195): Test case "get_elements_to_activate_3d" is skipped because precondition failed: the test only works in serial
42: [0;39;49m[1;34;49m/var/jenkins/workspace/adamantine-nightly/tests/test_material_deposition.cc(262): Entering test case "material_deposition"
42: [0;39;49m[1;34;49m/var/jenkins/workspace/adamantine-nightly/tests/test_material_deposition.cc(262): Leaving test case "material_deposition"; testing time: 10794823us
42: [0;39;49m[1;34;49m/var/jenkins/workspace/adamantine-nightly/tests/test_material_deposition.cc(395): Entering test case "deposition_from_scan_path_2d"
42: [0;39;49m[1;34;49m/var/jenkins/workspace/adamantine-nightly/tests/test_material_deposition.cc(262): Leaving test case "material_deposition"; testing time: 10807731us
42: [0;39;49m[1;34;49m/var/jenkins/workspace/adamantine-nightly/tests/test_material_deposition.cc(395): Entering test case "deposition_from_scan_path_2d"
42: [0;39;49m[1;34;49m/var/jenkins/workspace/adamantine-nightly/tests/test_material_deposition.cc(395): Leaving test case "deposition_from_scan_path_2d"; testing time: 320us
42: [0;39;49m[1;34;49m/var/jenkins/workspace/adamantine-nightly/tests/test_material_deposition.cc(445): Entering test case "deposition_from_scan_path_3d"
42: [0;39;49m[1;34;49m/var/jenkins/workspace/adamantine-nightly/tests/test_material_deposition.cc(395): Leaving test case "deposition_from_scan_path_2d"; testing time: 265us
42: [0;39;49m[1;34;49m/var/jenkins/workspace/adamantine-nightly/tests/test_material_deposition.cc(445): Entering test case "deposition_from_scan_path_3d"
42: [0;39;49m[1;34;49m/var/jenkins/workspace/adamantine-nightly/tests/test_material_deposition.cc(445): Leaving test case "deposition_from_scan_path_3d"; testing time: 176us
42: [0;39;49m[1;34;49m/var/jenkins/workspace/adamantine-nightly/tests/test_material_deposition.cc(499): Entering test case "deposition_from_L_scan_path_3d"
42: [0;39;49m[1;34;49m/var/jenkins/workspace/adamantine-nightly/tests/test_material_deposition.cc(445): Leaving test case "deposition_from_scan_path_3d"; testing time: 192us
42: [0;39;49m[1;34;49m/var/jenkins/workspace/adamantine-nightly/tests/test_material_deposition.cc(499): Entering test case "deposition_from_L_scan_path_3d"
42: [0;39;49m[1;34;49m/var/jenkins/workspace/adamantine-nightly/tests/test_material_deposition.cc(499): Leaving test case "deposition_from_L_scan_path_3d"; testing time: 214us
42: [0;39;49m[1;34;49m/var/jenkins/workspace/adamantine-nightly/tests/test_material_deposition.cc(586): Entering test case "deposition_from_diagonal_scan_path_3d"
42: [0;39;49m[1;34;49m/var/jenkins/workspace/adamantine-nightly/tests/test_material_deposition.cc(499): Leaving test case "deposition_from_L_scan_path_3d"; testing time: 213us
42: [0;39;49m[1;34;49m/var/jenkins/workspace/adamantine-nightly/tests/test_material_deposition.cc(586): Entering test case "deposition_from_diagonal_scan_path_3d"
42: [0;39;49m[1;34;49m/var/jenkins/workspace/adamantine-nightly/tests/test_material_deposition.cc(586): Leaving test case "deposition_from_diagonal_scan_path_3d"; testing time: 177us
42: [0;39;49m[1;34;49m/var/jenkins/workspace/adamantine-nightly/tests/test_material_deposition.cc(640): Entering test case "merge_multiple_deposition_paths"
42: [0;39;49m[1;34;49m/var/jenkins/workspace/adamantine-nightly/tests/test_material_deposition.cc(586): Leaving test case "deposition_from_diagonal_scan_path_3d"; testing time: 192us
42: [0;39;49m[1;34;49m/var/jenkins/workspace/adamantine-nightly/tests/test_material_deposition.cc(640): Entering test case "merge_multiple_deposition_paths"
42: [0;39;49m[1;34;49m/var/jenkins/workspace/adamantine-nightly/tests/test_material_deposition.cc(640): Leaving test case "merge_multiple_deposition_paths"; testing time: 120us
42: [0;39;49m[1;34;49m/var/jenkins/workspace/adamantine-nightly/tests/test_material_deposition.cc(697): Entering test case "deposition_quaternion_straight_line"
42: [0;39;49m[1;34;49m/var/jenkins/workspace/adamantine-nightly/tests/test_material_deposition.cc(640): Leaving test case "merge_multiple_deposition_paths"; testing time: 116us
42: [0;39;49m[1;34;49m/var/jenkins/workspace/adamantine-nightly/tests/test_material_deposition.cc(697): Entering test case "deposition_quaternion_straight_line"
42: [0;39;49m[1;34;49m/var/jenkins/workspace/adamantine-nightly/tests/test_material_deposition.cc(697): Leaving test case "deposition_quaternion_straight_line"; testing time: 536us
42: [0;39;49m[1;34;49mLeaving test module "MaterialDeposition"; testing time: 10810881us
42: [0;39;49m
42: [1;32;49m*** No errors detected
42: [0;39;49m[0;39;49m[1;34;49m/var/jenkins/workspace/adamantine-nightly/tests/test_material_deposition.cc(697): Leaving test case "deposition_quaternion_straight_line"; testing time: 520us
42: [0;39;49m[1;34;49mLeaving test module "MaterialDeposition"; testing time: 10811406us
42: [0;39;49m
42: [1;32;49m*** No errors detected
42: [0;39;49m
40/48 Test #42: test_material_deposition_2 ............... Passed 11.58 sec
test 44
Start 44: test_microstructure_2
44: Test command: /usr/bin/mpiexec "-n" "2" "/var/jenkins/workspace/adamantine-nightly/build/bin/test_microstructure"
44: Working Directory: /var/jenkins/workspace/adamantine-nightly/build/tests
44: Test timeout computed to be: 7200
44: Running 1 test case...
44: [1;34;49mEntering test module "MicroStructure"
44: [0;39;49m[1;34;49m/var/jenkins/workspace/adamantine-nightly/tests/test_microstructure.cc(53): Entering test case "G_and_R"
44: Running 1 test case...
44: [1;34;49mEntering test module "MicroStructure"
44: [0;39;49m[1;34;49m/var/jenkins/workspace/adamantine-nightly/tests/test_microstructure.cc(53): Entering test case "G_and_R"
44:
44: [1;32;49m*** No errors detected
44: [0;39;49m[0;39;49m[1;36;49mTest case G_and_R did not check any assertions[0;39;49m
44: [1;34;49m/var/jenkins/workspace/adamantine-nightly/tests/test_microstructure.cc(53): Leaving test case "G_and_R"; testing time: 230609us
44: [0;39;49m[1;34;49mLeaving test module "MicroStructure"; testing time: 230682us
44: [0;39;49m[0;39;49m[1;34;49m/var/jenkins/workspace/adamantine-nightly/tests/test_microstructure.cc(53): Leaving test case "G_and_R"; testing time: 233762us
44: [0;39;49m[1;34;49mLeaving test module "MicroStructure"; testing time: 233841us
44:
44: [1;32;49m*** No errors detected
44: [0;39;49m[0;39;49m
41/48 Test #44: test_microstructure_2 .................... Passed 0.95 sec
test 46
Start 46: test_thermal_physics_2
46: Test command: /usr/bin/mpiexec "-n" "2" "/var/jenkins/workspace/adamantine-nightly/build/bin/test_thermal_physics"
46: Working Directory: /var/jenkins/workspace/adamantine-nightly/build/tests
46: Test timeout computed to be: 7200
46: Running 7 test cases...
46: [1;34;49mEntering test module "ThermalPhysics"
46: [0;39;49m[1;34;49m/var/jenkins/workspace/adamantine-nightly/tests/test_thermal_physics.cc(15): Entering test case "thermal_2d_explicit_host"
46: Running 7 test cases...
46: [1;34;49mEntering test module "ThermalPhysics"
46: [0;39;49m[1;34;49m/var/jenkins/workspace/adamantine-nightly/tests/test_thermal_physics.cc(15): Entering test case "thermal_2d_explicit_host"
46: [0;39;49m[1;34;49m/var/jenkins/workspace/adamantine-nightly/tests/test_thermal_physics.cc(15): Leaving test case "thermal_2d_explicit_host"; testing time: 174806us
46: [0;39;49m[1;34;49m/var/jenkins/workspace/adamantine-nightly/tests/test_thermal_physics.cc(28): Entering test case "thermal_2d_manufactured_solution_host"
46: [0;39;49m[1;34;49m/var/jenkins/workspace/adamantine-nightly/tests/test_thermal_physics.cc(15): Leaving test case "thermal_2d_explicit_host"; testing time: 174912us
46: [0;39;49m[1;34;49m/var/jenkins/workspace/adamantine-nightly/tests/test_thermal_physics.cc(28): Entering test case "thermal_2d_manufactured_solution_host"
46: [0;39;49m[1;34;49m/var/jenkins/workspace/adamantine-nightly/tests/test_thermal_physics.cc(28): Leaving test case "thermal_2d_manufactured_solution_host"; testing time: 169367us
46: [0;39;49m[1;34;49m/var/jenkins/workspace/adamantine-nightly/tests/test_thermal_physics.cc(33): Entering test case "initial_temperature_host"
46: [0;39;49m[1;34;49m/var/jenkins/workspace/adamantine-nightly/tests/test_thermal_physics.cc(28): Leaving test case "thermal_2d_manufactured_solution_host"; testing time: 169119us
46: [0;39;49m[1;34;49m/var/jenkins/workspace/adamantine-nightly/tests/test_thermal_physics.cc(33): Entering test case "initial_temperature_host"
46: [0;39;49m[1;34;49m/var/jenkins/workspace/adamantine-nightly/tests/test_thermal_physics.cc(33): Leaving test case "initial_temperature_host"; testing time: 138054us
46: [0;39;49m[1;34;49m/var/jenkins/workspace/adamantine-nightly/tests/test_thermal_physics.cc(38): Entering test case "energy_conservation_host"
46: [0;39;49m[1;34;49m/var/jenkins/workspace/adamantine-nightly/tests/test_thermal_physics.cc(33): Leaving test case "initial_temperature_host"; testing time: 138142us
46: [0;39;49m[1;34;49m/var/jenkins/workspace/adamantine-nightly/tests/test_thermal_physics.cc(38): Entering test case "energy_conservation_host"
46: [0;39;49m[1;34;49m/var/jenkins/workspace/adamantine-nightly/tests/test_thermal_physics.cc(38): Leaving test case "energy_conservation_host"; testing time: 4326954us
46: [0;39;49m[1;34;49m/var/jenkins/workspace/adamantine-nightly/tests/test_thermal_physics.cc(43): Entering test case "radiation_bcs_host"
46: [0;39;49m[1;34;49m/var/jenkins/workspace/adamantine-nightly/tests/test_thermal_physics.cc(38): Leaving test case "energy_conservation_host"; testing time: 4326960us
46: [0;39;49m[1;34;49m/var/jenkins/workspace/adamantine-nightly/tests/test_thermal_physics.cc(43): Entering test case "radiation_bcs_host"
46: [0;39;49m[1;34;49m/var/jenkins/workspace/adamantine-nightly/tests/test_thermal_physics.cc(43): Leaving test case "radiation_bcs_host"; testing time: 2830152us
46: [0;39;49m[1;34;49m/var/jenkins/workspace/adamantine-nightly/tests/test_thermal_physics.cc(48): Entering test case "convection_bcs_host"
46: [0;39;49m[1;34;49m/var/jenkins/workspace/adamantine-nightly/tests/test_thermal_physics.cc(43): Leaving test case "radiation_bcs_host"; testing time: 2830099us
46: [0;39;49m[1;34;49m/var/jenkins/workspace/adamantine-nightly/tests/test_thermal_physics.cc(48): Entering test case "convection_bcs_host"
35/48 Test #39: test_integration_thermoelastic_1 .........***Timeout 7200.10 sec
test 34
Start 34: test_integration_3d_amr_2
34: Test command: /usr/bin/mpiexec "-n" "2" "/var/jenkins/workspace/adamantine-nightly/build/bin/test_integration_3d_amr"
34: Working Directory: /var/jenkins/workspace/adamantine-nightly/build/tests
34: Test timeout computed to be: 7200
34: Running 2 test cases...
34: [1;34;49mEntering test module "Integration_3D_AMR"
34: [0;39;49m[1;34;49m/var/jenkins/workspace/adamantine-nightly/tests/test_integration_3d_amr.cc(19): Entering test case "integration_3D_amr"
34: Running 2 test cases...
34: [1;34;49mEntering test module "Integration_3D_AMR"
34: [0;39;49m[1;34;49m/var/jenkins/workspace/adamantine-nightly/tests/test_integration_3d_amr.cc(19): Entering test case "integration_3D_amr"
34: [0;39;49m10% completed
34: 20% completed
34: 30% completed
40: 20% completed
34: 40% completed
34: 50% completed
46: [0;39;49m[1;34;49m/var/jenkins/workspace/adamantine-nightly/tests/test_thermal_physics.cc(48): Leaving test case "convection_bcs_host"; testing time: 47496513us
46: [0;39;49m[1;34;49m/var/jenkins/workspace/adamantine-nightly/tests/test_thermal_physics.cc(48): Leaving test case "convection_bcs_host"; testing time: 47496597us
46: [0;39;49m[1;34;49m/var/jenkins/workspace/adamantine-nightly/tests/test_thermal_physics.cc(53): Entering test case "reference_temperature_host"
46: [0;39;49m[1;34;49m/var/jenkins/workspace/adamantine-nightly/tests/test_thermal_physics.cc(53): Entering test case "reference_temperature_host"
46: [0;39;49m[1;34;49m/var/jenkins/workspace/adamantine-nightly/tests/test_thermal_physics.cc(53): Leaving test case "reference_temperature_host"; testing time: 118165us
46: [0;39;49m[1;34;49mLeaving test module "ThermalPhysics"; testing time: 55267298us
46: [0;39;49m
46: [1;32;49m*** No errors detected
46: [0;39;49m[0;39;49m[1;34;49m/var/jenkins/workspace/adamantine-nightly/tests/test_thermal_physics.cc(53): Leaving test case "reference_temperature_host"; testing time: 158602us
46: [0;39;49m[1;34;49mLeaving test module "ThermalPhysics"; testing time: 55307974us
46: [0;39;49m
46: [1;32;49m*** No errors detected
46: [0;39;49m
42/48 Test #46: test_thermal_physics_2 ................... Passed 56.04 sec
test 48
Start 48: test_ensemble_management_2
48: Test command: /usr/bin/mpiexec "-n" "2" "/var/jenkins/workspace/adamantine-nightly/build/bin/test_ensemble_management"
48: Working Directory: /var/jenkins/workspace/adamantine-nightly/build/tests
48: Test timeout computed to be: 7200
48: Running 1 test case...
48: [1;34;49mEntering test module "EnsembleManagement"
48: [0;39;49m[1;34;49m/var/jenkins/workspace/adamantine-nightly/tests/test_ensemble_management.cc(17): Entering test case "database_ensemble"
48: Running 1 test case...
48: [1;34;49mEntering test module "EnsembleManagement"
48: [0;39;49m[1;34;49m/var/jenkins/workspace/adamantine-nightly/tests/test_ensemble_management.cc(17): Entering test case "database_ensemble"
48: [0;39;49m[1;34;49m/var/jenkins/workspace/adamantine-nightly/tests/test_ensemble_management.cc(17): Leaving test case "database_ensemble"; testing time: 363us
48: [0;39;49m[1;34;49mLeaving test module "EnsembleManagement"; testing time: 390us
48: [0;39;49m
48: [1;32;49m*** No errors detected
48: [0;39;49m[0;39;49m[1;34;49m/var/jenkins/workspace/adamantine-nightly/tests/test_ensemble_management.cc(17): Leaving test case "database_ensemble"; testing time: 2533us
48: [0;39;49m[1;34;49mLeaving test module "EnsembleManagement"; testing time: 2569us
48: [0;39;49m
48: [1;32;49m*** No errors detected
48: [0;39;49m
43/48 Test #48: test_ensemble_management_2 ............... Passed 0.75 sec
34: 60% completed
34: 70% completed
34: 80% completed
34: 90% completed
34: 100% completed
34: [1;34;49m/var/jenkins/workspace/adamantine-nightly/tests/test_integration_3d_amr.cc(19): Leaving test case "integration_3D_amr"; testing time: 14410363us
34: [0;39;49m[1;34;49m/var/jenkins/workspace/adamantine-nightly/tests/test_integration_3d_amr.cc(60): Entering test case "integration_3D_amr_refine_coarsen"
34: [0;39;49m[1;34;49m/var/jenkins/workspace/adamantine-nightly/tests/test_integration_3d_amr.cc(19): Leaving test case "integration_3D_amr"; testing time: 14349255us
34: [0;39;49m[1;34;49m/var/jenkins/workspace/adamantine-nightly/tests/test_integration_3d_amr.cc(60): Entering test case "integration_3D_amr_refine_coarsen"
34: [0;39;49m10% completed
34: 20% completed
34: 30% completed
34: 40% completed
34: 50% completed
40: 30% completed
34: 60% completed
34: 70% completed
32: 60% completed
34: 80% completed
34: 90% completed
34: 100% completed
34:
34: [1;32;49m*** No errors detected
34: [0;39;49m[1;34;49m/var/jenkins/workspace/adamantine-nightly/tests/test_integration_3d_amr.cc(60): Leaving test case "integration_3D_amr_refine_coarsen"; testing time: 141973074us
34: [0;39;49m[1;34;49mLeaving test module "Integration_3D_AMR"; testing time: 156384137us
34: [0;39;49m[0;39;49m[1;34;49m/var/jenkins/workspace/adamantine-nightly/tests/test_integration_3d_amr.cc(60): Leaving test case "integration_3D_amr_refine_coarsen"; testing time: 141972989us
34: [0;39;49m[1;34;49mLeaving test module "Integration_3D_AMR"; testing time: 156323235us
34: [0;39;49m
34: [1;32;49m*** No errors detected
34: [0;39;49m
36/48 Test #34: test_integration_3d_amr_2 ................ Passed 164.79 sec
test 36
Start 36: test_integration_3d_amr_device_2
36: Test command: /usr/bin/mpiexec "-n" "2" "/var/jenkins/workspace/adamantine-nightly/build/bin/test_integration_3d_amr_device"
36: Working Directory: /var/jenkins/workspace/adamantine-nightly/build/tests
36: Test timeout computed to be: 7200
36: Running 1 test case...
36: [1;34;49mEntering test module "Integration_3D_AMR"
36: [0;39;49m[1;34;49m/var/jenkins/workspace/adamantine-nightly/tests/test_integration_3d_amr_device.cc(19): Entering test case "integration_3D_amr_device"
36: Running 1 test case...
36: [1;34;49mEntering test module "Integration_3D_AMR"
36: [0;39;49m[1;34;49m/var/jenkins/workspace/adamantine-nightly/tests/test_integration_3d_amr_device.cc(19): Entering test case "integration_3D_amr_device"
36: [0;39;49m10% completed
36: 20% completed
36: 30% completed
36: 40% completed
36: 50% completed
36: 60% completed
36: 70% completed
40: 40% completed
36: 80% completed
36: 90% completed
36: 100% completed
36:
36: [1;32;49m*** No errors detected
36: [0;39;49m[1;34;49m/var/jenkins/workspace/adamantine-nightly/tests/test_integration_3d_amr_device.cc(19): Leaving test case "integration_3D_amr_device"; testing time: 121372509us
36: [0;39;49m[1;34;49mLeaving test module "Integration_3D_AMR"; testing time: 121373163us
36: [0;39;49m[0;39;49m[1;34;49m/var/jenkins/workspace/adamantine-nightly/tests/test_integration_3d_amr_device.cc(19): Leaving test case "integration_3D_amr_device"; testing time: 121577961us
36: [0;39;49m[1;34;49mLeaving test module "Integration_3D_AMR"; testing time: 121578879us
36: [0;39;49m
36: [1;32;49m*** No errors detected
36: [0;39;49m
37/48 Test #36: test_integration_3d_amr_device_2 ......... Passed 130.45 sec
test 38
Start 38: test_integration_da_augmented_2
38: Test command: /usr/bin/mpiexec "-n" "2" "/var/jenkins/workspace/adamantine-nightly/build/bin/test_integration_da_augmented"
38: Working Directory: /var/jenkins/workspace/adamantine-nightly/build/tests
38: Test timeout computed to be: 7200
38: Running 1 test case...
38: [1;34;49mEntering test module "Integration_Data_Assimilation_Augmented"
38: [0;39;49m[1;34;49m/var/jenkins/workspace/adamantine-nightly/tests/test_integration_da_augmented.cc(19): Entering test case "integration_3D_data_assimilation_augmented"
38: Running 1 test case...
38: [1;34;49mEntering test module "Integration_Data_Assimilation_Augmented"
38: [0;39;49m[1;34;49m/var/jenkins/workspace/adamantine-nightly/tests/test_integration_da_augmented.cc(19): Entering test case "integration_3D_data_assimilation_augmented"
38: [0;39;49mReading the experimental log file...
38: Done. Log entries found for 1 camera(s), with 2 frame(s).
38: Starting the main time stepping loop...
38: 10% completed
38: 20% completed
38: 30% completed
38: [0;39;49mRank: 1 | Old parameters for member 2: 0.446065
38: Rank: 1 | Number expt sites mapped to DOFs: 2
38: 40% completed
38: 50% completed
38: 60% completed
38: 70% completed
38: Performing data assimilation at time 0.04...
38: Rank: 0 | Old parameters for member 0: 0.413453
38: Rank: 0 | Old parameters for member 1: 0.385362
38: Rank: 0 | Number expt sites mapped to DOFs: 2
38: Getting the perturbed innovation...
38: Applying the Kalman gain...
38: Updating the ensemble members...
38: Rank: 1 | New parameters for member 2: 0.107206
38: Done.
38: Rank: 0 | New parameters for member 0: 0.121104
38: Rank: 0 | New parameters for member 1: 0.142225
38: 80% completed
38: 90% completed
38: 100% completed
38:
38: [1;32;49m*** No errors detected
38: [0;39;49m[1;34;49m/var/jenkins/workspace/adamantine-nightly/tests/test_integration_da_augmented.cc(19): Leaving test case "integration_3D_data_assimilation_augmented"; testing time: 69307248us
38: [0;39;49m[1;34;49mLeaving test module "Integration_Data_Assimilation_Augmented"; testing time: 69307608us
38: [0;39;49m[1;34;49m/var/jenkins/workspace/adamantine-nightly/tests/test_integration_da_augmented.cc(19): Leaving test case "integration_3D_data_assimilation_augmented"; testing time: 69323323us
38: [0;39;49m[1;34;49mLeaving test module "Integration_Data_Assimilation_Augmented"; testing time: 69323771us
38:
38: [0;39;49m[1;32;49m*** No errors detected
38: [0;39;49m
38/48 Test #38: test_integration_da_augmented_2 .......... Passed 77.47 sec
test 40
Start 40: test_integration_thermoelastic_2
40: Test command: /usr/bin/mpiexec "-n" "2" "/var/jenkins/workspace/adamantine-nightly/build/bin/test_integration_thermoelastic"
40: Working Directory: /var/jenkins/workspace/adamantine-nightly/build/tests
40: Test timeout computed to be: 7200
40: Running 2 test cases...
40: [1;34;49mEntering test module "Integration_Thermoelastic"
40: [0;39;49m[1;34;49m/var/jenkins/workspace/adamantine-nightly/tests/test_integration_thermoelastic.cc(19): Entering test case "integration_thermoelastic"
40: Running 2 test cases...
40: [1;34;49mEntering test module "Integration_Thermoelastic"
40: [0;39;49m[1;34;49m/var/jenkins/workspace/adamantine-nightly/tests/test_integration_thermoelastic.cc(19): Entering test case "integration_thermoelastic"
40: 50% completed
40: 60% completed
40: 70% completed
32: 70% completed
40: 80% completed
40: 90% completed
40: 100% completed
40: [1;34;49m/var/jenkins/workspace/adamantine-nightly/tests/test_integration_thermoelastic.cc(19): Leaving test case "integration_thermoelastic"; testing time: 1800823319us
40: [0;39;49m[1;34;49m/var/jenkins/workspace/adamantine-nightly/tests/test_integration_thermoelastic.cc(47): Entering test case "integration_thermoelastic_add_material"
40: [1;34;49m/var/jenkins/workspace/adamantine-nightly/tests/test_integration_thermoelastic.cc(19): Leaving test case "integration_thermoelastic"; testing time: 1800823089us
40: [0;39;49m[1;34;49m/var/jenkins/workspace/adamantine-nightly/tests/test_integration_thermoelastic.cc(47): Entering test case "integration_thermoelastic_add_material"
40: [0;39;49m[0;39;49m10% completed
32: 80% completed
40: [0;39;49m[0;39;49m10% completed
40: 20% completed
40: 30% completed
39/48 Test #32: test_integration_3d_2 ....................***Timeout 7200.11 sec
test 42
Start 42: test_material_deposition_2
42: Test command: /usr/bin/mpiexec "-n" "2" "/var/jenkins/workspace/adamantine-nightly/build/bin/test_material_deposition"
42: Working Directory: /var/jenkins/workspace/adamantine-nightly/build/tests
42: Test timeout computed to be: 7200
42: Running 11 test cases...
42: [1;34;49mEntering test module "MaterialDeposition"
42: [0;39;49m[1;34;49m/var/jenkins/workspace/adamantine-nightly/tests/test_material_deposition.cc(50): Entering test case "read_material_deposition_file_2d"
42: [0;39;49m[1;34;49m/var/jenkins/workspace/adamantine-nightly/tests/test_material_deposition.cc(50): Leaving test case "read_material_deposition_file_2d"; testing time: 414us
42: [0;39;49m[1;34;49m/var/jenkins/workspace/adamantine-nightly/tests/test_material_deposition.cc(92): Entering test case "read_material_deposition_file_3d"
42: [0;39;49m[1;34;49m/var/jenkins/workspace/adamantine-nightly/tests/test_material_deposition.cc(92): Leaving test case "read_material_deposition_file_3d"; testing time: 221us
42: [0;39;49m[1;33;49m/var/jenkins/workspace/adamantine-nightly/tests/test_material_deposition.cc(134): Test case "get_elements_to_activate_2d" is skipped because precondition failed: the test only works in serial
42: [0;39;49m[1;33;49m/var/jenkins/workspace/adamantine-nightly/tests/test_material_deposition.cc(195): Test case "get_elements_to_activate_3d" is skipped because precondition failed: the test only works in serial
42: [0;39;49m[1;34;49m/var/jenkins/workspace/adamantine-nightly/tests/test_material_deposition.cc(262): Entering test case "material_deposition"
42: Running 11 test cases...
42: [1;34;49mEntering test module "MaterialDeposition"
42: [0;39;49m[1;34;49m/var/jenkins/workspace/adamantine-nightly/tests/test_material_deposition.cc(50): Entering test case "read_material_deposition_file_2d"
42: [0;39;49m[1;34;49m/var/jenkins/workspace/adamantine-nightly/tests/test_material_deposition.cc(50): Leaving test case "read_material_deposition_file_2d"; testing time: 540us
42: [0;39;49m[1;34;49m/var/jenkins/workspace/adamantine-nightly/tests/test_material_deposition.cc(92): Entering test case "read_material_deposition_file_3d"
42: [0;39;49m[1;34;49m/var/jenkins/workspace/adamantine-nightly/tests/test_material_deposition.cc(92): Leaving test case "read_material_deposition_file_3d"; testing time: 232us
42: [0;39;49m[1;33;49m/var/jenkins/workspace/adamantine-nightly/tests/test_material_deposition.cc(134): Test case "get_elements_to_activate_2d" is skipped because precondition failed: the test only works in serial
42: [0;39;49m[1;33;49m/var/jenkins/workspace/adamantine-nightly/tests/test_material_deposition.cc(195): Test case "get_elements_to_activate_3d" is skipped because precondition failed: the test only works in serial
42: [0;39;49m[1;34;49m/var/jenkins/workspace/adamantine-nightly/tests/test_material_deposition.cc(262): Entering test case "material_deposition"
42: [0;39;49m[1;34;49m/var/jenkins/workspace/adamantine-nightly/tests/test_material_deposition.cc(262): Leaving test case "material_deposition"; testing time: 16469741us
42: [0;39;49m[1;34;49m/var/jenkins/workspace/adamantine-nightly/tests/test_material_deposition.cc(395): Entering test case "deposition_from_scan_path_2d"
42: [0;39;49m[1;34;49m/var/jenkins/workspace/adamantine-nightly/tests/test_material_deposition.cc(395): Leaving test case "deposition_from_scan_path_2d"; testing time: 350us
42: [0;39;49m[1;34;49m/var/jenkins/workspace/adamantine-nightly/tests/test_material_deposition.cc(445): Entering test case "deposition_from_scan_path_3d"
42: [0;39;49m[1;34;49m/var/jenkins/workspace/adamantine-nightly/tests/test_material_deposition.cc(445): Leaving test case "deposition_from_scan_path_3d"; testing time: 231us
42: [0;39;49m[1;34;49m/var/jenkins/workspace/adamantine-nightly/tests/test_material_deposition.cc(499): Entering test case "deposition_from_L_scan_path_3d"
42: [0;39;49m[1;34;49m/var/jenkins/workspace/adamantine-nightly/tests/test_material_deposition.cc(499): Leaving test case "deposition_from_L_scan_path_3d"; testing time: 262us
42: [0;39;49m[1;34;49m/var/jenkins/workspace/adamantine-nightly/tests/test_material_deposition.cc(586): Entering test case "deposition_from_diagonal_scan_path_3d"
42: [0;39;49m[1;34;49m/var/jenkins/workspace/adamantine-nightly/tests/test_material_deposition.cc(586): Leaving test case "deposition_from_diagonal_scan_path_3d"; testing time: 235us
42: [0;39;49m[1;34;49m/var/jenkins/workspace/adamantine-nightly/tests/test_material_deposition.cc(640): Entering test case "merge_multiple_deposition_paths"
42: [0;39;49m[1;34;49m/var/jenkins/workspace/adamantine-nightly/tests/test_material_deposition.cc(640): Leaving test case "merge_multiple_deposition_paths"; testing time: 145us
42: [0;39;49m[1;34;49m/var/jenkins/workspace/adamantine-nightly/tests/test_material_deposition.cc(697): Entering test case "deposition_quaternion_straight_line"
42:
42: [1;32;49m*** No errors detected
42: [0;39;49m[0;39;49m[1;34;49m/var/jenkins/workspace/adamantine-nightly/tests/test_material_deposition.cc(697): Leaving test case "deposition_quaternion_straight_line"; testing time: 698us
42: [0;39;49m[1;34;49mLeaving test module "MaterialDeposition"; testing time: 16474468us
42: [0;39;49m[0;39;49m[1;34;49m/var/jenkins/workspace/adamantine-nightly/tests/test_material_deposition.cc(262): Leaving test case "material_deposition"; testing time: 16617268us
42: [0;39;49m[1;34;49m/var/jenkins/workspace/adamantine-nightly/tests/test_material_deposition.cc(395): Entering test case "deposition_from_scan_path_2d"
42: [0;39;49m[1;34;49m/var/jenkins/workspace/adamantine-nightly/tests/test_material_deposition.cc(395): Leaving test case "deposition_from_scan_path_2d"; testing time: 293us
42: [0;39;49m[1;34;49m/var/jenkins/workspace/adamantine-nightly/tests/test_material_deposition.cc(445): Entering test case "deposition_from_scan_path_3d"
42: [0;39;49m[1;34;49m/var/jenkins/workspace/adamantine-nightly/tests/test_material_deposition.cc(445): Leaving test case "deposition_from_scan_path_3d"; testing time: 233us
42: [0;39;49m[1;34;49m/var/jenkins/workspace/adamantine-nightly/tests/test_material_deposition.cc(499): Entering test case "deposition_from_L_scan_path_3d"
42: [0;39;49m[1;34;49m/var/jenkins/workspace/adamantine-nightly/tests/test_material_deposition.cc(499): Leaving test case "deposition_from_L_scan_path_3d"; testing time: 259us
42: [0;39;49m[1;34;49m/var/jenkins/workspace/adamantine-nightly/tests/test_material_deposition.cc(586): Entering test case "deposition_from_diagonal_scan_path_3d"
42: [0;39;49m[1;34;49m/var/jenkins/workspace/adamantine-nightly/tests/test_material_deposition.cc(586): Leaving test case "deposition_from_diagonal_scan_path_3d"; testing time: 238us
42: [0;39;49m[1;34;49m/var/jenkins/workspace/adamantine-nightly/tests/test_material_deposition.cc(640): Entering test case "merge_multiple_deposition_paths"
42: [0;39;49m[1;34;49m/var/jenkins/workspace/adamantine-nightly/tests/test_material_deposition.cc(640): Leaving test case "merge_multiple_deposition_paths"; testing time: 146us
42: [0;39;49m[1;34;49m/var/jenkins/workspace/adamantine-nightly/tests/test_material_deposition.cc(697): Entering test case "deposition_quaternion_straight_line"
42:
42: [1;32;49m*** No errors detected
42: [0;39;49m[0;39;49m[1;34;49m/var/jenkins/workspace/adamantine-nightly/tests/test_material_deposition.cc(697): Leaving test case "deposition_quaternion_straight_line"; testing time: 664us
42: [0;39;49m[1;34;49mLeaving test module "MaterialDeposition"; testing time: 16621586us
42: [0;39;49m
40/48 Test #42: test_material_deposition_2 ............... Passed 22.58 sec
test 44
Start 44: test_microstructure_2
44: Test command: /usr/bin/mpiexec "-n" "2" "/var/jenkins/workspace/adamantine-nightly/build/bin/test_microstructure"
44: Working Directory: /var/jenkins/workspace/adamantine-nightly/build/tests
44: Test timeout computed to be: 7200
44: Running 1 test case...
44: [1;34;49mEntering test module "MicroStructure"
44: [0;39;49m[1;34;49m/var/jenkins/workspace/adamantine-nightly/tests/test_microstructure.cc(53): Entering test case "G_and_R"
44: Running 1 test case...
44: [1;34;49mEntering test module "MicroStructure"
44: [0;39;49m[1;34;49m/var/jenkins/workspace/adamantine-nightly/tests/test_microstructure.cc(53): Entering test case "G_and_R"
44: [0;39;49m[1;36;49mTest case G_and_R did not check any assertions[0;39;49m
44: [1;34;49m/var/jenkins/workspace/adamantine-nightly/tests/test_microstructure.cc(53): Leaving test case "G_and_R"; testing time: 434913us
44: [0;39;49m[1;34;49mLeaving test module "MicroStructure"; testing time: 434976us
44: [0;39;49m
44: [1;32;49m*** No errors detected
44: [0;39;49m[0;39;49m[1;34;49m/var/jenkins/workspace/adamantine-nightly/tests/test_microstructure.cc(53): Leaving test case "G_and_R"; testing time: 486373us
44: [0;39;49m[1;34;49mLeaving test module "MicroStructure"; testing time: 486412us
44: [0;39;49m
44: [1;32;49m*** No errors detected
44: [0;39;49m
41/48 Test #44: test_microstructure_2 .................... Passed 7.73 sec
test 46
Start 46: test_thermal_physics_2
46: Test command: /usr/bin/mpiexec "-n" "2" "/var/jenkins/workspace/adamantine-nightly/build/bin/test_thermal_physics"
46: Working Directory: /var/jenkins/workspace/adamantine-nightly/build/tests
46: Test timeout computed to be: 7200
46: Running 7 test cases...
46: [1;34;49mEntering test module "ThermalPhysics"
46: [0;39;49m[1;34;49m/var/jenkins/workspace/adamantine-nightly/tests/test_thermal_physics.cc(15): Entering test case "thermal_2d_explicit_host"
46: Running 7 test cases...
46: [1;34;49mEntering test module "ThermalPhysics"
46: [0;39;49m[1;34;49m/var/jenkins/workspace/adamantine-nightly/tests/test_thermal_physics.cc(15): Entering test case "thermal_2d_explicit_host"
46: [0;39;49m[1;34;49m/var/jenkins/workspace/adamantine-nightly/tests/test_thermal_physics.cc(15): Leaving test case "thermal_2d_explicit_host"; testing time: 306886us
46: [0;39;49m[1;34;49m/var/jenkins/workspace/adamantine-nightly/tests/test_thermal_physics.cc(28): Entering test case "thermal_2d_manufactured_solution_host"
46: [0;39;49m[1;34;49m/var/jenkins/workspace/adamantine-nightly/tests/test_thermal_physics.cc(15): Leaving test case "thermal_2d_explicit_host"; testing time: 261948us
46: [0;39;49m[1;34;49m/var/jenkins/workspace/adamantine-nightly/tests/test_thermal_physics.cc(28): Entering test case "thermal_2d_manufactured_solution_host"
46: [0;39;49m[1;34;49m/var/jenkins/workspace/adamantine-nightly/tests/test_thermal_physics.cc(28): Leaving test case "thermal_2d_manufactured_solution_host"; testing time: 236546us
46: [0;39;49m[1;34;49m/var/jenkins/workspace/adamantine-nightly/tests/test_thermal_physics.cc(33): Entering test case "initial_temperature_host"
46: [0;39;49m[1;34;49m/var/jenkins/workspace/adamantine-nightly/tests/test_thermal_physics.cc(28): Leaving test case "thermal_2d_manufactured_solution_host"; testing time: 236203us
46: [0;39;49m[1;34;49m/var/jenkins/workspace/adamantine-nightly/tests/test_thermal_physics.cc(33): Entering test case "initial_temperature_host"
46: [0;39;49m[1;34;49m/var/jenkins/workspace/adamantine-nightly/tests/test_thermal_physics.cc(33): Leaving test case "initial_temperature_host"; testing time: 212446us
46: [0;39;49m[1;34;49m/var/jenkins/workspace/adamantine-nightly/tests/test_thermal_physics.cc(38): Entering test case "energy_conservation_host"
46: [0;39;49m[1;34;49m/var/jenkins/workspace/adamantine-nightly/tests/test_thermal_physics.cc(33): Leaving test case "initial_temperature_host"; testing time: 212338us
46: [0;39;49m[1;34;49m/var/jenkins/workspace/adamantine-nightly/tests/test_thermal_physics.cc(38): Entering test case "energy_conservation_host"
46: [0;39;49m[1;34;49m/var/jenkins/workspace/adamantine-nightly/tests/test_thermal_physics.cc(38): Leaving test case "energy_conservation_host"; testing time: 8945746us
46: [0;39;49m[1;34;49m/var/jenkins/workspace/adamantine-nightly/tests/test_thermal_physics.cc(43): Entering test case "radiation_bcs_host"
46: [0;39;49m[1;34;49m/var/jenkins/workspace/adamantine-nightly/tests/test_thermal_physics.cc(38): Leaving test case "energy_conservation_host"; testing time: 8945958us
46: [0;39;49m[1;34;49m/var/jenkins/workspace/adamantine-nightly/tests/test_thermal_physics.cc(43): Entering test case "radiation_bcs_host"
46: [0;39;49m[1;34;49m/var/jenkins/workspace/adamantine-nightly/tests/test_thermal_physics.cc(43): Leaving test case "radiation_bcs_host"; testing time: 5132543us
46: [0;39;49m[1;34;49m/var/jenkins/workspace/adamantine-nightly/tests/test_thermal_physics.cc(48): Entering test case "convection_bcs_host"
46: [0;39;49m[1;34;49m/var/jenkins/workspace/adamantine-nightly/tests/test_thermal_physics.cc(43): Leaving test case "radiation_bcs_host"; testing time: 5132458us
46: [0;39;49m[1;34;49m/var/jenkins/workspace/adamantine-nightly/tests/test_thermal_physics.cc(48): Entering test case "convection_bcs_host"
40: 40% completed
46: [0;39;49m[1;34;49m/var/jenkins/workspace/adamantine-nightly/tests/test_thermal_physics.cc(48): Leaving test case "convection_bcs_host"; testing time: 78459955us
46: [0;39;49m[1;34;49m/var/jenkins/workspace/adamantine-nightly/tests/test_thermal_physics.cc(53): Entering test case "reference_temperature_host"
46: [0;39;49m[1;34;49m/var/jenkins/workspace/adamantine-nightly/tests/test_thermal_physics.cc(48): Leaving test case "convection_bcs_host"; testing time: 78460215us
46: [0;39;49m[1;34;49m/var/jenkins/workspace/adamantine-nightly/tests/test_thermal_physics.cc(53): Entering test case "reference_temperature_host"
46:
46: [1;32;49m*** No errors detected
46: [0;39;49m[0;39;49m[1;34;49m/var/jenkins/workspace/adamantine-nightly/tests/test_thermal_physics.cc(53): Leaving test case "reference_temperature_host"; testing time: 169367us
46: [0;39;49m[1;34;49mLeaving test module "ThermalPhysics"; testing time: 93464669us
46: [0;39;49m[0;39;49m[1;34;49m/var/jenkins/workspace/adamantine-nightly/tests/test_thermal_physics.cc(53): Leaving test case "reference_temperature_host"; testing time: 236014us
46: [0;39;49m[1;34;49mLeaving test module "ThermalPhysics"; testing time: 93486066us
46: [0;39;49m
46: [1;32;49m*** No errors detected
46: [0;39;49m
42/48 Test #46: test_thermal_physics_2 ................... Passed 100.56 sec
test 48
Start 48: test_ensemble_management_2
48: Test command: /usr/bin/mpiexec "-n" "2" "/var/jenkins/workspace/adamantine-nightly/build/bin/test_ensemble_management"
48: Working Directory: /var/jenkins/workspace/adamantine-nightly/build/tests
48: Test timeout computed to be: 7200
48: Running 1 test case...
48: [1;34;49mEntering test module "EnsembleManagement"
48: [0;39;49m[1;34;49m/var/jenkins/workspace/adamantine-nightly/tests/test_ensemble_management.cc(17): Entering test case "database_ensemble"
48: Running 1 test case...
48: [1;34;49mEntering test module "EnsembleManagement"
48: [0;39;49m[1;34;49m/var/jenkins/workspace/adamantine-nightly/tests/test_ensemble_management.cc(17): Entering test case "database_ensemble"
48:
48: [1;32;49m*** No errors detected
48: [0;39;49m[0;39;49m[1;34;49m/var/jenkins/workspace/adamantine-nightly/tests/test_ensemble_management.cc(17): Leaving test case "database_ensemble"; testing time: 27901us
48: [0;39;49m[1;34;49mLeaving test module "EnsembleManagement"; testing time: 27932us
48: [0;39;49m
48: [1;32;49m*** No errors detected
48: [0;39;49m[0;39;49m[1;34;49m/var/jenkins/workspace/adamantine-nightly/tests/test_ensemble_management.cc(17): Leaving test case "database_ensemble"; testing time: 83425us
48: [0;39;49m[1;34;49mLeaving test module "EnsembleManagement"; testing time: 83455us
48: [0;39;49m
43/48 Test #48: test_ensemble_management_2 ............... Passed 5.73 sec
40: 50% completed
40: 20% completed
40: 60% completed
40: 70% completed
40: 30% completed
40: 80% completed
40: 90% completed
40: 100% completed
40: [1;34;49m/var/jenkins/workspace/adamantine-nightly/tests/test_integration_thermoelastic.cc(47): Leaving test case "integration_thermoelastic_add_material"; testing time: 833382213us
40: [0;39;49m[1;34;49mLeaving test module "Integration_Thermoelastic"; testing time: 2634207061us
40: [0;39;49m
40: [1;32;49m*** No errors detected
40: [0;39;49m[1;34;49m/var/jenkins/workspace/adamantine-nightly/tests/test_integration_thermoelastic.cc(47): Leaving test case "integration_thermoelastic_add_material"; testing time: 833382104us
40: [0;39;49m[1;34;49mLeaving test module "Integration_Thermoelastic"; testing time: 2634206921us
40: [0;39;49m
40: [1;32;49m*** No errors detected
40: [0;39;49m
44/48 Test #40: test_integration_thermoelastic_2 ......... Passed 2634.94 sec
test 3
Start 3: test_integration_da_3
3: Test command: /usr/bin/mpiexec "-n" "3" "/var/jenkins/workspace/adamantine-nightly/build/bin/test_integration_da"
3: Working Directory: /var/jenkins/workspace/adamantine-nightly/build/tests
3: Test timeout computed to be: 7200
3: Running 3 test cases...
3: [1;34;49mEntering test module "Integration_Data_Assimilation"
3: [0;39;49m[1;34;49m/var/jenkins/workspace/adamantine-nightly/tests/test_integration_da.cc(78): Entering test case "integration_data_assimilation"
3: Running 3 test cases...
3: Running 3 test cases...
3: [1;34;49mEntering test module "Integration_Data_Assimilation"
3: [1;34;49mEntering test module "Integration_Data_Assimilation"
3: [0;39;49m[1;34;49m/var/jenkins/workspace/adamantine-nightly/tests/test_integration_da.cc(78): Entering test case "integration_data_assimilation"
3: [0;39;49m[1;34;49m/var/jenkins/workspace/adamantine-nightly/tests/test_integration_da.cc(78): Entering test case "integration_data_assimilation"
3: [0;39;49mReading the experimental log file...
3: Done. Log entries found for 1 camera(s), with 2 frame(s).
3: Starting the main time stepping loop...
3: 10% completed
3: 20% completed
3: 30% completed
3: 40% completed
3: [0;39;49mRank: 2 | Old parameters for member 2:
3: [0;39;49mRank: 1 | Old parameters for member 1:
3: Rank: 2 | Number expt sites mapped to DOFs: 1
3: Rank: 1 | Number expt sites mapped to DOFs: 1
3: Performing data assimilation at time 0.0211...
3: Rank: 0 | Old parameters for member 0:
3: Rank: 0 | Number expt sites mapped to DOFs: 1
3: Getting the perturbed innovation...
3: Applying the Kalman gain...
3: Updating the ensemble members...
3: Done.
3: 50% completed
3: 60% completed
3: Rank: 2 | Old parameters for member 2:
3: Rank: 1 | Old parameters for member 1:
3: Rank: 2 | Number expt sites mapped to DOFs: 1
3: Rank: 1 | Number expt sites mapped to DOFs: 1
3: Performing data assimilation at time 0.0316...
3: Rank: 0 | Old parameters for member 0:
3: Rank: 0 | Number expt sites mapped to DOFs: 1
3: Getting the perturbed innovation...
3: Applying the Kalman gain...
3: Updating the ensemble members...
3: Done.
3: 70% completed
3: 80% completed
3: 90% completed
3: 100% completed
3: Reading the experimental log file...
3: Done. Log entries found for 1 camera(s), with 2 frame(s).
3: Reading the experimental log file...
3: Done. Log entries found for 1 camera(s), with 2 frame(s).
3: Reading the experimental log file...
3: Done. Log entries found for 1 camera(s), with 2 frame(s).
3: Starting the main time stepping loop...
3: Starting the main time stepping loop...
3: Starting the main time stepping loop...
40: 40% completed
3: 10% completed
3: 10% completed
3: 10% completed
3: 20% completed
3: 20% completed
3: 20% completed
3: 30% completed
3: 30% completed
3: 30% completed
3: 40% completed
3: 40% completed
3: 40% completed
3: Performing data assimilation at time 0.0211...
3: Rank: 0 | Old parameters for member 0:
3: Rank: 0 | Old parameters for member 1:
3: Rank: 0 | Old parameters for member 2:
3: Performing data assimilation at time 0.0211...
3: Rank: 0 | Old parameters for member 0:
3: Rank: 0 | Old parameters for member 1:
3: Rank: 0 | Old parameters for member 2:
3: Rank: 0 | Number expt sites mapped to DOFs: 1
3: Rank: 0 | Number expt sites mapped to DOFs: 1
3: Performing data assimilation at time 0.0211...
3: Rank: 0 | Old parameters for member 0:
3: Rank: 0 | Old parameters for member 1:
3: Rank: 0 | Old parameters for member 2:
3: Rank: 0 | Number expt sites mapped to DOFs: 1
3: Getting the perturbed innovation...
3: Applying the Kalman gain...
3: Getting the perturbed innovation...
3: Applying the Kalman gain...
3: Getting the perturbed innovation...
3: Applying the Kalman gain...
3: Updating the ensemble members...
3: Done.
3: Updating the ensemble members...
3: Done.
3: Updating the ensemble members...
3: Done.
3: 50% completed
3: 50% completed
3: 50% completed
3: 60% completed
3: 60% completed
3: 60% completed
3: Performing data assimilation at time 0.0316...
3: Rank: 0 | Old parameters for member 0:
3: Rank: 0 | Old parameters for member 1:
3: Rank: 0 | Old parameters for member 2:
3: Rank: 0 | Number expt sites mapped to DOFs: 1
3: Performing data assimilation at time 0.0316...
3: Rank: 0 | Old parameters for member 0:
3: Rank: 0 | Old parameters for member 1:
3: Rank: 0 | Old parameters for member 2:
3: Rank: 0 | Number expt sites mapped to DOFs: 1
3: Performing data assimilation at time 0.0316...
3: Rank: 0 | Old parameters for member 0:
3: Rank: 0 | Old parameters for member 1:
3: Rank: 0 | Old parameters for member 2:
3: Rank: 0 | Number expt sites mapped to DOFs: 1
3: Getting the perturbed innovation...
3: Applying the Kalman gain...
3: Getting the perturbed innovation...
3: Applying the Kalman gain...
3: Getting the perturbed innovation...
3: Applying the Kalman gain...
3: Updating the ensemble members...
3: Done.
3: Updating the ensemble members...
3: Done.
3: Updating the ensemble members...
3: Done.
3: 70% completed
3: 70% completed
3: 70% completed
3: 80% completed
3: 80% completed
3: 80% completed
3: 90% completed
3: 90% completed
3: 90% completed
3: 100% completed
3: 100% completed
3: [1;34;49m/var/jenkins/workspace/adamantine-nightly/tests/test_integration_da.cc(78): Leaving test case "integration_data_assimilation"; testing time: 40202229us
3: [0;39;49m[1;34;49m/var/jenkins/workspace/adamantine-nightly/tests/test_integration_da.cc(148): Entering test case "integration_3D_da_point_cloud_add_material"
3: [1;34;49m/var/jenkins/workspace/adamantine-nightly/tests/test_integration_da.cc(78): Leaving test case "integration_data_assimilation"; testing time: 40260203us
3: [0;39;49m[1;34;49m/var/jenkins/workspace/adamantine-nightly/tests/test_integration_da.cc(148): Entering test case "integration_3D_da_point_cloud_add_material"
3: 100% completed
3: [1;34;49m/var/jenkins/workspace/adamantine-nightly/tests/test_integration_da.cc(78): Leaving test case "integration_data_assimilation"; testing time: 40531466us
3: [0;39;49m[1;34;49m/var/jenkins/workspace/adamantine-nightly/tests/test_integration_da.cc(148): Entering test case "integration_3D_da_point_cloud_add_material"
3: [0;39;49mReading the experimental log file...
3: Done. Log entries found for 1 camera(s), with 1 frame(s).
3: Starting the main time stepping loop...
3: 10% completed
3: 20% completed
3: 30% completed
3: 40% completed
3: 50% completed
3: [0;39;49mRank: 1 | Old parameters for member 1:
3: [0;39;49mRank: 2 | Old parameters for member 2:
3: Performing data assimilation at time 0.12...
3: Rank: 0 | Old parameters for member 0:
3: Rank: 2 | Number expt sites mapped to DOFs: 1
3: Rank: 1 | Number expt sites mapped to DOFs: 1
3: Rank: 0 | Number expt sites mapped to DOFs: 1
3: Getting the perturbed innovation...
3: Applying the Kalman gain...
3: Updating the ensemble members...
3: Done.
3: 60% completed
3: 70% completed
3: 80% completed
3: 90% completed
3: 100% completed
3: Reading the experimental log file...
3: Done. Log entries found for 1 camera(s), with 1 frame(s).
3: Reading the experimental log file...
3: Done. Log entries found for 1 camera(s), with 1 frame(s).
3: Reading the experimental log file...
3: Done. Log entries found for 1 camera(s), with 1 frame(s).
3: Starting the main time stepping loop...
3: Starting the main time stepping loop...
3: Starting the main time stepping loop...
3: 10% completed
3: 10% completed
3: 10% completed
3: 20% completed
3: 20% completed
3: 20% completed
3: 30% completed
3: 30% completed
3: 30% completed
3: 40% completed
3: 40% completed
3: 40% completed
3: 50% completed
3: 50% completed
3: 50% completed
3: Performing data assimilation at time 0.12...
3: Rank: 0 | Old parameters for member 0:
3: Rank: 0 | Old parameters for member 1:
3: Rank: 0 | Old parameters for member 2:
3: Rank: 0 | Number expt sites mapped to DOFs: 1
3: Performing data assimilation at time 0.12...
3: Rank: 0 | Old parameters for member 0:
3: Rank: 0 | Old parameters for member 1:
3: Rank: 0 | Old parameters for member 2:
3: Performing data assimilation at time 0.12...
3: Rank: 0 | Old parameters for member 0:
3: Rank: 0 | Old parameters for member 1:
3: Rank: 0 | Old parameters for member 2:
3: Rank: 0 | Number expt sites mapped to DOFs: 1
3: Rank: 0 | Number expt sites mapped to DOFs: 1
3: Getting the perturbed innovation...
3: Applying the Kalman gain...
3: Getting the perturbed innovation...
3: Applying the Kalman gain...
3: Getting the perturbed innovation...
3: Applying the Kalman gain...
3: Updating the ensemble members...
3: Done.
3: 60% completed
3: Updating the ensemble members...
3: Done.
3: 60% completed
3: Updating the ensemble members...
3: Done.
3: 60% completed
3: 70% completed
3: 70% completed
3: 70% completed
3: 80% completed
3: 80% completed
3: 80% completed
3: 90% completed
3: 90% completed
3: 90% completed
3: 100% completed
3: 100% completed
3: 100% completed
3: [1;34;49m/var/jenkins/workspace/adamantine-nightly/tests/test_integration_da.cc(148): Leaving test case "integration_3D_da_point_cloud_add_material"; testing time: 1731312us
3: [0;39;49m[1;34;49m/var/jenkins/workspace/adamantine-nightly/tests/test_integration_da.cc(231): Entering test case "integration_3D_da_ray_add_material"
3: [1;34;49m/var/jenkins/workspace/adamantine-nightly/tests/test_integration_da.cc(148): Leaving test case "integration_3D_da_point_cloud_add_material"; testing time: 2014334us
3: [0;39;49m[1;34;49m/var/jenkins/workspace/adamantine-nightly/tests/test_integration_da.cc(231): Entering test case "integration_3D_da_ray_add_material"
3: [1;34;49m/var/jenkins/workspace/adamantine-nightly/tests/test_integration_da.cc(148): Leaving test case "integration_3D_da_point_cloud_add_material"; testing time: 2078629us
3: [0;39;49m[1;34;49m/var/jenkins/workspace/adamantine-nightly/tests/test_integration_da.cc(231): Entering test case "integration_3D_da_ray_add_material"
3: [0;39;49mReading the experimental log file...
3: Done. Log entries found for 1 camera(s), with 1 frame(s).
3: Starting the main time stepping loop...
3: 10% completed
3: 20% completed
3: 30% completed
3: 40% completed
3: 50% completed
3: Performing data assimilation at time 0.12...
3: Rank: 0 | Old parameters for member 0:
3: [0;39;49mRank: 2 | Old parameters for member 2:
3: [0;39;49mRank: 1 | Old parameters for member 1:
3: Rank: 0 | Number expt sites mapped to DOFs: 1
3: Rank: 1 | Number expt sites mapped to DOFs: 1
3: Rank: 2 | Number expt sites mapped to DOFs: 1
3: Getting the perturbed innovation...
3: Applying the Kalman gain...
3: Updating the ensemble members...
3: Done.
3: 60% completed
3: 70% completed
3: 80% completed
3: 90% completed
3: 100% completed
3: Reading the experimental log file...
3: Done. Log entries found for 1 camera(s), with 1 frame(s).
3: Reading the experimental log file...
3: Done. Log entries found for 1 camera(s), with 1 frame(s).
3: Reading the experimental log file...
3: Done. Log entries found for 1 camera(s), with 1 frame(s).
3: Starting the main time stepping loop...
3: Starting the main time stepping loop...
3: Starting the main time stepping loop...
3: 10% completed
3: 10% completed
3: 10% completed
3: 20% completed
3: 20% completed
3: 20% completed
3: 30% completed
3: 30% completed
3: 30% completed
3: 40% completed
3: 40% completed
3: 40% completed
3: 50% completed
3: 50% completed
3: 50% completed
3: Performing data assimilation at time 0.12...
3: Rank: 0 | Old parameters for member 0:
3: Rank: 0 | Old parameters for member 1:
3: Rank: 0 | Old parameters for member 2:
3: Performing data assimilation at time 0.12...
3: Performing data assimilation at time 0.12...
3: Rank: 0 | Old parameters for member 0:
3: Rank: 0 | Old parameters for member 1:
3: Rank: 0 | Old parameters for member 2:
3: Rank: 0 | Old parameters for member 0:
3: Rank: 0 | Old parameters for member 1:
3: Rank: 0 | Old parameters for member 2:
3: Rank: 0 | Number expt sites mapped to DOFs: 1
3: Rank: 0 | Number expt sites mapped to DOFs: 1
3: Rank: 0 | Number expt sites mapped to DOFs: 1
3: Getting the perturbed innovation...
3: Getting the perturbed innovation...
3: Applying the Kalman gain...
3: Applying the Kalman gain...
3: Getting the perturbed innovation...
3: Applying the Kalman gain...
3: Updating the ensemble members...
3: Done.
3: 60% completed
3: Updating the ensemble members...
3: Updating the ensemble members...
3: Done.
3: 60% completed
3: Done.
3: 60% completed
3: 70% completed
3: 70% completed
3: 70% completed
3: 80% completed
3: 80% completed
3: 80% completed
3: 90% completed
3: 90% completed
3: 90% completed
3: 100% completed
3: 100% completed
3: 100% completed
3: [1;34;49m/var/jenkins/workspace/adamantine-nightly/tests/test_integration_da.cc(231): Leaving test case "integration_3D_da_ray_add_material"; testing time: 1767804us
3: [0;39;49m[1;34;49mLeaving test module "Integration_Data_Assimilation"; testing time: 44030938us
3: [0;39;49m
3: [1;32;49m*** No errors detected
3: [0;39;49m[1;34;49m/var/jenkins/workspace/adamantine-nightly/tests/test_integration_da.cc(231): Leaving test case "integration_3D_da_ray_add_material"; testing time: 1770666us
3: [0;39;49m[1;34;49mLeaving test module "Integration_Data_Assimilation"; testing time: 44045505us
3: [0;39;49m
3: [1;32;49m*** No errors detected
3: [0;39;49m[1;34;49m/var/jenkins/workspace/adamantine-nightly/tests/test_integration_da.cc(231): Leaving test case "integration_3D_da_ray_add_material"; testing time: 1769743us
3: [0;39;49m[1;34;49mLeaving test module "Integration_Data_Assimilation"; testing time: 44050919us
3: [0;39;49m
3: [1;32;49m*** No errors detected
3: [0;39;49m
45/48 Test #3: test_integration_da_3 .................... Passed 44.73 sec
test 4
Start 4: test_integration_da_6
4: Test command: /usr/bin/mpiexec "-n" "6" "/var/jenkins/workspace/adamantine-nightly/build/bin/test_integration_da"
4: Working Directory: /var/jenkins/workspace/adamantine-nightly/build/tests
4: Test timeout computed to be: 7200
4: Running 3 test cases...
4: [1;34;49mEntering test module "Integration_Data_Assimilation"
4: [0;39;49m[1;34;49m/var/jenkins/workspace/adamantine-nightly/tests/test_integration_da.cc(78): Entering test case "integration_data_assimilation"
4: Running 3 test cases...
4: Running 3 test cases...
4: Running 3 test cases...
4: Running 3 test cases...
4: Running 3 test cases...
4: [1;34;49mEntering test module "Integration_Data_Assimilation"
4: [0;39;49m[1;34;49m/var/jenkins/workspace/adamantine-nightly/tests/test_integration_da.cc(78): Entering test case "integration_data_assimilation"
4: [1;34;49mEntering test module "Integration_Data_Assimilation"
4: [0;39;49m[1;34;49m/var/jenkins/workspace/adamantine-nightly/tests/test_integration_da.cc(78): Entering test case "integration_data_assimilation"
4: [1;34;49mEntering test module "Integration_Data_Assimilation"
4: [1;34;49mEntering test module "Integration_Data_Assimilation"
4: [0;39;49m[1;34;49m/var/jenkins/workspace/adamantine-nightly/tests/test_integration_da.cc(78): Entering test case "integration_data_assimilation"
4: [0;39;49m[1;34;49m/var/jenkins/workspace/adamantine-nightly/tests/test_integration_da.cc(78): Entering test case "integration_data_assimilation"
4: [1;34;49mEntering test module "Integration_Data_Assimilation"
4: [0;39;49m[1;34;49m/var/jenkins/workspace/adamantine-nightly/tests/test_integration_da.cc(78): Entering test case "integration_data_assimilation"
4: [0;39;49mReading the experimental log file...
4: Done. Log entries found for 1 camera(s), with 2 frame(s).
4: Starting the main time stepping loop...
4: 10% completed
4: 20% completed
4: 30% completed
4: 40% completed
4: Performing data assimilation at time 0.0211...
4: Rank: 0 | Old parameters for member 0:
4: [0;39;49mRank: 1 | Old parameters for member 0:
4: Rank: 1 | Number expt sites mapped to DOFs: 1
4: Rank: 0 | Number expt sites mapped to DOFs: 1
4: [0;39;49mRank: 4 | Old parameters for member 2:
4: [0;39;49mRank: 5 | Old parameters for member 2:
4: [0;39;49mRank: 3 | Old parameters for member 1:
4: [0;39;49mRank: 2 | Old parameters for member 1:
4: Rank: 5 | Number expt sites mapped to DOFs: 1
4: Rank: 4 | Number expt sites mapped to DOFs: 1
4: Rank: 2 | Number expt sites mapped to DOFs: 1
4: Rank: 3 | Number expt sites mapped to DOFs: 1
4: Getting the perturbed innovation...
4: Applying the Kalman gain...
4: Updating the ensemble members...
4: Done.
4: 50% completed
4: 60% completed
4: Rank: 1 | Old parameters for member 0:
4: Performing data assimilation at time 0.0316...
4: Rank: 0 | Old parameters for member 0:
4: Rank: 4 | Old parameters for member 2:
4: Rank: 5 | Old parameters for member 2:
4: Rank: 2 | Old parameters for member 1:
4: Rank: 3 | Old parameters for member 1:
4: Rank: 1 | Number expt sites mapped to DOFs: 1
4: Rank: 0 | Number expt sites mapped to DOFs: 1
4: Rank: 5 | Number expt sites mapped to DOFs: 1
4: Rank: 4 | Number expt sites mapped to DOFs: 1
4: Rank: 3 | Number expt sites mapped to DOFs: 1
4: Rank: 2 | Number expt sites mapped to DOFs: 1
4: Getting the perturbed innovation...
4: Applying the Kalman gain...
4: Updating the ensemble members...
4: Done.
4: 70% completed
4: 80% completed
4: 90% completed
4: 100% completed
4: Reading the experimental log file...
4: Done. Log entries found for 1 camera(s), with 2 frame(s).
4: Reading the experimental log file...
4: Done. Log entries found for 1 camera(s), with 2 frame(s).
4: Reading the experimental log file...
4: Done. Log entries found for 1 camera(s), with 2 frame(s).
4: Reading the experimental log file...
4: Done. Log entries found for 1 camera(s), with 2 frame(s).
4: Reading the experimental log file...
4: Done. Log entries found for 1 camera(s), with 2 frame(s).
4: Reading the experimental log file...
4: Done. Log entries found for 1 camera(s), with 2 frame(s).
4: Starting the main time stepping loop...
4: Starting the main time stepping loop...
4: Starting the main time stepping loop...
4: Starting the main time stepping loop...
4: Starting the main time stepping loop...
4: Starting the main time stepping loop...
4: 10% completed
4: 10% completed
4: 10% completed
4: 10% completed
4: 10% completed
4: 10% completed
4: 20% completed
4: 20% completed
4: 20% completed
4: 20% completed
4: 20% completed
4: 20% completed
4: 30% completed
4: 30% completed
4: 30% completed
4: 30% completed
4: 30% completed
4: 30% completed
4: 40% completed
4: 40% completed
4: 40% completed
4: 40% completed
4: 40% completed
4: 40% completed
4: Performing data assimilation at time 0.0211...
4: Rank: 0 | Old parameters for member 0:
4: Rank: 0 | Old parameters for member 1:
4: Rank: 0 | Old parameters for member 2:
4: Performing data assimilation at time 0.0211...
4: Rank: 0 | Old parameters for member 0:
4: Rank: 0 | Old parameters for member 1:
4: Rank: 0 | Old parameters for member 2:
4: Rank: 0 | Number expt sites mapped to DOFs: 1
4: Rank: 0 | Number expt sites mapped to DOFs: 1
4: Performing data assimilation at time 0.0211...
4: Rank: 0 | Old parameters for member 0:
4: Rank: 0 | Old parameters for member 1:
4: Rank: 0 | Old parameters for member 2:
4: Performing data assimilation at time 0.0211...
4: Rank: 0 | Old parameters for member 0:
4: Rank: 0 | Old parameters for member 1:
4: Rank: 0 | Old parameters for member 2:
4: Rank: 0 | Number expt sites mapped to DOFs: 1
4: Performing data assimilation at time 0.0211...
4: Rank: 0 | Old parameters for member 0:
4: Rank: 0 | Old parameters for member 1:
4: Rank: 0 | Old parameters for member 2:
4: Rank: 0 | Number expt sites mapped to DOFs: 1
4: Rank: 0 | Number expt sites mapped to DOFs: 1
4: Performing data assimilation at time 0.0211...
4: Rank: 0 | Old parameters for member 0:
4: Rank: 0 | Old parameters for member 1:
4: Rank: 0 | Old parameters for member 2:
4: Rank: 0 | Number expt sites mapped to DOFs: 1
4: Getting the perturbed innovation...
4: Applying the Kalman gain...
4: Getting the perturbed innovation...
4: Applying the Kalman gain...
4: Getting the perturbed innovation...
4: Applying the Kalman gain...
4: Getting the perturbed innovation...
4: Applying the Kalman gain...
4: Getting the perturbed innovation...
4: Applying the Kalman gain...
4: Getting the perturbed innovation...
4: Applying the Kalman gain...
4: Updating the ensemble members...
4: Updating the ensemble members...
4: Done.
4: Done.
4: Updating the ensemble members...
4: Done.
4: Updating the ensemble members...
4: Done.
4: Updating the ensemble members...
4: Done.
4: Updating the ensemble members...
4: Done.
4: 50% completed
4: 50% completed
4: 50% completed
4: 50% completed
4: 50% completed
4: 50% completed
4: 60% completed
4: 60% completed
4: 60% completed
4: 60% completed
4: 60% completed
4: 60% completed
4: Performing data assimilation at time 0.0316...
4: Rank: 0 | Old parameters for member 0:
4: Rank: 0 | Old parameters for member 1:
4: Rank: 0 | Old parameters for member 2:
4: Performing data assimilation at time 0.0316...
4: Rank: 0 | Old parameters for member 0:
4: Rank: 0 | Old parameters for member 1:
4: Rank: 0 | Old parameters for member 2:
4: Rank: 0 | Number expt sites mapped to DOFs: 1
4: Rank: 0 | Number expt sites mapped to DOFs: 1
4: Performing data assimilation at time 0.0316...
4: Rank: 0 | Old parameters for member 0:
4: Rank: 0 | Old parameters for member 1:
4: Rank: 0 | Old parameters for member 2:
4: Rank: 0 | Number expt sites mapped to DOFs: 1
4: Performing data assimilation at time 0.0316...
4: Rank: 0 | Old parameters for member 0:
4: Rank: 0 | Old parameters for member 1:
4: Rank: 0 | Old parameters for member 2:
4: Rank: 0 | Number expt sites mapped to DOFs: 1
4: Performing data assimilation at time 0.0316...
4: Rank: 0 | Old parameters for member 0:
4: Rank: 0 | Old parameters for member 1:
4: Rank: 0 | Old parameters for member 2:
4: Rank: 0 | Number expt sites mapped to DOFs: 1
4: Performing data assimilation at time 0.0316...
4: Rank: 0 | Old parameters for member 0:
4: Rank: 0 | Old parameters for member 1:
4: Rank: 0 | Old parameters for member 2:
4: Rank: 0 | Number expt sites mapped to DOFs: 1
4: Getting the perturbed innovation...
4: Applying the Kalman gain...
4: Getting the perturbed innovation...
4: Applying the Kalman gain...
4: Getting the perturbed innovation...
4: Applying the Kalman gain...
4: Getting the perturbed innovation...
4: Applying the Kalman gain...
4: Getting the perturbed innovation...
4: Applying the Kalman gain...
4: Getting the perturbed innovation...
4: Applying the Kalman gain...
4: Updating the ensemble members...
4: Done.
4: Updating the ensemble members...
4: Done.
4: Updating the ensemble members...
4: Done.
4: Updating the ensemble members...
4: Done.
4: Updating the ensemble members...
4: Done.
4: Updating the ensemble members...
4: Done.
4: 70% completed
4: 70% completed
4: 70% completed
4: 70% completed
4: 70% completed
4: 70% completed
4: 80% completed
4: 80% completed
4: 80% completed
4: 80% completed
4: 80% completed
4: 80% completed
4: 90% completed
4: 90% completed
4: 90% completed
4: 90% completed
4: 90% completed
4: 90% completed
4: 100% completed
4: 100% completed
4: 100% completed
4: 100% completed
4: [1;34;49m/var/jenkins/workspace/adamantine-nightly/tests/test_integration_da.cc(78): Leaving test case "integration_data_assimilation"; testing time: 37198342us
4: [0;39;49m[1;34;49m/var/jenkins/workspace/adamantine-nightly/tests/test_integration_da.cc(148): Entering test case "integration_3D_da_point_cloud_add_material"
4: [1;34;49m/var/jenkins/workspace/adamantine-nightly/tests/test_integration_da.cc(78): Leaving test case "integration_data_assimilation"; testing time: 37227018us
4: [0;39;49m[1;34;49m/var/jenkins/workspace/adamantine-nightly/tests/test_integration_da.cc(148): Entering test case "integration_3D_da_point_cloud_add_material"
4: 100% completed
4: [1;34;49m/var/jenkins/workspace/adamantine-nightly/tests/test_integration_da.cc(78): Leaving test case "integration_data_assimilation"; testing time: 37288494us
4: [0;39;49m[1;34;49m/var/jenkins/workspace/adamantine-nightly/tests/test_integration_da.cc(148): Entering test case "integration_3D_da_point_cloud_add_material"
4: 100% completed
4: [1;34;49m/var/jenkins/workspace/adamantine-nightly/tests/test_integration_da.cc(78): Leaving test case "integration_data_assimilation"; testing time: 37398193us
4: [0;39;49m[1;34;49m/var/jenkins/workspace/adamantine-nightly/tests/test_integration_da.cc(148): Entering test case "integration_3D_da_point_cloud_add_material"
4: [1;34;49m/var/jenkins/workspace/adamantine-nightly/tests/test_integration_da.cc(78): Leaving test case "integration_data_assimilation"; testing time: 37483341us
4: [0;39;49m[1;34;49m/var/jenkins/workspace/adamantine-nightly/tests/test_integration_da.cc(148): Entering test case "integration_3D_da_point_cloud_add_material"
4: [1;34;49m/var/jenkins/workspace/adamantine-nightly/tests/test_integration_da.cc(78): Leaving test case "integration_data_assimilation"; testing time: 37520761us
4: [0;39;49m[1;34;49m/var/jenkins/workspace/adamantine-nightly/tests/test_integration_da.cc(148): Entering test case "integration_3D_da_point_cloud_add_material"
4: [0;39;49mReading the experimental log file...
4: Done. Log entries found for 1 camera(s), with 1 frame(s).
4: Starting the main time stepping loop...
4: 10% completed
4: 20% completed
4: 30% completed
4: 40% completed
4: 50% completed
4: [0;39;49mRank: 3 | Old parameters for member 1:
4: [0;39;49mRank: 2 | Old parameters for member 1:
4: [0;39;49mRank: 5 | Old parameters for member 2:
4: [0;39;49mRank: 4 | Old parameters for member 2:
4: [0;39;49mRank: 1 | Old parameters for member 0:
4: Performing data assimilation at time 0.12...
4: Rank: 0 | Old parameters for member 0:
4: Rank: 3 | Number expt sites mapped to DOFs: 1
4: Rank: 2 | Number expt sites mapped to DOFs: 1
4: Rank: 4 | Number expt sites mapped to DOFs: 1
4: Rank: 5 | Number expt sites mapped to DOFs: 1
4: Rank: 0 | Number expt sites mapped to DOFs: 1
4: Rank: 1 | Number expt sites mapped to DOFs: 1
4: Getting the perturbed innovation...
4: Applying the Kalman gain...
4: Updating the ensemble members...
4: Done.
4: 60% completed
4: 70% completed
4: 80% completed
4: 90% completed
4: 100% completed
4: Reading the experimental log file...
4: Done. Log entries found for 1 camera(s), with 1 frame(s).
4: Reading the experimental log file...
4: Done. Log entries found for 1 camera(s), with 1 frame(s).
4: Reading the experimental log file...
4: Done. Log entries found for 1 camera(s), with 1 frame(s).
4: Reading the experimental log file...
4: Done. Log entries found for 1 camera(s), with 1 frame(s).
4: Starting the main time stepping loop...
4: Reading the experimental log file...
4: Done. Log entries found for 1 camera(s), with 1 frame(s).
4: Reading the experimental log file...
4: Done. Log entries found for 1 camera(s), with 1 frame(s).
4: Starting the main time stepping loop...
4: Starting the main time stepping loop...
4: Starting the main time stepping loop...
4: Starting the main time stepping loop...
4: Starting the main time stepping loop...
4: 10% completed
4: 10% completed
4: 10% completed
4: 10% completed
4: 20% completed
4: 10% completed
4: 20% completed
4: 10% completed
4: 20% completed
4: 20% completed
4: 30% completed
4: 20% completed
4: 30% completed
4: 20% completed
4: 30% completed
4: 30% completed
4: 40% completed
4: 30% completed
4: 40% completed
4: 30% completed
4: 50% completed
4: 40% completed
4: 40% completed
4: 40% completed
4: 50% completed
4: 40% completed
4: Performing data assimilation at time 0.12...
4: Rank: 0 | Old parameters for member 0:
4: Rank: 0 | Old parameters for member 1:
4: Rank: 0 | Old parameters for member 2:
4: Rank: 0 | Number expt sites mapped to DOFs: 1
4: Performing data assimilation at time 0.12...
4: Rank: 0 | Old parameters for member 0:
4: Rank: 0 | Old parameters for member 1:
4: Rank: 0 | Old parameters for member 2:
4: Rank: 0 | Number expt sites mapped to DOFs: 1
4: 50% completed
4: 50% completed
4: 50% completed
4: 50% completed
4: Performing data assimilation at time 0.12...
4: Rank: 0 | Old parameters for member 0:
4: Rank: 0 | Old parameters for member 1:
4: Rank: 0 | Old parameters for member 2:
4: Performing data assimilation at time 0.12...
4: Performing data assimilation at time 0.12...
4: Rank: 0 | Old parameters for member 0:
4: Rank: 0 | Old parameters for member 1:
4: Rank: 0 | Old parameters for member 2:
4: Performing data assimilation at time 0.12...
4: Rank: 0 | Old parameters for member 0:
4: Rank: 0 | Old parameters for member 1:
4: Rank: 0 | Old parameters for member 2:
4: Rank: 0 | Old parameters for member 0:
4: Rank: 0 | Old parameters for member 1:
4: Rank: 0 | Old parameters for member 2:
4: Rank: 0 | Number expt sites mapped to DOFs: 1
4: Rank: 0 | Number expt sites mapped to DOFs: 1
4: Rank: 0 | Number expt sites mapped to DOFs: 1
4: Rank: 0 | Number expt sites mapped to DOFs: 1
4: Getting the perturbed innovation...
4: Applying the Kalman gain...
4: Getting the perturbed innovation...
4: Applying the Kalman gain...
4: Getting the perturbed innovation...
4: Getting the perturbed innovation...
4: Getting the perturbed innovation...
4: Applying the Kalman gain...
4: Applying the Kalman gain...
4: Getting the perturbed innovation...
4: Applying the Kalman gain...
4: Applying the Kalman gain...
4: Updating the ensemble members...
4: Done.
4: 60% completed
4: Updating the ensemble members...
4: Done.
4: 60% completed
4: 70% completed
4: 70% completed
4: Updating the ensemble members...
4: Done.
4: 60% completed
4: Updating the ensemble members...
4: Updating the ensemble members...
4: Done.
4: 60% completed
4: Updating the ensemble members...
4: Done.
4: 60% completed
4: Done.
4: 60% completed
4: 80% completed
4: 80% completed
4: 70% completed
4: 90% completed
4: 70% completed
4: 70% completed
4: 70% completed
4: 90% completed
4: 80% completed
4: 80% completed
4: 80% completed
4: 80% completed
4: 90% completed
4: 90% completed
4: 90% completed
4: 90% completed
4: 100% completed
4: 100% completed
4: [1;34;49m/var/jenkins/workspace/adamantine-nightly/tests/test_integration_da.cc(148): Leaving test case "integration_3D_da_point_cloud_add_material"; testing time: 2001880us
4: [0;39;49m[1;34;49m/var/jenkins/workspace/adamantine-nightly/tests/test_integration_da.cc(231): Entering test case "integration_3D_da_ray_add_material"
4: [1;34;49m/var/jenkins/workspace/adamantine-nightly/tests/test_integration_da.cc(148): Leaving test case "integration_3D_da_point_cloud_add_material"; testing time: 1918379us
4: [0;39;49m[1;34;49m/var/jenkins/workspace/adamantine-nightly/tests/test_integration_da.cc(231): Entering test case "integration_3D_da_ray_add_material"
4: 100% completed
4: 100% completed
4: 100% completed
4: 100% completed
4: [1;34;49m/var/jenkins/workspace/adamantine-nightly/tests/test_integration_da.cc(148): Leaving test case "integration_3D_da_point_cloud_add_material"; testing time: 2026348us
4: [0;39;49m[1;34;49m/var/jenkins/workspace/adamantine-nightly/tests/test_integration_da.cc(231): Entering test case "integration_3D_da_ray_add_material"
4: [1;34;49m/var/jenkins/workspace/adamantine-nightly/tests/test_integration_da.cc(148): Leaving test case "integration_3D_da_point_cloud_add_material"; testing time: 1745434us
4: [0;39;49m[1;34;49m/var/jenkins/workspace/adamantine-nightly/tests/test_integration_da.cc(231): Entering test case "integration_3D_da_ray_add_material"
4: [1;34;49m/var/jenkins/workspace/adamantine-nightly/tests/test_integration_da.cc(148): Leaving test case "integration_3D_da_point_cloud_add_material"; testing time: 1880958us
4: [0;39;49m[1;34;49m/var/jenkins/workspace/adamantine-nightly/tests/test_integration_da.cc(231): Entering test case "integration_3D_da_ray_add_material"
4: [1;34;49m/var/jenkins/workspace/adamantine-nightly/tests/test_integration_da.cc(148): Leaving test case "integration_3D_da_point_cloud_add_material"; testing time: 1806270us
4: [0;39;49m[1;34;49m/var/jenkins/workspace/adamantine-nightly/tests/test_integration_da.cc(231): Entering test case "integration_3D_da_ray_add_material"
4: [0;39;49mReading the experimental log file...
4: Done. Log entries found for 1 camera(s), with 1 frame(s).
4: Starting the main time stepping loop...
4: 10% completed
4: 20% completed
4: 30% completed
4: 40% completed
4: 50% completed
4: [0;39;49mRank: 4 | Old parameters for member 2:
4: [0;39;49mRank: 5 | Old parameters for member 2:
4: Performing data assimilation at time 0.12...
4: Rank: 0 | Old parameters for member 0:
4: [0;39;49mRank: 1 | Old parameters for member 0:
4: [0;39;49mRank: 2 | Old parameters for member 1:
4: [0;39;49mRank: 3 | Old parameters for member 1:
4: Rank: 5 | Number expt sites mapped to DOFs: 1
4: Rank: 4 | Number expt sites mapped to DOFs: 1
4: Rank: 1 | Number expt sites mapped to DOFs: 1
4: Rank: 0 | Number expt sites mapped to DOFs: 1
4: Rank: 2 | Number expt sites mapped to DOFs: 1
4: Rank: 3 | Number expt sites mapped to DOFs: 1
4: Getting the perturbed innovation...
4: Applying the Kalman gain...
4: Updating the ensemble members...
4: Done.
4: 60% completed
4: 70% completed
4: 80% completed
4: 90% completed
4: 100% completed
4: Reading the experimental log file...
4: Done. Log entries found for 1 camera(s), with 1 frame(s).
4: Reading the experimental log file...
4: Done. Log entries found for 1 camera(s), with 1 frame(s).
4: Reading the experimental log file...
4: Done. Log entries found for 1 camera(s), with 1 frame(s).
4: Reading the experimental log file...
4: Done. Log entries found for 1 camera(s), with 1 frame(s).
4: Reading the experimental log file...
4: Done. Log entries found for 1 camera(s), with 1 frame(s).
4: Starting the main time stepping loop...
4: Reading the experimental log file...
4: Done. Log entries found for 1 camera(s), with 1 frame(s).
4: Starting the main time stepping loop...
4: Starting the main time stepping loop...
4: Starting the main time stepping loop...
4: Starting the main time stepping loop...
4: Starting the main time stepping loop...
4: 10% completed
4: 10% completed
4: 10% completed
4: 10% completed
4: 10% completed
4: 10% completed
4: 20% completed
4: 20% completed
4: 20% completed
4: 20% completed
4: 30% completed
4: 20% completed
4: 20% completed
4: 30% completed
4: 30% completed
4: 30% completed
4: 40% completed
4: 40% completed
4: 30% completed
4: 30% completed
4: 40% completed
4: 40% completed
4: 50% completed
4: 50% completed
4: 40% completed
4: 40% completed
4: 50% completed
4: 50% completed
4: Performing data assimilation at time 0.12...
4: Rank: 0 | Old parameters for member 0:
4: Rank: 0 | Old parameters for member 1:
4: Rank: 0 | Old parameters for member 2:
4: Performing data assimilation at time 0.12...
4: Rank: 0 | Old parameters for member 0:
4: Rank: 0 | Old parameters for member 1:
4: Rank: 0 | Old parameters for member 2:
4: Rank: 0 | Number expt sites mapped to DOFs: 1
4: Rank: 0 | Number expt sites mapped to DOFs: 1
4: 50% completed
4: 50% completed
4: Performing data assimilation at time 0.12...
4: Rank: 0 | Old parameters for member 0:
4: Rank: 0 | Old parameters for member 1:
4: Rank: 0 | Old parameters for member 2:
4: Performing data assimilation at time 0.12...
4: Rank: 0 | Old parameters for member 0:
4: Rank: 0 | Old parameters for member 1:
4: Rank: 0 | Old parameters for member 2:
4: Rank: 0 | Number expt sites mapped to DOFs: 1
4: Rank: 0 | Number expt sites mapped to DOFs: 1
4: Performing data assimilation at time 0.12...
4: Performing data assimilation at time 0.12...
4: Rank: 0 | Old parameters for member 0:
4: Rank: 0 | Old parameters for member 1:
4: Rank: 0 | Old parameters for member 2:
4: Rank: 0 | Old parameters for member 0:
4: Rank: 0 | Old parameters for member 1:
4: Rank: 0 | Old parameters for member 2:
4: Rank: 0 | Number expt sites mapped to DOFs: 1
4: Rank: 0 | Number expt sites mapped to DOFs: 1
4: Getting the perturbed innovation...
4: Applying the Kalman gain...
4: Getting the perturbed innovation...
4: Applying the Kalman gain...
4: Getting the perturbed innovation...
4: Applying the Kalman gain...
4: Getting the perturbed innovation...
4: Applying the Kalman gain...
4: Getting the perturbed innovation...
4: Applying the Kalman gain...
4: Getting the perturbed innovation...
4: Applying the Kalman gain...
4: Updating the ensemble members...
4: Done.
4: 60% completed
4: Updating the ensemble members...
4: Done.
4: 60% completed
4: Updating the ensemble members...
4: Updating the ensemble members...
4: Done.
4: 60% completed
4: Done.
4: 60% completed
4: 70% completed
4: 70% completed
4: Updating the ensemble members...
4: Done.
4: 60% completed
4: Updating the ensemble members...
4: Done.
4: 60% completed
4: 70% completed
4: 70% completed
4: 80% completed
4: 80% completed
4: 70% completed
4: 70% completed
4: 80% completed
4: 80% completed
4: 90% completed
4: 90% completed
4: 80% completed
4: 80% completed
4: 90% completed
4: 90% completed
4: 90% completed
4: 90% completed
4: 100% completed
4: 100% completed
4: 100% completed
4: 100% completed
4: 100% completed
4: [1;34;49m/var/jenkins/workspace/adamantine-nightly/tests/test_integration_da.cc(231): Leaving test case "integration_3D_da_ray_add_material"; testing time: 1793242us
4: [0;39;49m[1;34;49mLeaving test module "Integration_Data_Assimilation"; testing time: 41000352us
4: [0;39;49m
4: [1;32;49m*** No errors detected
4: [0;39;49m[1;34;49m/var/jenkins/workspace/adamantine-nightly/tests/test_integration_da.cc(231): Leaving test case "integration_3D_da_ray_add_material"; testing time: 1735342us
4: [0;39;49m[1;34;49mLeaving test module "Integration_Data_Assimilation"; testing time: 41001842us
4: [0;39;49m
4: [1;32;49m*** No errors detected
4: [0;39;49m100% completed
4: [1;34;49m/var/jenkins/workspace/adamantine-nightly/tests/test_integration_da.cc(231): Leaving test case "integration_3D_da_ray_add_material"; testing time: 1823558us
4: [0;39;49m[1;34;49mLeaving test module "Integration_Data_Assimilation"; testing time: 41023937us
4: [0;39;49m
4: [1;32;49m*** No errors detected
4: [0;39;49m[1;34;49m/var/jenkins/workspace/adamantine-nightly/tests/test_integration_da.cc(231): Leaving test case "integration_3D_da_ray_add_material"; testing time: 1738461us
4: [0;39;49m[1;34;49mLeaving test module "Integration_Data_Assimilation"; testing time: 41028376us
4: [0;39;49m
4: [1;32;49m*** No errors detected
4: [0;39;49m[1;34;49m/var/jenkins/workspace/adamantine-nightly/tests/test_integration_da.cc(231): Leaving test case "integration_3D_da_ray_add_material"; testing time: 1752435us
4: [0;39;49m[1;34;49mLeaving test module "Integration_Data_Assimilation"; testing time: 41031866us
4: [0;39;49m
4: [1;32;49m*** No errors detected
4: [0;39;49m[1;34;49m/var/jenkins/workspace/adamantine-nightly/tests/test_integration_da.cc(231): Leaving test case "integration_3D_da_ray_add_material"; testing time: 1788465us
4: [0;39;49m[1;34;49mLeaving test module "Integration_Data_Assimilation"; testing time: 41042039us
4: [0;39;49m
4: [1;32;49m*** No errors detected
4: [0;39;49m
46/48 Test #4: test_integration_da_6 .................... Passed 41.77 sec
test 7
Start 7: test_closest_source_point_adaptation_3
7: Test command: /usr/bin/mpiexec "-n" "3" "/var/jenkins/workspace/adamantine-nightly/build/bin/test_closest_source_point_adaptation"
7: Working Directory: /var/jenkins/workspace/adamantine-nightly/build/tests
7: Test timeout computed to be: 7200
7: Running 1 test case...
7: Running 1 test case...
7: Running 1 test case...
7: [1;34;49mEntering test module "ClosestSourcePointAdaptation"
7: [0;39;49m[1;34;49m/var/jenkins/workspace/adamantine-nightly/tests/test_closest_source_point_adaptation.cc(123): Entering test case "closest_source_point_adaptation"
7: [1;34;49mEntering test module "ClosestSourcePointAdaptation"
7: [0;39;49m[1;34;49m/var/jenkins/workspace/adamantine-nightly/tests/test_closest_source_point_adaptation.cc(123): Entering test case "closest_source_point_adaptation"
7: [1;34;49mEntering test module "ClosestSourcePointAdaptation"
7: [0;39;49m[1;34;49m/var/jenkins/workspace/adamantine-nightly/tests/test_closest_source_point_adaptation.cc(123): Entering test case "closest_source_point_adaptation"
7: [0;39;49m[1;34;49m/var/jenkins/workspace/adamantine-nightly/tests/test_closest_source_point_adaptation.cc(123): Leaving test case "closest_source_point_adaptation"; testing time: 5712847us
7: [0;39;49m[1;34;49mLeaving test module "ClosestSourcePointAdaptation"; testing time: 5712917us
7: [0;39;49m
7: [1;32;49m*** No errors detected
7: [0;39;49m[0;39;49m[1;34;49m/var/jenkins/workspace/adamantine-nightly/tests/test_closest_source_point_adaptation.cc(123): Leaving test case "closest_source_point_adaptation"; testing time: 5713020us
7:
7: [1;32;49m*** No errors detected
7: [0;39;49m[0;39;49m[1;34;49mLeaving test module "ClosestSourcePointAdaptation"; testing time: 5713070us
7: [0;39;49m[0;39;49m[1;34;49m/var/jenkins/workspace/adamantine-nightly/tests/test_closest_source_point_adaptation.cc(123): Leaving test case "closest_source_point_adaptation"; testing time: 5713390us
7: [0;39;49m[1;34;49mLeaving test module "ClosestSourcePointAdaptation"; testing time: 5713470us
7: [0;39;49m
7: [1;32;49m*** No errors detected
7: [0;39;49m
47/48 Test #7: test_closest_source_point_adaptation_3 ... Passed 6.33 sec
test 8
Start 8: test_closest_source_point_adaptation_6
8: Test command: /usr/bin/mpiexec "-n" "6" "/var/jenkins/workspace/adamantine-nightly/build/bin/test_closest_source_point_adaptation"
8: Working Directory: /var/jenkins/workspace/adamantine-nightly/build/tests
8: Test timeout computed to be: 7200
8: Running 1 test case...
8: Running 1 test case...
8: Running 1 test case...
8: Running 1 test case...
8: [1;34;49mEntering test module "ClosestSourcePointAdaptation"
8: [0;39;49m[1;34;49m/var/jenkins/workspace/adamantine-nightly/tests/test_closest_source_point_adaptation.cc(123): Entering test case "closest_source_point_adaptation"
8: [1;34;49mEntering test module "ClosestSourcePointAdaptation"
8: [1;34;49mEntering test module "ClosestSourcePointAdaptation"
8: [0;39;49m[1;34;49m/var/jenkins/workspace/adamantine-nightly/tests/test_closest_source_point_adaptation.cc(123): Entering test case "closest_source_point_adaptation"
8: [0;39;49m[1;34;49m/var/jenkins/workspace/adamantine-nightly/tests/test_closest_source_point_adaptation.cc(123): Entering test case "closest_source_point_adaptation"
8: Running 1 test case...
8: Running 1 test case...
8: [1;34;49mEntering test module "ClosestSourcePointAdaptation"
8: [1;34;49mEntering test module "ClosestSourcePointAdaptation"
8: [0;39;49m[1;34;49m/var/jenkins/workspace/adamantine-nightly/tests/test_closest_source_point_adaptation.cc(123): Entering test case "closest_source_point_adaptation"
8: [0;39;49m[1;34;49m/var/jenkins/workspace/adamantine-nightly/tests/test_closest_source_point_adaptation.cc(123): Entering test case "closest_source_point_adaptation"
8: [1;34;49mEntering test module "ClosestSourcePointAdaptation"
8: [0;39;49m[1;34;49m/var/jenkins/workspace/adamantine-nightly/tests/test_closest_source_point_adaptation.cc(123): Entering test case "closest_source_point_adaptation"
8: [0;39;49m[1;34;49m/var/jenkins/workspace/adamantine-nightly/tests/test_closest_source_point_adaptation.cc(123): Leaving test case "closest_source_point_adaptation"; testing time: 3602657us
8: [0;39;49m[1;34;49m/var/jenkins/workspace/adamantine-nightly/tests/test_closest_source_point_adaptation.cc(123): Leaving test case "closest_source_point_adaptation"; testing time: 3602638us
8: [0;39;49m[1;34;49mLeaving test module "ClosestSourcePointAdaptation"; testing time: 3602695us
8: [0;39;49m[0;39;49m[1;34;49m/var/jenkins/workspace/adamantine-nightly/tests/test_closest_source_point_adaptation.cc(123): Leaving test case "closest_source_point_adaptation"; testing time: 3602467us
8: [0;39;49m[1;34;49mLeaving test module "ClosestSourcePointAdaptation"; testing time: 3602532us
8: [0;39;49m[0;39;49m[1;34;49mLeaving test module "ClosestSourcePointAdaptation"; testing time: 3602724us
8: [0;39;49m
8: [1;32;49m*** No errors detected
8: [0;39;49m
8: [1;32;49m*** No errors detected
8: [0;39;49m
8: [1;32;49m*** No errors detected
8: [0;39;49m[0;39;49m[1;34;49m/var/jenkins/workspace/adamantine-nightly/tests/test_closest_source_point_adaptation.cc(123): Leaving test case "closest_source_point_adaptation"; testing time: 3602784us
8: [0;39;49m[1;34;49m/var/jenkins/workspace/adamantine-nightly/tests/test_closest_source_point_adaptation.cc(123): Leaving test case "closest_source_point_adaptation"; testing time: 3602512us
8: [0;39;49m[1;34;49mLeaving test module "ClosestSourcePointAdaptation"; testing time: 3602642us
8: [0;39;49m
8: [1;32;49m*** No errors detected
8: [0;39;49m[0;39;49m[1;34;49mLeaving test module "ClosestSourcePointAdaptation"; testing time: 3602947us
8: [0;39;49m
8: [1;32;49m*** No errors detected
8: [0;39;49m[0;39;49m[1;34;49m/var/jenkins/workspace/adamantine-nightly/tests/test_closest_source_point_adaptation.cc(123): Leaving test case "closest_source_point_adaptation"; testing time: 3603127us
8: [0;39;49m[1;34;49mLeaving test module "ClosestSourcePointAdaptation"; testing time: 3603208us
8: [0;39;49m
8: [1;32;49m*** No errors detected
8: [0;39;49m
48/48 Test #8: test_closest_source_point_adaptation_6 ... Passed 4.29 sec
The following tests passed:
test_closest_source_point_adaptation_1
test_data_assimilator_1
test_experimental_data_1
test_geometry_1
test_heat_source_1
test_integration_da_2
test_closest_source_point_adaptation_2
test_material_property_device_1
test_material_property_1
test_integration_da_1
test_post_processor_1
test_quaternion_1
test_scan_path_1
test_thermal_operator_1
test_thermal_operator_device_1
test_mechanical_operator_1
test_timer_1
test_utils_1
test_validate_input_database_1
test_integration_2d_1
test_integration_2d_device_1
test_thermal_physics_device_1
test_mechanical_physics_1
test_integration_3d_amr_1
test_integration_3d_amr_device_1
test_integration_da_augmented_1
test_material_deposition_1
test_microstructure_1
test_thermal_physics_1
test_ensemble_management_1
test_integration_3d_device_1
test_integration_2d_2
test_integration_2d_device_2
test_integration_3d_amr_2
test_integration_3d_amr_device_2
test_integration_da_augmented_2
test_material_deposition_2
test_microstructure_2
test_thermal_physics_2
test_ensemble_management_2
test_integration_thermoelastic_2
test_integration_da_3
test_integration_da_6
test_closest_source_point_adaptation_3
test_closest_source_point_adaptation_6
94% tests passed, 3 tests failed out of 48
Total Test time (real) = 10895.99 sec
The following tests FAILED:
31 - test_integration_3d_1 (Timeout)
32 - test_integration_3d_2 (Timeout)
39 - test_integration_thermoelastic_1 (Timeout)
Errors while running CTest
Output from these tests are in: /var/jenkins/workspace/adamantine-nightly/build/Testing/Temporary/LastTest.log
Use "--rerun-failed --output-on-failure" to re-run the failed cases verbosely.
[Pipeline] }
[Pipeline] // dir
Post stage
[Pipeline] xunit
INFO: Processing CTest-Version 3.x (default)
[Pipeline] }
[Pipeline] // withEnv
[Pipeline] }
$ docker stop --time=1 ddb9ed9741998bf92dc082f2df189dc80aa5bfb1bb4e59cdcfb8b31e61e542be
INFO: [CTest-Version 3.x (default)] - 1 test report file(s) were found with the pattern 'build/Testing/**/Test.xml' relative to '/var/jenkins/workspace/adamantine-nightly' for the testing framework 'CTest-Version 3.x (default)'.
$ docker rm -f --volumes ddb9ed9741998bf92dc082f2df189dc80aa5bfb1bb4e59cdcfb8b31e61e542be
[Pipeline] // withDockerContainer
[Pipeline] }
[Pipeline] // withEnv
[Pipeline] }
[Pipeline] // node
[Pipeline] }
[Pipeline] // stage
[Pipeline] }
Failed in branch CPU
40: 50% completed
40: 60% completed
40: 70% completed
40: 80% completed
40: 90% completed
40: 100% completed
40: [1;34;49m/var/jenkins/workspace/adamantine-nightly/tests/test_integration_thermoelastic.cc(19): Leaving test case "integration_thermoelastic"; testing time: 2696445442us
40: [0;39;49m[1;34;49m/var/jenkins/workspace/adamantine-nightly/tests/test_integration_thermoelastic.cc(47): Entering test case "integration_thermoelastic_add_material"
40: [1;34;49m/var/jenkins/workspace/adamantine-nightly/tests/test_integration_thermoelastic.cc(19): Leaving test case "integration_thermoelastic"; testing time: 2696333610us
40: [0;39;49m[1;34;49m/var/jenkins/workspace/adamantine-nightly/tests/test_integration_thermoelastic.cc(47): Entering test case "integration_thermoelastic_add_material"
40: [0;39;49m[0;39;49m10% completed
40: 20% completed
40: 30% completed
40: 40% completed
40: 50% completed
40: 60% completed
40: 70% completed
40: 80% completed
40: 90% completed
40: 100% completed
40:
40: [1;32;49m*** No errors detected
40: [0;39;49m[1;34;49m/var/jenkins/workspace/adamantine-nightly/tests/test_integration_thermoelastic.cc(47): Leaving test case "integration_thermoelastic_add_material"; testing time: 1365730703us
40: [0;39;49m[1;34;49mLeaving test module "Integration_Thermoelastic"; testing time: 4062178942us
40: [0;39;49m
40: [1;32;49m*** No errors detected
40: [0;39;49m[1;34;49m/var/jenkins/workspace/adamantine-nightly/tests/test_integration_thermoelastic.cc(47): Leaving test case "integration_thermoelastic_add_material"; testing time: 1365730311us
40: [0;39;49m[1;34;49mLeaving test module "Integration_Thermoelastic"; testing time: 4062067254us
40: [0;39;49m
44/48 Test #40: test_integration_thermoelastic_2 ......... Passed 4069.96 sec
test 3
Start 3: test_integration_da_3
3: Test command: /usr/bin/mpiexec "-n" "3" "/var/jenkins/workspace/adamantine-nightly/build/bin/test_integration_da"
3: Working Directory: /var/jenkins/workspace/adamantine-nightly/build/tests
3: Test timeout computed to be: 7200
3: Running 3 test cases...
3: [1;34;49mEntering test module "Integration_Data_Assimilation"
3: [0;39;49m[1;34;49m/var/jenkins/workspace/adamantine-nightly/tests/test_integration_da.cc(78): Entering test case "integration_data_assimilation"
3: Running 3 test cases...
3: [1;34;49mEntering test module "Integration_Data_Assimilation"
3: [0;39;49m[1;34;49m/var/jenkins/workspace/adamantine-nightly/tests/test_integration_da.cc(78): Entering test case "integration_data_assimilation"
3: Running 3 test cases...
3: [1;34;49mEntering test module "Integration_Data_Assimilation"
3: [0;39;49m[1;34;49m/var/jenkins/workspace/adamantine-nightly/tests/test_integration_da.cc(78): Entering test case "integration_data_assimilation"
3: [0;39;49mReading the experimental log file...
3: Done. Log entries found for 1 camera(s), with 2 frame(s).
3: Starting the main time stepping loop...
3: 10% completed
3: 20% completed
3: 30% completed
3: 40% completed
3: [0;39;49mRank: 1 | Old parameters for member 1:
3: Performing data assimilation at time 0.0211...
3: Rank: 0 | Old parameters for member 0:
3: [0;39;49mRank: 2 | Old parameters for member 2:
3: Rank: 1 | Number expt sites mapped to DOFs: 1
3: Rank: 0 | Number expt sites mapped to DOFs: 1
3: Rank: 2 | Number expt sites mapped to DOFs: 1
3: Getting the perturbed innovation...
3: Applying the Kalman gain...
3: Updating the ensemble members...
3: Done.
3: 50% completed
3: 60% completed
3: Performing data assimilation at time 0.0316...
3: Rank: 0 | Old parameters for member 0:
3: Rank: 1 | Old parameters for member 1:
3: Rank: 2 | Old parameters for member 2:
3: Rank: 0 | Number expt sites mapped to DOFs: 1
3: Rank: 1 | Number expt sites mapped to DOFs: 1
3: Rank: 2 | Number expt sites mapped to DOFs: 1
3: Getting the perturbed innovation...
3: Applying the Kalman gain...
3: Updating the ensemble members...
3: Done.
3: 70% completed
3: 80% completed
3: 90% completed
3: 100% completed
3: Reading the experimental log file...
3: Done. Log entries found for 1 camera(s), with 2 frame(s).
3: Reading the experimental log file...
3: Done. Log entries found for 1 camera(s), with 2 frame(s).
3: Reading the experimental log file...
3: Done. Log entries found for 1 camera(s), with 2 frame(s).
3: Starting the main time stepping loop...
3: Starting the main time stepping loop...
3: Starting the main time stepping loop...
3: 10% completed
3: 10% completed
3: 10% completed
3: 20% completed
3: 20% completed
3: 20% completed
3: 30% completed
3: 30% completed
3: 30% completed
3: 40% completed
3: 40% completed
3: 40% completed
3: Performing data assimilation at time 0.0211...
3: Rank: 0 | Old parameters for member 0:
3: Rank: 0 | Old parameters for member 1:
3: Rank: 0 | Old parameters for member 2:
3: Performing data assimilation at time 0.0211...
3: Rank: 0 | Old parameters for member 0:
3: Rank: 0 | Old parameters for member 1:
3: Rank: 0 | Old parameters for member 2:
3: Rank: 0 | Number expt sites mapped to DOFs: 1
3: Rank: 0 | Number expt sites mapped to DOFs: 1
3: Performing data assimilation at time 0.0211...
3: Rank: 0 | Old parameters for member 0:
3: Rank: 0 | Old parameters for member 1:
3: Rank: 0 | Old parameters for member 2:
3: Rank: 0 | Number expt sites mapped to DOFs: 1
3: Getting the perturbed innovation...
3: Applying the Kalman gain...
3: Getting the perturbed innovation...
3: Applying the Kalman gain...
3: Getting the perturbed innovation...
3: Applying the Kalman gain...
3: Updating the ensemble members...
3: Done.
3: Updating the ensemble members...
3: Done.
3: Updating the ensemble members...
3: Done.
3: 50% completed
3: 50% completed
3: 50% completed
3: 60% completed
3: 60% completed
3: 60% completed
3: Performing data assimilation at time 0.0316...
3: Rank: 0 | Old parameters for member 0:
3: Rank: 0 | Old parameters for member 1:
3: Rank: 0 | Old parameters for member 2:
3: Rank: 0 | Number expt sites mapped to DOFs: 1
3: Performing data assimilation at time 0.0316...
3: Rank: 0 | Old parameters for member 0:
3: Rank: 0 | Old parameters for member 1:
3: Rank: 0 | Old parameters for member 2:
3: Rank: 0 | Number expt sites mapped to DOFs: 1
3: Performing data assimilation at time 0.0316...
3: Rank: 0 | Old parameters for member 0:
3: Rank: 0 | Old parameters for member 1:
3: Rank: 0 | Old parameters for member 2:
3: Rank: 0 | Number expt sites mapped to DOFs: 1
3: Getting the perturbed innovation...
3: Applying the Kalman gain...
3: Getting the perturbed innovation...
3: Applying the Kalman gain...
3: Getting the perturbed innovation...
3: Applying the Kalman gain...
3: Updating the ensemble members...
3: Done.
3: Updating the ensemble members...
3: Done.
3: Updating the ensemble members...
3: Done.
3: 70% completed
3: 70% completed
3: 70% completed
3: 80% completed
3: 80% completed
3: 80% completed
3: 90% completed
3: 90% completed
3: 90% completed
3: 100% completed
3: 100% completed
3: [1;34;49m/var/jenkins/workspace/adamantine-nightly/tests/test_integration_da.cc(78): Leaving test case "integration_data_assimilation"; testing time: 62668068us
3: [0;39;49m[1;34;49m/var/jenkins/workspace/adamantine-nightly/tests/test_integration_da.cc(148): Entering test case "integration_3D_da_point_cloud_add_material"
3: [1;34;49m/var/jenkins/workspace/adamantine-nightly/tests/test_integration_da.cc(78): Leaving test case "integration_data_assimilation"; testing time: 62866537us
3: [0;39;49m[1;34;49m/var/jenkins/workspace/adamantine-nightly/tests/test_integration_da.cc(148): Entering test case "integration_3D_da_point_cloud_add_material"
3: 100% completed
3: [1;34;49m/var/jenkins/workspace/adamantine-nightly/tests/test_integration_da.cc(78): Leaving test case "integration_data_assimilation"; testing time: 63252809us
3: [0;39;49m[1;34;49m/var/jenkins/workspace/adamantine-nightly/tests/test_integration_da.cc(148): Entering test case "integration_3D_da_point_cloud_add_material"
3: [0;39;49mReading the experimental log file...
3: Done. Log entries found for 1 camera(s), with 1 frame(s).
3: Starting the main time stepping loop...
3: 10% completed
3: 20% completed
3: 30% completed
3: 40% completed
3: 50% completed
3: [0;39;49mRank: 1 | Old parameters for member 1:
3: Performing data assimilation at time 0.12...
3: Rank: 0 | Old parameters for member 0:
3: [0;39;49mRank: 2 | Old parameters for member 2:
3: Rank: 1 | Number expt sites mapped to DOFs: 1
3: Rank: 2 | Number expt sites mapped to DOFs: 1
3: Rank: 0 | Number expt sites mapped to DOFs: 1
3: Getting the perturbed innovation...
3: Applying the Kalman gain...
3: Updating the ensemble members...
3: Done.
3: 60% completed
3: 70% completed
3: 80% completed
3: 90% completed
3: 100% completed
3: Reading the experimental log file...
3: Done. Log entries found for 1 camera(s), with 1 frame(s).
3: Reading the experimental log file...
3: Done. Log entries found for 1 camera(s), with 1 frame(s).
3: Reading the experimental log file...
3: Done. Log entries found for 1 camera(s), with 1 frame(s).
3: Starting the main time stepping loop...
3: Starting the main time stepping loop...
3: Starting the main time stepping loop...
3: 10% completed
3: 10% completed
3: 10% completed
3: 20% completed
3: 20% completed
3: 20% completed
3: 30% completed
3: 30% completed
3: 30% completed
3: 40% completed
3: 40% completed
3: 40% completed
3: 50% completed
3: 50% completed
3: 50% completed
3: Performing data assimilation at time 0.12...
3: Rank: 0 | Old parameters for member 0:
3: Rank: 0 | Old parameters for member 1:
3: Rank: 0 | Old parameters for member 2:
3: Performing data assimilation at time 0.12...
3: Rank: 0 | Old parameters for member 0:
3: Rank: 0 | Old parameters for member 1:
3: Rank: 0 | Old parameters for member 2:
3: Performing data assimilation at time 0.12...
3: Rank: 0 | Old parameters for member 0:
3: Rank: 0 | Old parameters for member 1:
3: Rank: 0 | Old parameters for member 2:
3: Rank: 0 | Number expt sites mapped to DOFs: 1
3: Rank: 0 | Number expt sites mapped to DOFs: 1
3: Rank: 0 | Number expt sites mapped to DOFs: 1
3: Getting the perturbed innovation...
3: Applying the Kalman gain...
3: Getting the perturbed innovation...
3: Applying the Kalman gain...
3: Getting the perturbed innovation...
3: Applying the Kalman gain...
3: Updating the ensemble members...
3: Updating the ensemble members...
3: Done.
3: 60% completed
3: Done.
3: 60% completed
3: Updating the ensemble members...
3: Done.
3: 60% completed
3: 70% completed
3: 70% completed
3: 70% completed
3: 80% completed
3: 80% completed
3: 80% completed
3: 90% completed
3: 90% completed
3: 90% completed
3: 100% completed
3: 100% completed
3: 100% completed
3: [1;34;49m/var/jenkins/workspace/adamantine-nightly/tests/test_integration_da.cc(148): Leaving test case "integration_3D_da_point_cloud_add_material"; testing time: 3023444us
3: [0;39;49m[1;34;49m/var/jenkins/workspace/adamantine-nightly/tests/test_integration_da.cc(231): Entering test case "integration_3D_da_ray_add_material"
3: [1;34;49m/var/jenkins/workspace/adamantine-nightly/tests/test_integration_da.cc(148): Leaving test case "integration_3D_da_point_cloud_add_material"; testing time: 2441529us
3: [0;39;49m[1;34;49m/var/jenkins/workspace/adamantine-nightly/tests/test_integration_da.cc(231): Entering test case "integration_3D_da_ray_add_material"
3: [1;34;49m/var/jenkins/workspace/adamantine-nightly/tests/test_integration_da.cc(148): Leaving test case "integration_3D_da_point_cloud_add_material"; testing time: 2827016us
3: [0;39;49m[1;34;49m/var/jenkins/workspace/adamantine-nightly/tests/test_integration_da.cc(231): Entering test case "integration_3D_da_ray_add_material"
3: [0;39;49mReading the experimental log file...
3: Done. Log entries found for 1 camera(s), with 1 frame(s).
3: Starting the main time stepping loop...
3: 10% completed
3: 20% completed
3: 30% completed
3: 40% completed
3: 50% completed
3: [0;39;49mRank: 1 | Old parameters for member 1:
3: [0;39;49mRank: 2 | Old parameters for member 2:
3: Performing data assimilation at time 0.12...
3: Rank: 0 | Old parameters for member 0:
3: Rank: 1 | Number expt sites mapped to DOFs: 1
3: Rank: 2 | Number expt sites mapped to DOFs: 1
3: Rank: 0 | Number expt sites mapped to DOFs: 1
3: Getting the perturbed innovation...
3: Applying the Kalman gain...
3: Updating the ensemble members...
3: Done.
3: 60% completed
3: 70% completed
3: 80% completed
3: 90% completed
3: 100% completed
3: Reading the experimental log file...
3: Done. Log entries found for 1 camera(s), with 1 frame(s).
3: Reading the experimental log file...
3: Done. Log entries found for 1 camera(s), with 1 frame(s).
3: Reading the experimental log file...
3: Done. Log entries found for 1 camera(s), with 1 frame(s).
3: Starting the main time stepping loop...
3: Starting the main time stepping loop...
3: Starting the main time stepping loop...
3: 10% completed
3: 10% completed
3: 10% completed
3: 20% completed
3: 20% completed
3: 20% completed
3: 30% completed
3: 30% completed
3: 30% completed
3: 40% completed
3: 40% completed
3: 40% completed
3: 50% completed
3: 50% completed
3: 50% completed
3: Performing data assimilation at time 0.12...
3: Rank: 0 | Old parameters for member 0:
3: Rank: 0 | Old parameters for member 1:
3: Rank: 0 | Old parameters for member 2:
3: Performing data assimilation at time 0.12...
3: Rank: 0 | Old parameters for member 0:
3: Rank: 0 | Old parameters for member 1:
3: Rank: 0 | Old parameters for member 2:
3: Performing data assimilation at time 0.12...
3: Rank: 0 | Old parameters for member 0:
3: Rank: 0 | Old parameters for member 1:
3: Rank: 0 | Old parameters for member 2:
3: Rank: 0 | Number expt sites mapped to DOFs: 1
3: Rank: 0 | Number expt sites mapped to DOFs: 1
3: Rank: 0 | Number expt sites mapped to DOFs: 1
3: Getting the perturbed innovation...
3: Applying the Kalman gain...
3: Getting the perturbed innovation...
3: Applying the Kalman gain...
3: Getting the perturbed innovation...
3: Applying the Kalman gain...
3: Updating the ensemble members...
3: Updating the ensemble members...
3: Done.
3: 60% completed
3: Done.
3: 60% completed
3: Updating the ensemble members...
3: Done.
3: 60% completed
3: 70% completed
3: 70% completed
3: 70% completed
3: 80% completed
3: 80% completed
3: 80% completed
3: 90% completed
3: 90% completed
3: 90% completed
3: 100% completed
3: 100% completed
3: 100% completed
3: [1;34;49m/var/jenkins/workspace/adamantine-nightly/tests/test_integration_da.cc(231): Leaving test case "integration_3D_da_ray_add_material"; testing time: 2395434us
3: [0;39;49m[1;34;49mLeaving test module "Integration_Data_Assimilation"; testing time: 68087070us
3: [0;39;49m
3: [1;32;49m*** No errors detected
3: [0;39;49m[1;34;49m/var/jenkins/workspace/adamantine-nightly/tests/test_integration_da.cc(231): Leaving test case "integration_3D_da_ray_add_material"; testing time: 2407739us
3: [0;39;49m[1;34;49mLeaving test module "Integration_Data_Assimilation"; testing time: 68101412us
3: [0;39;49m
3: [1;32;49m*** No errors detected
3: [0;39;49m
3: [1;32;49m*** No errors detected
3: [0;39;49m[1;34;49m/var/jenkins/workspace/adamantine-nightly/tests/test_integration_da.cc(231): Leaving test case "integration_3D_da_ray_add_material"; testing time: 2416001us
3: [0;39;49m[1;34;49mLeaving test module "Integration_Data_Assimilation"; testing time: 68110464us
3: [0;39;49m
45/48 Test #3: test_integration_da_3 .................... Passed 69.46 sec
test 4
Start 4: test_integration_da_6
4: Test command: /usr/bin/mpiexec "-n" "6" "/var/jenkins/workspace/adamantine-nightly/build/bin/test_integration_da"
4: Working Directory: /var/jenkins/workspace/adamantine-nightly/build/tests
4: Test timeout computed to be: 7200
4: Running 3 test cases...
4: [1;34;49mEntering test module "Integration_Data_Assimilation"
4: [0;39;49m[1;34;49m/var/jenkins/workspace/adamantine-nightly/tests/test_integration_da.cc(78): Entering test case "integration_data_assimilation"
4: Running 3 test cases...
4: [1;34;49mEntering test module "Integration_Data_Assimilation"
4: [0;39;49m[1;34;49m/var/jenkins/workspace/adamantine-nightly/tests/test_integration_da.cc(78): Entering test case "integration_data_assimilation"
4: Running 3 test cases...
4: [1;34;49mEntering test module "Integration_Data_Assimilation"
4: [0;39;49m[1;34;49m/var/jenkins/workspace/adamantine-nightly/tests/test_integration_da.cc(78): Entering test case "integration_data_assimilation"
4: Running 3 test cases...
4: [1;34;49mEntering test module "Integration_Data_Assimilation"
4: [0;39;49m[1;34;49m/var/jenkins/workspace/adamantine-nightly/tests/test_integration_da.cc(78): Entering test case "integration_data_assimilation"
4: Running 3 test cases...
4: [1;34;49mEntering test module "Integration_Data_Assimilation"
4: [0;39;49m[1;34;49m/var/jenkins/workspace/adamantine-nightly/tests/test_integration_da.cc(78): Entering test case "integration_data_assimilation"
4: Running 3 test cases...
4: [1;34;49mEntering test module "Integration_Data_Assimilation"
4: [0;39;49m[1;34;49m/var/jenkins/workspace/adamantine-nightly/tests/test_integration_da.cc(78): Entering test case "integration_data_assimilation"
4: [0;39;49mReading the experimental log file...
4: Done. Log entries found for 1 camera(s), with 2 frame(s).
4: Starting the main time stepping loop...
4: 10% completed
4: 20% completed
4: 30% completed
4: 40% completed
4: Performing data assimilation at time 0.0211...
4: Rank: 0 | Old parameters for member 0:
4: [0;39;49mRank: 1 | Old parameters for member 0:
4: Rank: 0 | Number expt sites mapped to DOFs: 1
4: Rank: 1 | Number expt sites mapped to DOFs: 1
4: [0;39;49mRank: 2 | Old parameters for member 1:
4: [0;39;49mRank: 3 | Old parameters for member 1:
4: [0;39;49mRank: 5 | Old parameters for member 2:
4: [0;39;49mRank: 4 | Old parameters for member 2:
4: Rank: 3 | Number expt sites mapped to DOFs: 1
4: Rank: 2 | Number expt sites mapped to DOFs: 1
4: Rank: 4 | Number expt sites mapped to DOFs: 1
4: Rank: 5 | Number expt sites mapped to DOFs: 1
4: Getting the perturbed innovation...
4: Applying the Kalman gain...
4: Updating the ensemble members...
4: Done.
4: 50% completed
4: 60% completed
4: Rank: 1 | Old parameters for member 0:
4: Performing data assimilation at time 0.0316...
4: Rank: 0 | Old parameters for member 0:
4: Rank: 1 | Number expt sites mapped to DOFs: 1
4: Rank: 0 | Number expt sites mapped to DOFs: 1
4: Rank: 2 | Old parameters for member 1:
4: Rank: 3 | Old parameters for member 1:
4: Rank: 5 | Old parameters for member 2:
4: Rank: 4 | Old parameters for member 2:
4: Rank: 2 | Number expt sites mapped to DOFs: 1
4: Rank: 3 | Number expt sites mapped to DOFs: 1
4: Rank: 5 | Number expt sites mapped to DOFs: 1
4: Rank: 4 | Number expt sites mapped to DOFs: 1
4: Getting the perturbed innovation...
4: Applying the Kalman gain...
4: Updating the ensemble members...
4: Done.
4: 70% completed
4: 80% completed
4: 90% completed
4: 100% completed
4: Reading the experimental log file...
4: Done. Log entries found for 1 camera(s), with 2 frame(s).
4: Reading the experimental log file...
4: Done. Log entries found for 1 camera(s), with 2 frame(s).
4: Reading the experimental log file...
4: Done. Log entries found for 1 camera(s), with 2 frame(s).
4: Reading the experimental log file...
4: Done. Log entries found for 1 camera(s), with 2 frame(s).
4: Reading the experimental log file...
4: Done. Log entries found for 1 camera(s), with 2 frame(s).
4: Reading the experimental log file...
4: Done. Log entries found for 1 camera(s), with 2 frame(s).
4: Starting the main time stepping loop...
4: Starting the main time stepping loop...
4: Starting the main time stepping loop...
4: Starting the main time stepping loop...
4: Starting the main time stepping loop...
4: Starting the main time stepping loop...
4: 10% completed
4: 10% completed
4: 10% completed
4: 10% completed
4: 10% completed
4: 10% completed
4: 20% completed
4: 20% completed
4: 20% completed
4: 20% completed
4: 20% completed
4: 20% completed
4: 30% completed
4: 30% completed
4: 30% completed
4: 30% completed
4: 30% completed
4: 30% completed
4: 40% completed
4: 40% completed
4: 40% completed
4: 40% completed
4: 40% completed
4: 40% completed
4: Performing data assimilation at time 0.0211...
4: Rank: 0 | Old parameters for member 0:
4: Rank: 0 | Old parameters for member 1:
4: Rank: 0 | Old parameters for member 2:
4: Rank: 0 | Number expt sites mapped to DOFs: 1
4: Performing data assimilation at time 0.0211...
4: Rank: 0 | Old parameters for member 0:
4: Rank: 0 | Old parameters for member 1:
4: Rank: 0 | Old parameters for member 2:
4: Performing data assimilation at time 0.0211...
4: Rank: 0 | Old parameters for member 0:
4: Rank: 0 | Old parameters for member 1:
4: Rank: 0 | Old parameters for member 2:
4: Rank: 0 | Number expt sites mapped to DOFs: 1
4: Rank: 0 | Number expt sites mapped to DOFs: 1
4: Performing data assimilation at time 0.0211...
4: Rank: 0 | Old parameters for member 0:
4: Rank: 0 | Old parameters for member 1:
4: Rank: 0 | Old parameters for member 2:
4: Performing data assimilation at time 0.0211...
4: Rank: 0 | Old parameters for member 0:
4: Rank: 0 | Old parameters for member 1:
4: Rank: 0 | Old parameters for member 2:
4: Rank: 0 | Number expt sites mapped to DOFs: 1
4: Rank: 0 | Number expt sites mapped to DOFs: 1
4: Performing data assimilation at time 0.0211...
4: Rank: 0 | Old parameters for member 0:
4: Rank: 0 | Old parameters for member 1:
4: Rank: 0 | Old parameters for member 2:
4: Rank: 0 | Number expt sites mapped to DOFs: 1
4: Getting the perturbed innovation...
4: Applying the Kalman gain...
4: Getting the perturbed innovation...
4: Applying the Kalman gain...
4: Getting the perturbed innovation...
4: Applying the Kalman gain...
4: Getting the perturbed innovation...
4: Applying the Kalman gain...
4: Getting the perturbed innovation...
4: Applying the Kalman gain...
4: Getting the perturbed innovation...
4: Applying the Kalman gain...
4: Updating the ensemble members...
4: Done.
4: Updating the ensemble members...
4: Done.
4: Updating the ensemble members...
4: Done.
4: Updating the ensemble members...
4: Done.
4: Updating the ensemble members...
4: Done.
4: Updating the ensemble members...
4: Done.
4: 50% completed
4: 50% completed
4: 50% completed
4: 50% completed
4: 50% completed
4: 50% completed
4: 60% completed
4: 60% completed
4: 60% completed
4: 60% completed
4: 60% completed
4: 60% completed
4: Performing data assimilation at time 0.0316...
4: Rank: 0 | Old parameters for member 0:
4: Rank: 0 | Old parameters for member 1:
4: Rank: 0 | Old parameters for member 2:
4: Rank: 0 | Number expt sites mapped to DOFs: 1
4: Performing data assimilation at time 0.0316...
4: Rank: 0 | Old parameters for member 0:
4: Rank: 0 | Old parameters for member 1:
4: Rank: 0 | Old parameters for member 2:
4: Rank: 0 | Number expt sites mapped to DOFs: 1
4: Performing data assimilation at time 0.0316...
4: Rank: 0 | Old parameters for member 0:
4: Rank: 0 | Old parameters for member 1:
4: Rank: 0 | Old parameters for member 2:
4: Rank: 0 | Number expt sites mapped to DOFs: 1
4: Performing data assimilation at time 0.0316...
4: Rank: 0 | Old parameters for member 0:
4: Rank: 0 | Old parameters for member 1:
4: Rank: 0 | Old parameters for member 2:
4: Performing data assimilation at time 0.0316...
4: Rank: 0 | Old parameters for member 0:
4: Rank: 0 | Old parameters for member 1:
4: Rank: 0 | Old parameters for member 2:
4: Rank: 0 | Number expt sites mapped to DOFs: 1
4: Rank: 0 | Number expt sites mapped to DOFs: 1
4: Performing data assimilation at time 0.0316...
4: Rank: 0 | Old parameters for member 0:
4: Rank: 0 | Old parameters for member 1:
4: Rank: 0 | Old parameters for member 2:
4: Rank: 0 | Number expt sites mapped to DOFs: 1
4: Getting the perturbed innovation...
4: Applying the Kalman gain...
4: Getting the perturbed innovation...
4: Applying the Kalman gain...
4: Getting the perturbed innovation...
4: Applying the Kalman gain...
4: Getting the perturbed innovation...
4: Applying the Kalman gain...
4: Getting the perturbed innovation...
4: Applying the Kalman gain...
4: Getting the perturbed innovation...
4: Applying the Kalman gain...
4: Updating the ensemble members...
4: Done.
4: Updating the ensemble members...
4: Done.
4: Updating the ensemble members...
4: Done.
4: Updating the ensemble members...
4: Done.
4: Updating the ensemble members...
4: Done.
4: Updating the ensemble members...
4: Done.
4: 70% completed
4: 70% completed
4: 70% completed
4: 70% completed
4: 70% completed
4: 70% completed
4: 80% completed
4: 80% completed
4: 80% completed
4: 80% completed
4: 80% completed
4: 80% completed
4: 90% completed
4: 90% completed
4: 90% completed
4: 90% completed
4: 90% completed
4: 90% completed
4: 100% completed
4: [1;34;49m/var/jenkins/workspace/adamantine-nightly/tests/test_integration_da.cc(78): Leaving test case "integration_data_assimilation"; testing time: 57210356us
4: [0;39;49m[1;34;49m/var/jenkins/workspace/adamantine-nightly/tests/test_integration_da.cc(148): Entering test case "integration_3D_da_point_cloud_add_material"
4: 100% completed
4: 100% completed
4: 100% completed
4: 100% completed
4: [1;34;49m/var/jenkins/workspace/adamantine-nightly/tests/test_integration_da.cc(78): Leaving test case "integration_data_assimilation"; testing time: 57425723us
4: [0;39;49m[1;34;49m/var/jenkins/workspace/adamantine-nightly/tests/test_integration_da.cc(148): Entering test case "integration_3D_da_point_cloud_add_material"
4: 100% completed
4: [1;34;49m/var/jenkins/workspace/adamantine-nightly/tests/test_integration_da.cc(78): Leaving test case "integration_data_assimilation"; testing time: 57622817us
4: [0;39;49m[1;34;49m/var/jenkins/workspace/adamantine-nightly/tests/test_integration_da.cc(148): Entering test case "integration_3D_da_point_cloud_add_material"
4: [1;34;49m/var/jenkins/workspace/adamantine-nightly/tests/test_integration_da.cc(78): Leaving test case "integration_data_assimilation"; testing time: 57616132us
4: [0;39;49m[1;34;49m/var/jenkins/workspace/adamantine-nightly/tests/test_integration_da.cc(148): Entering test case "integration_3D_da_point_cloud_add_material"
4: [1;34;49m/var/jenkins/workspace/adamantine-nightly/tests/test_integration_da.cc(78): Leaving test case "integration_data_assimilation"; testing time: 57676516us
4: [0;39;49m[1;34;49m/var/jenkins/workspace/adamantine-nightly/tests/test_integration_da.cc(148): Entering test case "integration_3D_da_point_cloud_add_material"
4: [1;34;49m/var/jenkins/workspace/adamantine-nightly/tests/test_integration_da.cc(78): Leaving test case "integration_data_assimilation"; testing time: 57785951us
4: [0;39;49m[1;34;49m/var/jenkins/workspace/adamantine-nightly/tests/test_integration_da.cc(148): Entering test case "integration_3D_da_point_cloud_add_material"
4: [0;39;49mReading the experimental log file...
4: Done. Log entries found for 1 camera(s), with 1 frame(s).
4: Starting the main time stepping loop...
4: 10% completed
4: 20% completed
4: 30% completed
4: 40% completed
4: 50% completed
4: [0;39;49mRank: 4 | Old parameters for member 2:
4: [0;39;49mRank: 5 | Old parameters for member 2:
4: [0;39;49mRank: 3 | Old parameters for member 1:
4: [0;39;49mRank: 2 | Old parameters for member 1:
4: Rank: 4 | Number expt sites mapped to DOFs: 1
4: Rank: 5 | Number expt sites mapped to DOFs: 1
4: Performing data assimilation at time 0.12...
4: Rank: 0 | Old parameters for member 0:
4: [0;39;49mRank: 1 | Old parameters for member 0:
4: Rank: 3 | Number expt sites mapped to DOFs: 1
4: Rank: 2 | Number expt sites mapped to DOFs: 1
4: Rank: 0 | Number expt sites mapped to DOFs: 1
4: Rank: 1 | Number expt sites mapped to DOFs: 1
4: Getting the perturbed innovation...
4: Applying the Kalman gain...
4: Updating the ensemble members...
4: Done.
4: 60% completed
4: 70% completed
4: 80% completed
4: 90% completed
4: 100% completed
4: Reading the experimental log file...
4: Done. Log entries found for 1 camera(s), with 1 frame(s).
4: Reading the experimental log file...
4: Done. Log entries found for 1 camera(s), with 1 frame(s).
4: Reading the experimental log file...
4: Done. Log entries found for 1 camera(s), with 1 frame(s).
4: Reading the experimental log file...
4: Done. Log entries found for 1 camera(s), with 1 frame(s).
4: Reading the experimental log file...
4: Done. Log entries found for 1 camera(s), with 1 frame(s).
4: Reading the experimental log file...
4: Done. Log entries found for 1 camera(s), with 1 frame(s).
4: Starting the main time stepping loop...
4: Starting the main time stepping loop...
4: Starting the main time stepping loop...
4: Starting the main time stepping loop...
4: Starting the main time stepping loop...
4: Starting the main time stepping loop...
4: 10% completed
4: 10% completed
4: 10% completed
4: 10% completed
4: 10% completed
4: 10% completed
4: 20% completed
4: 20% completed
4: 20% completed
4: 20% completed
4: 20% completed
4: 20% completed
4: 30% completed
4: 30% completed
4: 30% completed
4: 30% completed
4: 30% completed
4: 30% completed
4: 40% completed
4: 40% completed
4: 40% completed
4: 40% completed
4: 40% completed
4: 40% completed
4: 50% completed
4: 50% completed
4: 50% completed
4: 50% completed
4: 50% completed
4: 50% completed
4: Performing data assimilation at time 0.12...
4: Rank: 0 | Old parameters for member 0:
4: Rank: 0 | Old parameters for member 1:
4: Rank: 0 | Old parameters for member 2:
4: Rank: 0 | Number expt sites mapped to DOFs: 1
4: Performing data assimilation at time 0.12...
4: Rank: 0 | Old parameters for member 0:
4: Rank: 0 | Old parameters for member 1:
4: Rank: 0 | Old parameters for member 2:
4: Performing data assimilation at time 0.12...
4: Rank: 0 | Old parameters for member 0:
4: Rank: 0 | Old parameters for member 1:
4: Rank: 0 | Old parameters for member 2:
4: Rank: 0 | Number expt sites mapped to DOFs: 1
4: Rank: 0 | Number expt sites mapped to DOFs: 1
4: Performing data assimilation at time 0.12...
4: Rank: 0 | Old parameters for member 0:
4: Rank: 0 | Old parameters for member 1:
4: Rank: 0 | Old parameters for member 2:
4: Performing data assimilation at time 0.12...
4: Rank: 0 | Old parameters for member 0:
4: Rank: 0 | Old parameters for member 1:
4: Rank: 0 | Old parameters for member 2:
4: Performing data assimilation at time 0.12...
4: Rank: 0 | Old parameters for member 0:
4: Rank: 0 | Old parameters for member 1:
4: Rank: 0 | Old parameters for member 2:
4: Rank: 0 | Number expt sites mapped to DOFs: 1
4: Rank: 0 | Number expt sites mapped to DOFs: 1
4: Rank: 0 | Number expt sites mapped to DOFs: 1
4: Getting the perturbed innovation...
4: Applying the Kalman gain...
4: Getting the perturbed innovation...
4: Applying the Kalman gain...
4: Getting the perturbed innovation...
4: Applying the Kalman gain...
4: Getting the perturbed innovation...
4: Applying the Kalman gain...
4: Getting the perturbed innovation...
4: Applying the Kalman gain...
4: Getting the perturbed innovation...
4: Applying the Kalman gain...
4: Updating the ensemble members...
4: Done.
4: 60% completed
4: Updating the ensemble members...
4: Done.
4: 60% completed
4: Updating the ensemble members...
4: Done.
4: 60% completed
4: Updating the ensemble members...
4: Updating the ensemble members...
4: Done.
4: 60% completed
4: Done.
4: 60% completed
4: 70% completed
4: Updating the ensemble members...
4: Done.
4: 60% completed
4: 70% completed
4: 70% completed
4: 70% completed
4: 70% completed
4: 80% completed
4: 70% completed
4: 80% completed
4: 80% completed
4: 80% completed
4: 90% completed
4: 80% completed
4: 80% completed
4: 90% completed
4: 90% completed
4: 90% completed
4: 90% completed
4: 90% completed
4: 100% completed
4: 100% completed
4: 100% completed
4: 100% completed
4: [1;34;49m/var/jenkins/workspace/adamantine-nightly/tests/test_integration_da.cc(148): Leaving test case "integration_3D_da_point_cloud_add_material"; testing time: 2464413us
4: [0;39;49m[1;34;49m/var/jenkins/workspace/adamantine-nightly/tests/test_integration_da.cc(231): Entering test case "integration_3D_da_ray_add_material"
4: 100% completed
4: 100% completed
4: [1;34;49m/var/jenkins/workspace/adamantine-nightly/tests/test_integration_da.cc(148): Leaving test case "integration_3D_da_point_cloud_add_material"; testing time: 2480792us
4: [0;39;49m[1;34;49m/var/jenkins/workspace/adamantine-nightly/tests/test_integration_da.cc(231): Entering test case "integration_3D_da_ray_add_material"
4: [1;34;49m/var/jenkins/workspace/adamantine-nightly/tests/test_integration_da.cc(148): Leaving test case "integration_3D_da_point_cloud_add_material"; testing time: 2903150us
4: [0;39;49m[1;34;49m/var/jenkins/workspace/adamantine-nightly/tests/test_integration_da.cc(231): Entering test case "integration_3D_da_ray_add_material"
4: [1;34;49m/var/jenkins/workspace/adamantine-nightly/tests/test_integration_da.cc(148): Leaving test case "integration_3D_da_point_cloud_add_material"; testing time: 2343603us
4: [0;39;49m[1;34;49m/var/jenkins/workspace/adamantine-nightly/tests/test_integration_da.cc(231): Entering test case "integration_3D_da_ray_add_material"
4: [1;34;49m/var/jenkins/workspace/adamantine-nightly/tests/test_integration_da.cc(148): Leaving test case "integration_3D_da_point_cloud_add_material"; testing time: 2714862us
4: [0;39;49m[1;34;49m/var/jenkins/workspace/adamantine-nightly/tests/test_integration_da.cc(231): Entering test case "integration_3D_da_ray_add_material"
4: [1;34;49m/var/jenkins/workspace/adamantine-nightly/tests/test_integration_da.cc(148): Leaving test case "integration_3D_da_point_cloud_add_material"; testing time: 2474096us
4: [0;39;49m[1;34;49m/var/jenkins/workspace/adamantine-nightly/tests/test_integration_da.cc(231): Entering test case "integration_3D_da_ray_add_material"
4: [0;39;49mReading the experimental log file...
4: Done. Log entries found for 1 camera(s), with 1 frame(s).
4: Starting the main time stepping loop...
4: 10% completed
4: 20% completed
4: 30% completed
4: 40% completed
4: 50% completed
4: [0;39;49mRank: 3 | Old parameters for member 1:
4: [0;39;49mRank: 2 | Old parameters for member 1:
4: [0;39;49mRank: 4 | Old parameters for member 2:
4: [0;39;49mRank: 5 | Old parameters for member 2:
4: Rank: 2 | Number expt sites mapped to DOFs: 1
4: Rank: 3 | Number expt sites mapped to DOFs: 1
4: Performing data assimilation at time 0.12...
4: Rank: 0 | Old parameters for member 0:
4: [0;39;49mRank: 1 | Old parameters for member 0:
4: Rank: 4 | Number expt sites mapped to DOFs: 1
4: Rank: 5 | Number expt sites mapped to DOFs: 1
4: Rank: 0 | Number expt sites mapped to DOFs: 1
4: Rank: 1 | Number expt sites mapped to DOFs: 1
4: Getting the perturbed innovation...
4: Applying the Kalman gain...
4: Updating the ensemble members...
4: Done.
4: 60% completed
4: 70% completed
4: 80% completed
4: 90% completed
4: 100% completed
4: Reading the experimental log file...
4: Done. Log entries found for 1 camera(s), with 1 frame(s).
4: Reading the experimental log file...
4: Done. Log entries found for 1 camera(s), with 1 frame(s).
4: Reading the experimental log file...
4: Done. Log entries found for 1 camera(s), with 1 frame(s).
4: Reading the experimental log file...
4: Done. Log entries found for 1 camera(s), with 1 frame(s).
4: Reading the experimental log file...
4: Done. Log entries found for 1 camera(s), with 1 frame(s).
4: Reading the experimental log file...
4: Done. Log entries found for 1 camera(s), with 1 frame(s).
4: Starting the main time stepping loop...
4: Starting the main time stepping loop...
4: Starting the main time stepping loop...
4: Starting the main time stepping loop...
4: Starting the main time stepping loop...
4: Starting the main time stepping loop...
4: 10% completed
4: 10% completed
4: 10% completed
4: 10% completed
4: 10% completed
4: 10% completed
4: 20% completed
4: 20% completed
4: 20% completed
4: 20% completed
4: 20% completed
4: 20% completed
4: 30% completed
4: 30% completed
4: 30% completed
4: 30% completed
4: 30% completed
4: 30% completed
4: 40% completed
4: 40% completed
4: 40% completed
4: 40% completed
4: 40% completed
4: 40% completed
4: 50% completed
4: 50% completed
4: 50% completed
4: 50% completed
4: 50% completed
4: 50% completed
4: Performing data assimilation at time 0.12...
4: Rank: 0 | Old parameters for member 0:
4: Rank: 0 | Old parameters for member 1:
4: Rank: 0 | Old parameters for member 2:
4: Performing data assimilation at time 0.12...
4: Rank: 0 | Old parameters for member 0:
4: Rank: 0 | Old parameters for member 1:
4: Rank: 0 | Old parameters for member 2:
4: Rank: 0 | Number expt sites mapped to DOFs: 1
4: Rank: 0 | Number expt sites mapped to DOFs: 1
4: Performing data assimilation at time 0.12...
4: Rank: 0 | Old parameters for member 0:
4: Rank: 0 | Old parameters for member 1:
4: Rank: 0 | Old parameters for member 2:
4: Performing data assimilation at time 0.12...
4: Rank: 0 | Old parameters for member 0:
4: Rank: 0 | Old parameters for member 1:
4: Rank: 0 | Old parameters for member 2:
4: Rank: 0 | Number expt sites mapped to DOFs: 1
4: Rank: 0 | Number expt sites mapped to DOFs: 1
4: Performing data assimilation at time 0.12...
4: Rank: 0 | Old parameters for member 0:
4: Rank: 0 | Old parameters for member 1:
4: Rank: 0 | Old parameters for member 2:
4: Performing data assimilation at time 0.12...
4: Rank: 0 | Old parameters for member 0:
4: Rank: 0 | Old parameters for member 1:
4: Rank: 0 | Old parameters for member 2:
4: Rank: 0 | Number expt sites mapped to DOFs: 1
4: Rank: 0 | Number expt sites mapped to DOFs: 1
4: Getting the perturbed innovation...
4: Applying the Kalman gain...
4: Getting the perturbed innovation...
4: Applying the Kalman gain...
4: Getting the perturbed innovation...
4: Applying the Kalman gain...
4: Getting the perturbed innovation...
4: Applying the Kalman gain...
4: Getting the perturbed innovation...
4: Applying the Kalman gain...
4: Getting the perturbed innovation...
4: Applying the Kalman gain...
4: Updating the ensemble members...
4: Done.
4: 60% completed
4: Updating the ensemble members...
4: Done.
4: 60% completed
4: Updating the ensemble members...
4: Done.
4: 60% completed
4: Updating the ensemble members...
4: Updating the ensemble members...
4: Done.
4: 60% completed
4: Done.
4: 60% completed
4: Updating the ensemble members...
4: Done.
4: 60% completed
4: 70% completed
4: 70% completed
4: 70% completed
4: 70% completed
4: 70% completed
4: 70% completed
4: 80% completed
4: 80% completed
4: 80% completed
4: 80% completed
4: 80% completed
4: 80% completed
4: 90% completed
4: 90% completed
4: 90% completed
4: 90% completed
4: 90% completed
4: 90% completed
4: 100% completed
4: 100% completed
4: 100% completed
4: 100% completed
4: 100% completed
4: 100% completed
4:
4: [1;32;49m*** No errors detected
4: [0;39;49m[1;34;49m/var/jenkins/workspace/adamantine-nightly/tests/test_integration_da.cc(231): Leaving test case "integration_3D_da_ray_add_material"; testing time: 2415943us
4: [0;39;49m[1;34;49mLeaving test module "Integration_Data_Assimilation"; testing time: 62529585us
4: [0;39;49m
4: [1;32;49m*** No errors detected
4: [0;39;49m[1;34;49m/var/jenkins/workspace/adamantine-nightly/tests/test_integration_da.cc(231): Leaving test case "integration_3D_da_ray_add_material"; testing time: 2437178us
4: [0;39;49m[1;34;49mLeaving test module "Integration_Data_Assimilation"; testing time: 62517855us
4: [0;39;49m
4: [1;32;49m*** No errors detected
4: [0;39;49m[1;34;49m/var/jenkins/workspace/adamantine-nightly/tests/test_integration_da.cc(231): Leaving test case "integration_3D_da_ray_add_material"; testing time: 2381316us
4: [0;39;49m[1;34;49mLeaving test module "Integration_Data_Assimilation"; testing time: 62532086us
4: [0;39;49m
4: [1;32;49m*** No errors detected
4: [0;39;49m[1;34;49m/var/jenkins/workspace/adamantine-nightly/tests/test_integration_da.cc(231): Leaving test case "integration_3D_da_ray_add_material"; testing time: 2398757us
4: [0;39;49m[1;34;49mLeaving test module "Integration_Data_Assimilation"; testing time: 62528468us
4: [0;39;49m
4: [1;32;49m*** No errors detected
4: [0;39;49m[1;34;49m/var/jenkins/workspace/adamantine-nightly/tests/test_integration_da.cc(231): Leaving test case "integration_3D_da_ray_add_material"; testing time: 2425772us
4: [0;39;49m[1;34;49mLeaving test module "Integration_Data_Assimilation"; testing time: 62529540us
4: [0;39;49m
4: [1;32;49m*** No errors detected
4: [0;39;49m[1;34;49m/var/jenkins/workspace/adamantine-nightly/tests/test_integration_da.cc(231): Leaving test case "integration_3D_da_ray_add_material"; testing time: 2389135us
4: [0;39;49m[1;34;49mLeaving test module "Integration_Data_Assimilation"; testing time: 62529856us
4: [0;39;49m
46/48 Test #4: test_integration_da_6 .................... Passed 64.47 sec
test 7
Start 7: test_closest_source_point_adaptation_3
7: Test command: /usr/bin/mpiexec "-n" "3" "/var/jenkins/workspace/adamantine-nightly/build/bin/test_closest_source_point_adaptation"
7: Working Directory: /var/jenkins/workspace/adamantine-nightly/build/tests
7: Test timeout computed to be: 7200
7: Running 1 test case...
7: [1;34;49mEntering test module "ClosestSourcePointAdaptation"
7: [0;39;49m[1;34;49m/var/jenkins/workspace/adamantine-nightly/tests/test_closest_source_point_adaptation.cc(123): Entering test case "closest_source_point_adaptation"
7: Running 1 test case...
7: [1;34;49mEntering test module "ClosestSourcePointAdaptation"
7: [0;39;49m[1;34;49m/var/jenkins/workspace/adamantine-nightly/tests/test_closest_source_point_adaptation.cc(123): Entering test case "closest_source_point_adaptation"
7: Running 1 test case...
7: [1;34;49mEntering test module "ClosestSourcePointAdaptation"
7: [0;39;49m[1;34;49m/var/jenkins/workspace/adamantine-nightly/tests/test_closest_source_point_adaptation.cc(123): Entering test case "closest_source_point_adaptation"
7: [0;39;49m[1;34;49m/var/jenkins/workspace/adamantine-nightly/tests/test_closest_source_point_adaptation.cc(123): Leaving test case "closest_source_point_adaptation"; testing time: 7038520us
7: [0;39;49m[1;34;49mLeaving test module "ClosestSourcePointAdaptation"; testing time: 7038565us
7: [0;39;49m
7: [1;32;49m*** No errors detected
7: [0;39;49m
7: [1;32;49m*** No errors detected
7: [0;39;49m[0;39;49m[1;34;49m/var/jenkins/workspace/adamantine-nightly/tests/test_closest_source_point_adaptation.cc(123): Leaving test case "closest_source_point_adaptation"; testing time: 7027695us
7: [0;39;49m[1;34;49mLeaving test module "ClosestSourcePointAdaptation"; testing time: 7027748us
7: [0;39;49m[0;39;49m[1;34;49m/var/jenkins/workspace/adamantine-nightly/tests/test_closest_source_point_adaptation.cc(123): Leaving test case "closest_source_point_adaptation"; testing time: 7029231us
7: [0;39;49m[1;34;49mLeaving test module "ClosestSourcePointAdaptation"; testing time: 7029311us
7: [0;39;49m
7: [1;32;49m*** No errors detected
7: [0;39;49m
47/48 Test #7: test_closest_source_point_adaptation_3 ... Passed 8.34 sec
test 8
Start 8: test_closest_source_point_adaptation_6
8: Test command: /usr/bin/mpiexec "-n" "6" "/var/jenkins/workspace/adamantine-nightly/build/bin/test_closest_source_point_adaptation"
8: Working Directory: /var/jenkins/workspace/adamantine-nightly/build/tests
8: Test timeout computed to be: 7200
8: Running 1 test case...
8: [1;34;49mEntering test module "ClosestSourcePointAdaptation"
8: [0;39;49m[1;34;49m/var/jenkins/workspace/adamantine-nightly/tests/test_closest_source_point_adaptation.cc(123): Entering test case "closest_source_point_adaptation"
8: Running 1 test case...
8: [1;34;49mEntering test module "ClosestSourcePointAdaptation"
8: [0;39;49m[1;34;49m/var/jenkins/workspace/adamantine-nightly/tests/test_closest_source_point_adaptation.cc(123): Entering test case "closest_source_point_adaptation"
8: Running 1 test case...
8: [1;34;49mEntering test module "ClosestSourcePointAdaptation"
8: [0;39;49m[1;34;49m/var/jenkins/workspace/adamantine-nightly/tests/test_closest_source_point_adaptation.cc(123): Entering test case "closest_source_point_adaptation"
8: Running 1 test case...
8: [1;34;49mEntering test module "ClosestSourcePointAdaptation"
8: [0;39;49m[1;34;49m/var/jenkins/workspace/adamantine-nightly/tests/test_closest_source_point_adaptation.cc(123): Entering test case "closest_source_point_adaptation"
8: Running 1 test case...
8: [1;34;49mEntering test module "ClosestSourcePointAdaptation"
8: [0;39;49m[1;34;49m/var/jenkins/workspace/adamantine-nightly/tests/test_closest_source_point_adaptation.cc(123): Entering test case "closest_source_point_adaptation"
8: Running 1 test case...
8: [1;34;49mEntering test module "ClosestSourcePointAdaptation"
8: [0;39;49m[1;34;49m/var/jenkins/workspace/adamantine-nightly/tests/test_closest_source_point_adaptation.cc(123): Entering test case "closest_source_point_adaptation"
8: [0;39;49m[1;34;49m/var/jenkins/workspace/adamantine-nightly/tests/test_closest_source_point_adaptation.cc(123): Leaving test case "closest_source_point_adaptation"; testing time: 4490802us
8: [0;39;49m[1;34;49mLeaving test module "ClosestSourcePointAdaptation"; testing time: 4490847us
8: [0;39;49m[0;39;49m[1;34;49m/var/jenkins/workspace/adamantine-nightly/tests/test_closest_source_point_adaptation.cc(123): Leaving test case "closest_source_point_adaptation"; testing time: 4475413us
8: [0;39;49m[1;34;49mLeaving test module "ClosestSourcePointAdaptation"; testing time: 4475464us
8: [0;39;49m
8: [1;32;49m*** No errors detected
8: [0;39;49m
8: [1;32;49m*** No errors detected
8: [0;39;49m[0;39;49m[1;34;49m/var/jenkins/workspace/adamantine-nightly/tests/test_closest_source_point_adaptation.cc(123): Leaving test case "closest_source_point_adaptation"; testing time: 4442959us
8: [0;39;49m[1;34;49mLeaving test module "ClosestSourcePointAdaptation"; testing time: 4443024us
8: [0;39;49m
8: [1;32;49m*** No errors detected
8: [0;39;49m
8: [1;32;49m*** No errors detected
8: [0;39;49m
8: [1;32;49m*** No errors detected
8: [0;39;49m[0;39;49m[1;34;49m/var/jenkins/workspace/adamantine-nightly/tests/test_closest_source_point_adaptation.cc(123): Leaving test case "closest_source_point_adaptation"; testing time: 4458480us
8: [0;39;49m[1;34;49mLeaving test module "ClosestSourcePointAdaptation"; testing time: 4458547us
8: [0;39;49m[1;34;49m/var/jenkins/workspace/adamantine-nightly/tests/test_closest_source_point_adaptation.cc(123): Leaving test case "closest_source_point_adaptation"; testing time: 4470727us
8: [0;39;49m[1;34;49mLeaving test module "ClosestSourcePointAdaptation"; testing time: 4470785us
8: [0;39;49m[0;39;49m[0;39;49m[1;34;49m/var/jenkins/workspace/adamantine-nightly/tests/test_closest_source_point_adaptation.cc(123): Leaving test case "closest_source_point_adaptation"; testing time: 4442110us
8:
8: [1;32;49m*** No errors detected
8: [0;39;49m[1;34;49mLeaving test module "ClosestSourcePointAdaptation"; testing time: 4442173us
8: [0;39;49m[0;39;49m
48/48 Test #8: test_closest_source_point_adaptation_6 ... Passed 6.38 sec
The following tests passed:
test_closest_source_point_adaptation_1
test_data_assimilator_1
test_experimental_data_1
test_geometry_1
test_heat_source_1
test_integration_da_2
test_closest_source_point_adaptation_2
test_material_property_device_1
test_material_property_1
test_integration_da_1
test_post_processor_1
test_quaternion_1
test_scan_path_1
test_mechanical_operator_1
test_thermal_operator_1
test_thermal_operator_device_1
test_timer_1
test_utils_1
test_validate_input_database_1
test_integration_2d_1
test_integration_2d_device_1
test_mechanical_physics_1
test_thermal_physics_device_1
test_integration_3d_amr_device_1
test_integration_3d_amr_1
test_integration_da_augmented_1
test_material_deposition_1
test_microstructure_1
test_thermal_physics_1
test_ensemble_management_1
test_integration_3d_device_1
test_integration_2d_2
test_integration_2d_device_2
test_integration_3d_amr_2
test_integration_3d_amr_device_2
test_integration_da_augmented_2
test_material_deposition_2
test_microstructure_2
test_thermal_physics_2
test_ensemble_management_2
test_integration_thermoelastic_2
test_integration_da_3
test_integration_da_6
test_closest_source_point_adaptation_3
test_closest_source_point_adaptation_6
94% tests passed, 3 tests failed out of 48
Total Test time (real) = 12814.05 sec
The following tests FAILED:
31 - test_integration_3d_1 (Timeout)
32 - test_integration_3d_2 (Timeout)
39 - test_integration_thermoelastic_1 (Timeout)
Errors while running CTest
Output from these tests are in: /var/jenkins/workspace/adamantine-nightly/build/Testing/Temporary/LastTest.log
Use "--rerun-failed --output-on-failure" to re-run the failed cases verbosely.
[Pipeline] }
[Pipeline] // dir
Post stage
[Pipeline] xunit
INFO: Processing CTest-Version 3.x (default)
[Pipeline] }
[Pipeline] // withEnv
[Pipeline] }
$ docker stop --time=1 12c6d510c3d0117c91341844c9ad79a95076d2a87f50d368c28c6f43da04e172
INFO: [CTest-Version 3.x (default)] - 1 test report file(s) were found with the pattern 'build/Testing/**/Test.xml' relative to '/var/jenkins/workspace/adamantine-nightly' for the testing framework 'CTest-Version 3.x (default)'.
$ docker rm -f --volumes 12c6d510c3d0117c91341844c9ad79a95076d2a87f50d368c28c6f43da04e172
[Pipeline] // withDockerContainer
[Pipeline] }
[Pipeline] // withEnv
[Pipeline] }
[Pipeline] // node
[Pipeline] }
[Pipeline] // stage
[Pipeline] }
Failed in branch CUDA
[Pipeline] // parallel
[Pipeline] }
[Pipeline] // stage
[Pipeline] }
[Pipeline] // timeout
[Pipeline] }
[Pipeline] // withEnv
[Pipeline] End of Pipeline
ERROR: script returned exit code 8
Finished: FAILURE